hbase-dev mailing list archives

Site index · List index
Message view « Date » · « Thread »
Top « Date » · « Thread »
From Apache Jenkins Server <jenk...@builds.apache.org>
Subject Build failed in Jenkins: HBase-TRUNK #2013
Date Fri, 08 Jul 2011 04:40:07 GMT
See <https://builds.apache.org/job/HBase-TRUNK/2013/changes>

Changes:

[tedyu] Fix javadoc for HTable.setAutoFlush()

------------------------------------------
[...truncated 4665 lines...]
5 KB   179 KB   
5 KB   180 KB   
5 KB   180 KB   
5 KB   181 KB   
5 KB   181 KB   
5 KB   182 KB   
5 KB   182 KB   
5 KB   183 KB   
5 KB   183 KB   
5 KB   184 KB   
5 KB   184 KB   
5 KB   185 KB   
5 KB   185 KB   
5 KB   186 KB   
5 KB   186 KB   
5 KB   187 KB   
5 KB   187 KB   
5 KB   188 KB   
5 KB   189 KB   
5 KB   189 KB   
5 KB   190 KB   
5 KB   190 KB   
5 KB   191 KB   
5 KB   191 KB   
5 KB   192 KB   
5 KB   192 KB   
5 KB   193 KB   
5 KB   193 KB   
5 KB   194 KB   
5 KB   194 KB   
5 KB   195 KB   
5 KB   195 KB   
5 KB   195 KB   
5 KB   196 KB   
5 KB   196 KB   
5 KB   197 KB   
5 KB   197 KB   
5 KB   198 KB   
5 KB   198 KB   
5 KB   199 KB   
5 KB   200 KB   
5 KB   200 KB   
5 KB   201 KB   
5 KB   201 KB   
5 KB   202 KB   
5 KB   202 KB   
5 KB   203 KB   
5 KB   203 KB   
5 KB   204 KB   
5 KB   204 KB   
5 KB   205 KB   
5 KB   205 KB   
5 KB   205 KB   
5 KB   206 KB   
5 KB   207 KB   
5 KB   207 KB   
5 KB   208 KB   
5 KB   208 KB   
5 KB   208 KB   
5 KB   209 KB   
5 KB   210 KB   
5 KB   210 KB   
5 KB   211 KB   
5 KB   211 KB   
5 KB   212 KB   
5 KB   212 KB   
5 KB   213 KB   
5 KB   213 KB   
5 KB   214 KB   
5 KB   214 KB   
5 KB   215 KB   
5 KB   216 KB   
5 KB   216 KB   
5 KB   217 KB   
5 KB   217 KB   
5 KB   218 KB   
5 KB   218 KB   
5 KB   219 KB   
5 KB   219 KB   
5 KB   220 KB   
5 KB   221 KB   
5 KB   221 KB   
5 KB   222 KB   
5 KB   222 KB   
5 KB   223 KB   
5 KB   223 KB   
5 KB   224 KB   
5 KB   224 KB   
5 KB   225 KB   
5 KB   226 KB   
5 KB   226 KB   
5 KB   227 KB   
5 KB   227 KB   
5 KB   228 KB   
5 KB   228 KB   
5 KB   229 KB   
5 KB   229 KB   
5 KB   230 KB   
5 KB   230 KB   
5 KB   231 KB   
5 KB   231 KB   
5 KB   232 KB   
5 KB   233 KB   
5 KB   233 KB   
5 KB   234 KB   
5 KB   234 KB   
5 KB   235 KB   
5 KB   235 KB   
5 KB   236 KB   
5 KB   236 KB   
5 KB   237 KB   
5 KB   237 KB   
5 KB   238 KB   
5 KB   238 KB   
5 KB   238 KB   
5 KB   238 KB   
5 KB   239 KB   
5 KB   239 KB   
5 KB   239 KB   
5 KB   240 KB   
5 KB   240 KB   
5 KB   241 KB   
5 KB   241 KB   
5 KB   242 KB   
5 KB   242 KB   
5 KB   242 KB   
5 KB   243 KB   
5 KB   243 KB   
5 KB   244 KB   
5 KB   244 KB   
5 KB   245 KB   
5 KB   245 KB   
5 KB   246 KB   
5 KB   248 KB   
5 KB   249 KB   
5 KB   251 KB   
5 KB   253 KB   
5 KB   255 KB   
5 KB   257 KB   
5 KB   259 KB   
5 KB   261 KB   
5 KB   263 KB   
5 KB   264 KB   
                
Downloaded: http://repo1.maven.org/maven2/org/jamon/jamon-api/2.3.0/jamon-api-2.3.0.jar (5
KB at 6.2 KB/sec)
                
Downloaded: http://repo1.maven.org/maven2/org/jamon/jamon-processor/2.3.4/jamon-processor-2.3.4.jar
(264 KB at 270.1 KB/sec)
[INFO] Translating 4 templates from <https://builds.apache.org/job/HBase-TRUNK/ws/trunk/src/main/jamon>
to <https://builds.apache.org/job/HBase-TRUNK/ws/trunk/target/generated-jamon>
[INFO] 
[INFO] --- maven-remote-resources-plugin:1.1:process (default) @ hbase ---
[INFO] Setting property: classpath.resource.loader.class => 'org.codehaus.plexus.velocity.ContextClassLoaderResourceLoader'.
[INFO] Setting property: velocimacro.messages.on => 'false'.
[INFO] Setting property: resource.loader => 'classpath'.
[INFO] Setting property: resource.manager.logwhenfound => 'false'.
[INFO] 
[INFO] --- maven-resources-plugin:2.4:resources (default-resources) @ hbase ---
[INFO] Using 'UTF-8' encoding to copy filtered resources.
[INFO] Copying 1 resource
[INFO] Copying 6 resources
[INFO] Copying 3 resources
[INFO] 
[INFO] --- maven-antrun-plugin:1.6:run (default) @ hbase ---
[WARNING] Parameter tasks is deprecated, use target instead
[INFO] Executing tasks

main:
    [mkdir] Created dir: <https://builds.apache.org/job/HBase-TRUNK/ws/trunk/target/nativelib>
     [exec] tar: hadoop-snappy-nativelibs.tar: Cannot open: No such file or directory
     [exec] tar: Error is not recoverable: exiting now
     [exec] Result: 2
[INFO] Executed tasks
[INFO] 
[INFO] --- maven-compiler-plugin:2.0.2:compile (default-compile) @ hbase ---
[INFO] Compiling 529 source files to <https://builds.apache.org/job/HBase-TRUNK/ws/trunk/target/classes>
[WARNING] <https://builds.apache.org/job/HBase-TRUNK/ws/trunk/src/main/java/org/apache/hadoop/hbase/util/Bytes.java>:[44,15]
sun.misc.Unsafe is Sun proprietary API and may be removed in a future release

[WARNING] <https://builds.apache.org/job/HBase-TRUNK/ws/trunk/src/main/java/org/apache/hadoop/hbase/util/Bytes.java>:[1037,19]
sun.misc.Unsafe is Sun proprietary API and may be removed in a future release

[WARNING] <https://builds.apache.org/job/HBase-TRUNK/ws/trunk/src/main/java/org/apache/hadoop/hbase/util/Bytes.java>:[1043,21]
sun.misc.Unsafe is Sun proprietary API and may be removed in a future release

[WARNING] <https://builds.apache.org/job/HBase-TRUNK/ws/trunk/src/main/java/org/apache/hadoop/hbase/util/Bytes.java>:[1048,28]
sun.misc.Unsafe is Sun proprietary API and may be removed in a future release

[INFO] 
[INFO] --- maven-resources-plugin:2.4:testResources (default-testResources) @ hbase ---
[INFO] Using 'UTF-8' encoding to copy filtered resources.
[INFO] Copying 4 resources
[INFO] Copying 3 resources
[INFO] 
[INFO] --- maven-compiler-plugin:2.0.2:testCompile (default-testCompile) @ hbase ---
[INFO] Compiling 222 source files to <https://builds.apache.org/job/HBase-TRUNK/ws/trunk/target/test-classes>
[INFO] 
[INFO] --- maven-surefire-plugin:2.4.3:test (default-test) @ hbase ---
[INFO] Surefire report directory: <https://builds.apache.org/job/HBase-TRUNK/ws/trunk/target/surefire-reports>

-------------------------------------------------------
 T E S T S
-------------------------------------------------------
Running org.apache.hadoop.hbase.regionserver.TestColumnSeeking
Tests run: 2, Failures: 0, Errors: 0, Skipped: 0, Time elapsed: 18.392 sec
Running org.apache.hadoop.hbase.master.TestHMasterRPCException
Tests run: 1, Failures: 0, Errors: 0, Skipped: 0, Time elapsed: 0.269 sec
Running org.apache.hadoop.hbase.regionserver.TestMemStoreLAB
Tests run: 3, Failures: 0, Errors: 0, Skipped: 0, Time elapsed: 1.35 sec
Running org.apache.hadoop.hbase.client.TestMultipleTimestamps
Tests run: 8, Failures: 0, Errors: 0, Skipped: 0, Time elapsed: 49.63 sec
Running org.apache.hadoop.hbase.coprocessor.TestRegionObserverInterface
Tests run: 4, Failures: 0, Errors: 0, Skipped: 0, Time elapsed: 33.798 sec
Running org.apache.hadoop.hbase.coprocessor.TestCoprocessorInterface
Tests run: 1, Failures: 0, Errors: 0, Skipped: 0, Time elapsed: 3.243 sec
Running org.apache.hadoop.hbase.TestZooKeeper
Tests run: 7, Failures: 0, Errors: 0, Skipped: 0, Time elapsed: 84.267 sec
Running org.apache.hadoop.hbase.regionserver.wal.TestLogRolling
Tests run: 2, Failures: 0, Errors: 0, Skipped: 0, Time elapsed: 94.404 sec
Running org.apache.hadoop.hbase.io.hfile.TestCachedBlockQueue
Tests run: 2, Failures: 0, Errors: 0, Skipped: 0, Time elapsed: 0.017 sec
Running org.apache.hadoop.hbase.filter.TestPrefixFilter
Tests run: 3, Failures: 0, Errors: 0, Skipped: 0, Time elapsed: 0.018 sec
Running org.apache.hadoop.hbase.io.TestHeapSize
Tests run: 2, Failures: 0, Errors: 0, Skipped: 0, Time elapsed: 0.035 sec
Running org.apache.hadoop.hbase.io.TestImmutableBytesWritable
Tests run: 3, Failures: 0, Errors: 0, Skipped: 0, Time elapsed: 0.017 sec
Running org.apache.hadoop.hbase.rest.model.TestRowModel
Tests run: 2, Failures: 0, Errors: 0, Skipped: 0, Time elapsed: 0.033 sec
Running org.apache.hadoop.hbase.io.hfile.TestHFileSeek
Tests run: 1, Failures: 0, Errors: 0, Skipped: 0, Time elapsed: 5.053 sec
Running org.apache.hadoop.hbase.regionserver.TestStore
Tests run: 11, Failures: 0, Errors: 0, Skipped: 0, Time elapsed: 1.61 sec
Running org.apache.hadoop.hbase.zookeeper.TestHQuorumPeer
Tests run: 3, Failures: 0, Errors: 0, Skipped: 0, Time elapsed: 0.128 sec
Running org.apache.hadoop.hbase.regionserver.TestSplitTransactionOnCluster
killed.
[INFO] ------------------------------------------------------------------------
[INFO] BUILD FAILURE
[INFO] ------------------------------------------------------------------------
[INFO] Total time: 21:22.344s
[INFO] Finished at: Thu Jul 07 21:40:02 PDT 2011
[INFO] Final Memory: 48M/764M
[INFO] ------------------------------------------------------------------------
[ERROR] Failed to execute goal org.apache.maven.plugins:maven-surefire-plugin:2.4.3:test (default-test)
on project hbase: Error while executing forked tests.; nested exception is org.apache.maven.surefire.booter.shade.org.codehaus.plexus.util.cli.CommandLineException:
Error while executing external command, process killed. Process timeout out after 900 seconds
-> [Help 1]
[ERROR] 
[ERROR] To see the full stack trace of the errors, re-run Maven with the -e switch.
[ERROR] Re-run Maven using the -X switch to enable full debug logging.
[ERROR] 
[ERROR] For more information about the errors and possible solutions, please read the following
articles:
[ERROR] [Help 1] http://cwiki.apache.org/confluence/display/MAVEN/MojoExecutionException
[locks-and-latches] Releasing all the locks
[locks-and-latches] All the locks released
Archiving artifacts
Recording test results


Mime
View raw message