hbase-dev mailing list archives

Site index · List index
Message view « Date » · « Thread »
Top « Date » · « Thread »
From Apache Hudson Server <hud...@hudson.apache.org>
Subject Build failed in Hudson: HBase-TRUNK #1724
Date Sat, 29 Jan 2011 01:21:21 GMT
See <https://hudson.apache.org/hudson/job/HBase-TRUNK/1724/changes>

Changes:

[jgray] HBASE-3305  Allow round-robin distribution for table created with multiple regions
(ted yu via jgray)

------------------------------------------
[...truncated 866 lines...]
A         src/main/resources/hbase-webapps/regionserver/index.html
A         src/main/resources/hbase-webapps/master
A         src/main/resources/hbase-webapps/master/zk.jsp
A         src/main/resources/hbase-webapps/master/table.jsp
A         src/main/resources/hbase-webapps/master/master.jsp
A         src/main/resources/hbase-webapps/master/index.html
AU        src/main/resources/hbase-default.xml
A         src/main/resources/org
A         src/main/resources/org/apache
A         src/main/resources/org/apache/hadoop
A         src/main/resources/org/apache/hadoop/hbase
A         src/main/resources/org/apache/hadoop/hbase/thrift
AU        src/main/resources/org/apache/hadoop/hbase/thrift/Hbase.thrift
A         src/main/resources/org/apache/hadoop/hbase/mapreduce
AU        src/main/resources/org/apache/hadoop/hbase/mapreduce/RowCounter_Counters.properties
A         src/main/resources/org/apache/hadoop/hbase/mapred
AU        src/main/resources/org/apache/hadoop/hbase/mapred/RowCounter_Counters.properties
A         src/main/resources/org/apache/hadoop/hbase/rest
A         src/main/resources/org/apache/hadoop/hbase/rest/protobuf
A         src/main/resources/org/apache/hadoop/hbase/rest/protobuf/TableSchemaMessage.proto
A         src/main/resources/org/apache/hadoop/hbase/rest/protobuf/ScannerMessage.proto
A         src/main/resources/org/apache/hadoop/hbase/rest/protobuf/StorageClusterStatusMessage.proto
A         src/main/resources/org/apache/hadoop/hbase/rest/protobuf/CellSetMessage.proto
A         src/main/resources/org/apache/hadoop/hbase/rest/protobuf/ColumnSchemaMessage.proto
A         src/main/resources/org/apache/hadoop/hbase/rest/protobuf/CellMessage.proto
A         src/main/resources/org/apache/hadoop/hbase/rest/protobuf/TableInfoMessage.proto
A         src/main/resources/org/apache/hadoop/hbase/rest/protobuf/TableListMessage.proto
A         src/main/resources/org/apache/hadoop/hbase/rest/protobuf/VersionMessage.proto
A         src/main/resources/org/apache/hadoop/hbase/rest/XMLSchema.xsd
A         src/main/xslt
A         src/main/xslt/configuration_to_docbook_section.xsl
A         src/site
A         src/site/site.xml
A         src/site/site.vm
A         src/site/resources
A         src/site/resources/images
AU        src/site/resources/images/replication_overview.png
AU        src/site/resources/images/asf_logo_wide.png
AU        src/site/resources/images/architecture.gif
AU        src/site/resources/images/hadoop-logo.jpg
AU        src/site/resources/images/hbase_logo_med.gif
AU        src/site/resources/images/favicon.ico
AU        src/site/resources/images/hbase_small.gif
A         src/site/resources/css
A         src/site/resources/css/freebsd_docbook.css
A         src/site/resources/css/site.css
A         src/site/xdoc
A         src/site/xdoc/cygwin.xml
A         src/site/xdoc/acid-semantics.xml
A         src/site/xdoc/metrics.xml
A         src/site/xdoc/index.xml
A         src/site/xdoc/replication.xml
A         src/site/xdoc/old_news.xml
A         src/site/xdoc/bulk-loads.xml
A         src/site/xdoc/pseudo-distributed.xml
A         src/docbkx
A         src/docbkx/book.xml
AU        src/saveVersion.sh
A         src/examples
A         src/examples/thrift
A         src/examples/thrift/DemoClient.java
A         src/examples/thrift/DemoClient.cpp
A         src/examples/thrift/DemoClient.rb
A         src/examples/thrift/DemoClient.php
AU        src/examples/thrift/DemoClient.py
A         src/examples/thrift/README.txt
A         src/examples/thrift/Makefile
A         src/examples/mapreduce
A         src/examples/mapreduce/org
A         src/examples/mapreduce/org/apache
A         src/examples/mapreduce/org/apache/hadoop
A         src/examples/mapreduce/org/apache/hadoop/hbase
A         src/examples/mapreduce/org/apache/hadoop/hbase/mapreduce
A         src/examples/mapreduce/org/apache/hadoop/hbase/mapreduce/SampleUploader.java
A         src/examples/mapreduce/org/apache/hadoop/hbase/mapreduce/IndexBuilder.java
A         src/examples/mapreduce/index-builder-setup.rb
A         src/examples/README.txt
A         bin
AU        bin/hbase-daemons.sh
A         bin/rename_table.rb
AU        bin/hbase
A         bin/copy_table.rb
A         bin/check_meta.rb
AU        bin/start-hbase.sh
A         bin/hirb.rb
A         bin/set_meta_block_caching.rb
A         bin/loadtable.rb
AU        bin/hbase-daemon.sh
A         bin/hbase-config.sh
A         bin/local-regionservers.sh
AU        bin/zookeepers.sh
A         bin/local-master-backup.sh
A         bin/add_table.rb
AU        bin/rolling-restart.sh
AU        bin/regionservers.sh
AU        bin/master-backup.sh
A         bin/replication
A         bin/replication/copy_tables_desc.rb
AU        bin/stop-hbase.sh
A         pom.xml
A         README.txt
 U        .
At revision 1064935
[locks-and-latches] Checking to see if we really have the locks
[locks-and-latches] Have all the locks, build can start
[trunk] $ /home/hudson/tools/maven/apache-maven-2.2.1/bin/mvn clean -Dmaven.test.redirectTestOutputToFile=true
site assembly:assembly
[INFO] Scanning for projects...
[INFO]                                                                         
[INFO] ------------------------------------------------------------------------
[INFO] Building HBase 0.91.0-SNAPSHOT
[INFO] ------------------------------------------------------------------------
[WARNING] The POM for javax.jms:jms:jar:1.1 is invalid, transitive dependencies (if any) will
not be available, enable debug logging for more details
[WARNING] The POM for com.sun.jdmk:jmxtools:jar:1.2.1 is invalid, transitive dependencies
(if any) will not be available, enable debug logging for more details
[WARNING] The POM for com.sun.jmx:jmxri:jar:1.2.1 is invalid, transitive dependencies (if
any) will not be available, enable debug logging for more details
[INFO] 
[INFO] --- maven-clean-plugin:2.4.1:clean (default-clean) @ hbase ---
[INFO] 
[INFO] --- xml-maven-plugin:1.0-beta-3:transform (default) @ hbase ---
[INFO] Transforming file: <https://hudson.apache.org/hudson/job/HBase-TRUNK/ws/trunk/src/main/resources/hbase-default.xml>
[INFO] Transformed 1 file(s).
[INFO] 
[INFO] --- docbkx-maven-plugin:2.0.11:generate-html (default) @ hbase ---
[INFO] Processing input file: book.xml
[INFO] <https://hudson.apache.org/hudson/job/HBase-TRUNK/1724/artifact/trunk/target/site/book.html>
has been generated.
[INFO] 
[INFO] --- maven-site-plugin:2.0.1:site (default-site) @ hbase ---
[INFO] Unable to load parent project from a relative path: 1 problem was encountered while
building the effective model
[FATAL] Non-readable POM <https://hudson.apache.org/hudson/job/HBase-TRUNK/ws/pom.xml>:
<https://hudson.apache.org/hudson/job/HBase-TRUNK/ws/pom.xml> (No such file or directory)
@ 
 for project  at <https://hudson.apache.org/hudson/job/HBase-TRUNK/ws/pom.xml> for project
 at <https://hudson.apache.org/hudson/job/HBase-TRUNK/ws/pom.xml>
[INFO] Parent project loaded from repository.
[INFO] Unable to load parent project from a relative path: 1 problem was encountered while
building the effective model
[FATAL] Non-readable POM <https://hudson.apache.org/hudson/job/HBase-TRUNK/ws/pom.xml>:
<https://hudson.apache.org/hudson/job/HBase-TRUNK/ws/pom.xml> (No such file or directory)
@ 
 for project  at <https://hudson.apache.org/hudson/job/HBase-TRUNK/ws/pom.xml> for project
 at <https://hudson.apache.org/hudson/job/HBase-TRUNK/ws/pom.xml>
[INFO] Parent project loaded from repository.
Downloading: http://people.apache.org/~rawson/repo/org/apache/maven/skins/maven-stylus-skin/maven-metadata.xml
Downloading: http://download.java.net/maven/2/org/apache/maven/skins/maven-stylus-skin/maven-metadata.xml
Downloading: http://repository.jboss.org/nexus/content/groups/public-jboss/org/apache/maven/skins/maven-stylus-skin/maven-metadata.xml
Downloading: http://repository.codehaus.org/org/apache/maven/skins/maven-stylus-skin/maven-metadata.xml

Downloading: http://repo1.maven.org/maven2/org/apache/maven/skins/maven-stylus-skin/maven-metadata.xml

429 B   
        
        
Downloaded: http://repo1.maven.org/maven2/org/apache/maven/skins/maven-stylus-skin/maven-metadata.xml
(429 B at 0.5 KB/sec)
        
[INFO]                                                                         
[INFO] ------------------------------------------------------------------------
[INFO] Building HBase 0.91.0-SNAPSHOT
[INFO] ------------------------------------------------------------------------
[INFO] 
[INFO] >>> maven-assembly-plugin:2.2-beta-5:assembly (default-cli) @ hbase >>>
[INFO] 
[INFO] --- maven-antrun-plugin:1.3:run (generate) @ hbase ---
[INFO] Executing tasks
    [mkdir] Created dir: <https://hudson.apache.org/hudson/job/HBase-TRUNK/ws/trunk/target/hbase-webapps>
     [copy] Copying 4 files to <https://hudson.apache.org/hudson/job/HBase-TRUNK/ws/trunk/target/hbase-webapps>
SLF4J: Failed to load class "org.slf4j.impl.StaticLoggerBinder".
SLF4J: See http://www.slf4j.org/codes.html#StaticLoggerBinder for further details.
2011-01-29 01:00:01.423:INFO::Logging to STDERR via org.mortbay.log.StdErrLog
    [mkdir] Created dir: <https://hudson.apache.org/hudson/job/HBase-TRUNK/ws/trunk/target/hbase-webapps/master/WEB-INF>
    [mkdir] Created dir: <https://hudson.apache.org/hudson/job/HBase-TRUNK/ws/trunk/target/hbase-webapps/regionserver/WEB-INF>
[INFO] Executed tasks
[INFO] 
[INFO] --- build-helper-maven-plugin:1.5:add-source (add-jspc-source) @ hbase ---
[INFO] Source directory: <https://hudson.apache.org/hudson/job/HBase-TRUNK/ws/trunk/target/jspc>
added.
[INFO] 
[INFO] --- build-helper-maven-plugin:1.5:add-source (add-package-info) @ hbase ---
[INFO] Source directory: <https://hudson.apache.org/hudson/job/HBase-TRUNK/ws/trunk/target/generated-sources>
added.
[INFO] 
[INFO] --- maven-remote-resources-plugin:1.1:process (default) @ hbase ---
[INFO] Setting property: classpath.resource.loader.class => 'org.codehaus.plexus.velocity.ContextClassLoaderResourceLoader'.
[INFO] Setting property: velocimacro.messages.on => 'false'.
[INFO] Setting property: resource.loader => 'classpath'.
[INFO] Setting property: resource.manager.logwhenfound => 'false'.
[INFO] 
[INFO] --- maven-resources-plugin:2.4:resources (default-resources) @ hbase ---
[INFO] Using 'UTF-8' encoding to copy filtered resources.
[INFO] Copying 1 resource
[INFO] Copying 6 resources
[INFO] Copying 3 resources
[INFO] 
[INFO] --- maven-compiler-plugin:2.0.2:compile (default-compile) @ hbase ---
[INFO] Compiling 480 source files to <https://hudson.apache.org/hudson/job/HBase-TRUNK/ws/trunk/target/classes>
[INFO] 
[INFO] --- maven-resources-plugin:2.4:testResources (default-testResources) @ hbase ---
[INFO] Using 'UTF-8' encoding to copy filtered resources.
[INFO] Copying 4 resources
[INFO] Copying 3 resources
[INFO] 
[INFO] --- maven-compiler-plugin:2.0.2:testCompile (default-testCompile) @ hbase ---
[INFO] Compiling 193 source files to <https://hudson.apache.org/hudson/job/HBase-TRUNK/ws/trunk/target/test-classes>
[INFO] 
[INFO] --- maven-surefire-plugin:2.4.3:test (default-test) @ hbase ---
[INFO] Surefire report directory: <https://hudson.apache.org/hudson/job/HBase-TRUNK/ws/trunk/target/surefire-reports>

-------------------------------------------------------
 T E S T S
-------------------------------------------------------
Running org.apache.hadoop.hbase.master.TestHMasterRPCException
Tests run: 1, Failures: 0, Errors: 0, Skipped: 0, Time elapsed: 0.497 sec
Running org.apache.hadoop.hbase.regionserver.TestColumnSeeking
Tests run: 2, Failures: 0, Errors: 0, Skipped: 0, Time elapsed: 8.458 sec
Running org.apache.hadoop.hbase.client.TestMultipleTimestamps
Tests run: 8, Failures: 0, Errors: 0, Skipped: 0, Time elapsed: 92.179 sec
Running org.apache.hadoop.hbase.coprocessor.TestRegionObserverInterface
Tests run: 2, Failures: 0, Errors: 0, Skipped: 0, Time elapsed: 31.491 sec
Running org.apache.hadoop.hbase.coprocessor.TestCoprocessorInterface
Tests run: 1, Failures: 0, Errors: 0, Skipped: 0, Time elapsed: 1.66 sec
Running org.apache.hadoop.hbase.TestZooKeeper
Tests run: 5, Failures: 0, Errors: 0, Skipped: 0, Time elapsed: 67.68 sec
Running org.apache.hadoop.hbase.regionserver.wal.TestLogRolling
Tests run: 2, Failures: 0, Errors: 0, Skipped: 0, Time elapsed: 145.344 sec
Running org.apache.hadoop.hbase.io.hfile.TestCachedBlockQueue
Tests run: 2, Failures: 0, Errors: 0, Skipped: 0, Time elapsed: 0.018 sec
Running org.apache.hadoop.hbase.filter.TestPrefixFilter
Tests run: 3, Failures: 0, Errors: 0, Skipped: 0, Time elapsed: 0.018 sec
Running org.apache.hadoop.hbase.io.TestImmutableBytesWritable
Tests run: 3, Failures: 0, Errors: 0, Skipped: 0, Time elapsed: 0.017 sec
Running org.apache.hadoop.hbase.io.TestHeapSize
Tests run: 2, Failures: 0, Errors: 0, Skipped: 0, Time elapsed: 0.033 sec
Running org.apache.hadoop.hbase.rest.model.TestRowModel
Tests run: 2, Failures: 0, Errors: 0, Skipped: 0, Time elapsed: 0.034 sec
Running org.apache.hadoop.hbase.io.hfile.TestHFileSeek
Tests run: 1, Failures: 0, Errors: 0, Skipped: 0, Time elapsed: 4.82 sec
Running org.apache.hadoop.hbase.regionserver.TestStore
Tests run: 9, Failures: 0, Errors: 0, Skipped: 0, Time elapsed: 1.301 sec
Running org.apache.hadoop.hbase.zookeeper.TestHQuorumPeer
Tests run: 3, Failures: 0, Errors: 0, Skipped: 0, Time elapsed: 0.356 sec
Running org.apache.hadoop.hbase.regionserver.TestSplitTransactionOnCluster
killed.
[INFO] ------------------------------------------------------------------------
[INFO] BUILD FAILURE
[INFO] ------------------------------------------------------------------------
[INFO] Total time: 21:41.689s
[INFO] Finished at: Sat Jan 29 01:21:30 UTC 2011
[INFO] Final Memory: 40M/425M
[INFO] ------------------------------------------------------------------------
[ERROR] Failed to execute goal org.apache.maven.plugins:maven-surefire-plugin:2.4.3:test (default-test)
on project hbase: Error while executing forked tests.; nested exception is org.apache.maven.surefire.booter.shade.org.codehaus.plexus.util.cli.CommandLineException:
Error while executing external command, process killed. Process timeout out after 900 seconds
-> [Help 1]
[ERROR] 
[ERROR] To see the full stack trace of the errors, re-run Maven with the -e switch.
[ERROR] Re-run Maven using the -X switch to enable full debug logging.
[ERROR] 
[ERROR] For more information about the errors and possible solutions, please read the following
articles:
[ERROR] [Help 1] http://cwiki.apache.org/confluence/display/MAVEN/MojoExecutionException
[locks-and-latches] Releasing all the locks
[locks-and-latches] All the locks released
Archiving artifacts
Recording test results


Mime
View raw message