hbase-dev mailing list archives

Site index · List index
Message view « Date » · « Thread »
Top « Date » · « Thread »
From Jean-Daniel Cryans <jdcry...@apache.org>
Subject Re: Build failed in Hudson: HBase-TRUNK #1650
Date Sat, 13 Nov 2010 00:20:40 GMT
I found the change that makes everything blow up. I checked out an
older revision and did this:

-    <hadoop.version>0.20.3-append-r964955-1240</hadoop.version>
+    <hadoop.version>0.20.3-append-r1034499-895</hadoop.version>

And the tests fail.

J-D

On Fri, Nov 12, 2010 at 3:24 PM, Apache Hudson Server
<hudson@hudson.apache.org> wrote:
> See <https://hudson.apache.org/hudson/job/HBase-TRUNK/1650/changes>
>
> Changes:
>
> [stack] Added notes on building
>
> [stack] Upped version number to 0.91
>
> [stack] Rolled back zk... its failing tests... to 3.2.1
>
> [stack] Have assembly produce one tgz with source that is buildable rather than a bin
and src.
>
> [stack] Added faq section on building hbase
>
> [stack] HBASE-3230 Refresh our hadoop jar and update zookeeper to just-released 3.3.
>
> ------------------------------------------
> [...truncated 4962 lines...]
> Tests run: 1, Failures: 0, Errors: 0, Skipped: 0, Time elapsed: 0.016 sec
> Running org.apache.hadoop.hbase.rest.TestStatusResource
> Tests run: 2, Failures: 0, Errors: 0, Skipped: 0, Time elapsed: 45.693 sec
> Running org.apache.hadoop.hbase.executor.TestExecutorService
> Tests run: 1, Failures: 0, Errors: 0, Skipped: 0, Time elapsed: 2.049 sec
> Running org.apache.hadoop.hbase.client.TestFromClientSide
> Tests run: 40, Failures: 0, Errors: 0, Skipped: 3, Time elapsed: 325.401 sec
> Running org.apache.hadoop.hbase.replication.TestReplication
> Tests run: 1, Failures: 0, Errors: 1, Skipped: 0, Time elapsed: 56.966 sec <<<
FAILURE!
> Running org.apache.hadoop.hbase.regionserver.TestCompaction
> Tests run: 9, Failures: 0, Errors: 0, Skipped: 0, Time elapsed: 154.844 sec
> Running org.apache.hadoop.hbase.filter.TestSingleColumnValueFilter
> Tests run: 2, Failures: 0, Errors: 0, Skipped: 0, Time elapsed: 0.035 sec
> Running org.apache.hadoop.hbase.mapreduce.TestTimeRangeMapRed
> Tests run: 1, Failures: 0, Errors: 0, Skipped: 0, Time elapsed: 29.636 sec
> Running org.apache.hadoop.hbase.zookeeper.TestZooKeeperMainServerArg
> Tests run: 1, Failures: 0, Errors: 0, Skipped: 0, Time elapsed: 0.031 sec
> Running org.apache.hadoop.hbase.mapreduce.TestSimpleTotalOrderPartitioner
> Tests run: 1, Failures: 0, Errors: 0, Skipped: 0, Time elapsed: 0.102 sec
> Running org.apache.hadoop.hbase.master.TestClockSkewDetection
> Tests run: 1, Failures: 0, Errors: 0, Skipped: 0, Time elapsed: 0.05 sec
> Running org.apache.hadoop.hbase.mapreduce.TestHFileOutputFormat
> Tests run: 5, Failures: 0, Errors: 0, Skipped: 0, Time elapsed: 192.712 sec
> Running org.apache.hadoop.hbase.regionserver.TestFSErrorsExposed
> Tests run: 3, Failures: 0, Errors: 0, Skipped: 0, Time elapsed: 53.571 sec
> Running org.apache.hadoop.hbase.client.replication.TestReplicationAdmin
> Tests run: 1, Failures: 0, Errors: 0, Skipped: 0, Time elapsed: 0.405 sec
> Running org.apache.hadoop.hbase.regionserver.TestScanDeleteTracker
> Tests run: 6, Failures: 0, Errors: 0, Skipped: 0, Time elapsed: 0.184 sec
> Running org.apache.hadoop.hbase.client.TestMetaScanner
> Tests run: 1, Failures: 0, Errors: 0, Skipped: 0, Time elapsed: 52.963 sec
> Running org.apache.hadoop.hbase.metrics.TestMetricsMBeanBase
> Tests run: 2, Failures: 0, Errors: 0, Skipped: 0, Time elapsed: 0.038 sec
> Running org.apache.hadoop.hbase.TestRegionRebalancing
> Tests run: 1, Failures: 0, Errors: 0, Skipped: 0, Time elapsed: 85.306 sec
> Running org.apache.hadoop.hbase.filter.TestSingleColumnValueExcludeFilter
> Tests run: 1, Failures: 0, Errors: 0, Skipped: 0, Time elapsed: 0.017 sec
> Running org.apache.hadoop.hbase.filter.TestInclusiveStopFilter
> Tests run: 2, Failures: 0, Errors: 0, Skipped: 0, Time elapsed: 0.019 sec
> Running org.apache.hadoop.hbase.rest.TestTableResource
> Tests run: 8, Failures: 0, Errors: 0, Skipped: 0, Time elapsed: 59.397 sec
> Running org.apache.hadoop.hbase.TestHBaseTestingUtility
> Tests run: 5, Failures: 0, Errors: 2, Skipped: 0, Time elapsed: 58.976 sec <<<
FAILURE!
> Running org.apache.hadoop.hbase.mapreduce.TestLoadIncrementalHFiles
> Tests run: 3, Failures: 0, Errors: 0, Skipped: 0, Time elapsed: 39.311 sec
> Running org.apache.hadoop.hbase.rest.TestSchemaResource
> Tests run: 2, Failures: 0, Errors: 0, Skipped: 0, Time elapsed: 63.942 sec
> Running org.apache.hadoop.hbase.regionserver.wal.TestWALReplay
> Tests run: 4, Failures: 0, Errors: 0, Skipped: 0, Time elapsed: 25.326 sec
> Running org.apache.hadoop.hbase.regionserver.TestKeyValueScanFixture
> Tests run: 1, Failures: 0, Errors: 0, Skipped: 0, Time elapsed: 0.016 sec
> Running org.apache.hadoop.hbase.rest.model.TestTableListModel
> Tests run: 3, Failures: 0, Errors: 0, Skipped: 0, Time elapsed: 0.157 sec
> Running org.apache.hadoop.hbase.rest.model.TestColumnSchemaModel
> Tests run: 2, Failures: 0, Errors: 0, Skipped: 0, Time elapsed: 0.052 sec
> Running org.apache.hadoop.hbase.regionserver.TestStoreFile
> Tests run: 7, Failures: 0, Errors: 0, Skipped: 0, Time elapsed: 35.775 sec
> Running org.apache.hadoop.hbase.zookeeper.TestZooKeeperNodeTracker
> Tests run: 2, Failures: 0, Errors: 0, Skipped: 0, Time elapsed: 0.474 sec
> Running org.apache.hadoop.hbase.rest.model.TestScannerModel
> Tests run: 3, Failures: 0, Errors: 0, Skipped: 0, Time elapsed: 0.141 sec
> Running org.apache.hadoop.hbase.regionserver.wal.TestHLogMethods
> Tests run: 1, Failures: 0, Errors: 0, Skipped: 0, Time elapsed: 0.186 sec
> Running org.apache.hadoop.hbase.rest.TestVersionResource
> Tests run: 7, Failures: 0, Errors: 0, Skipped: 0, Time elapsed: 45.148 sec
> Running org.apache.hadoop.hbase.filter.TestFilter
> Tests run: 18, Failures: 0, Errors: 0, Skipped: 0, Time elapsed: 2.962 sec
> Running org.apache.hadoop.hbase.regionserver.TestWideScanner
> Tests run: 1, Failures: 0, Errors: 0, Skipped: 0, Time elapsed: 10.289 sec
> Running org.apache.hadoop.hbase.regionserver.TestSplitTransaction
> Tests run: 5, Failures: 0, Errors: 0, Skipped: 0, Time elapsed: 4.105 sec
> Running org.apache.hadoop.hbase.replication.regionserver.TestReplicationSink
> Tests run: 5, Failures: 0, Errors: 0, Skipped: 0, Time elapsed: 37.802 sec
> Running org.apache.hadoop.hbase.regionserver.TestGetClosestAtOrBefore
> Tests run: 3, Failures: 0, Errors: 0, Skipped: 0, Time elapsed: 27.009 sec
> Running org.apache.hadoop.hbase.util.TestMergeTable
> Tests run: 1, Failures: 0, Errors: 0, Skipped: 0, Time elapsed: 82.751 sec
> Running org.apache.hadoop.hbase.regionserver.TestReadWriteConsistencyControl
> Tests run: 1, Failures: 0, Errors: 0, Skipped: 0, Time elapsed: 10.026 sec
> Running org.apache.hadoop.hbase.rest.model.TestVersionModel
> Tests run: 3, Failures: 0, Errors: 0, Skipped: 0, Time elapsed: 0.142 sec
> Running org.apache.hadoop.hbase.rest.model.TestCellSetModel
> Tests run: 3, Failures: 0, Errors: 0, Skipped: 0, Time elapsed: 0.16 sec
> Running org.apache.hadoop.hbase.rest.client.TestRemoteTable
> Tests run: 3, Failures: 0, Errors: 0, Skipped: 0, Time elapsed: 41.924 sec
> Running org.apache.hadoop.hbase.rest.model.TestStorageClusterStatusModel
> Tests run: 3, Failures: 0, Errors: 0, Skipped: 0, Time elapsed: 0.144 sec
> Running org.apache.hadoop.hbase.avro.TestAvroServer
> Tests run: 3, Failures: 0, Errors: 0, Skipped: 0, Time elapsed: 65.442 sec
> Running org.apache.hadoop.hbase.TestFullLogReconstruction
> Tests run: 1, Failures: 0, Errors: 0, Skipped: 0, Time elapsed: 109.806 sec
> Running org.apache.hadoop.hbase.TestSerialization
> Tests run: 19, Failures: 0, Errors: 0, Skipped: 0, Time elapsed: 0.066 sec
> Running org.apache.hadoop.hbase.regionserver.TestKeyValueHeap
> Tests run: 3, Failures: 0, Errors: 0, Skipped: 0, Time elapsed: 0.133 sec
> Running org.apache.hadoop.hbase.regionserver.TestStoreScanner
> Tests run: 14, Failures: 0, Errors: 0, Skipped: 0, Time elapsed: 0.034 sec
> Running org.apache.hadoop.hbase.TestHMsg
> Tests run: 2, Failures: 0, Errors: 0, Skipped: 0, Time elapsed: 0.023 sec
> Running org.apache.hadoop.hbase.io.hfile.TestReseekTo
> Tests run: 1, Failures: 0, Errors: 0, Skipped: 0, Time elapsed: 0.221 sec
> Running org.apache.hadoop.hbase.regionserver.TestHRegionInfo
> Tests run: 2, Failures: 0, Errors: 0, Skipped: 0, Time elapsed: 0.018 sec
> Running org.apache.hadoop.hbase.util.TestIncrementingEnvironmentEdge
> Tests run: 1, Failures: 0, Errors: 0, Skipped: 0, Time elapsed: 0.017 sec
> Running org.apache.hadoop.hbase.util.TestKeying
> Tests run: 1, Failures: 0, Errors: 0, Skipped: 0, Time elapsed: 0.016 sec
> Running org.apache.hadoop.hbase.regionserver.TestScanner
> Tests run: 6, Failures: 0, Errors: 0, Skipped: 0, Time elapsed: 65.133 sec
> Running org.apache.hadoop.hbase.util.TestHBaseFsck
> Tests run: 1, Failures: 0, Errors: 0, Skipped: 0, Time elapsed: 22.343 sec
> Running org.apache.hadoop.hbase.master.TestRestartCluster
> Tests run: 2, Failures: 0, Errors: 0, Skipped: 0, Time elapsed: 83.336 sec
> Running org.apache.hadoop.hbase.client.TestShell
> Tests run: 1, Failures: 0, Errors: 0, Skipped: 0, Time elapsed: 308.736 sec
> Running org.apache.hadoop.hbase.rest.model.TestTableInfoModel
> Tests run: 3, Failures: 0, Errors: 0, Skipped: 0, Time elapsed: 0.147 sec
> Running org.apache.hadoop.hbase.TestInfoServers
> Tests run: 1, Failures: 0, Errors: 0, Skipped: 0, Time elapsed: 21.071 sec
> Running org.apache.hadoop.hbase.master.TestLogsCleaner
> Tests run: 1, Failures: 0, Errors: 0, Skipped: 0, Time elapsed: 1.053 sec
> Running org.apache.hadoop.hbase.regionserver.TestMasterAddressManager
> Tests run: 1, Failures: 0, Errors: 0, Skipped: 0, Time elapsed: 0.405 sec
> Running org.apache.hadoop.hbase.regionserver.TestQueryMatcher
> Tests run: 4, Failures: 0, Errors: 0, Skipped: 0, Time elapsed: 0.149 sec
> Running org.apache.hadoop.hbase.zookeeper.TestZKTable
> Tests run: 1, Failures: 0, Errors: 0, Skipped: 0, Time elapsed: 0.354 sec
> Running org.apache.hadoop.hbase.client.TestAdmin
> Tests run: 16, Failures: 0, Errors: 0, Skipped: 0, Time elapsed: 506.428 sec
> Running org.apache.hadoop.hbase.regionserver.TestPriorityCompactionQueue
> Tests run: 1, Failures: 0, Errors: 0, Skipped: 0, Time elapsed: 1.075 sec
> Running org.apache.hadoop.hbase.util.TestMergeTool
> Tests run: 1, Failures: 0, Errors: 0, Skipped: 0, Time elapsed: 30.842 sec
> Running org.apache.hadoop.hbase.TestAcidGuarantees
> Tests run: 3, Failures: 0, Errors: 0, Skipped: 3, Time elapsed: 0.015 sec
> Running org.apache.hadoop.hbase.util.TestBase64
> Tests run: 1, Failures: 0, Errors: 0, Skipped: 0, Time elapsed: 0.018 sec
> Running org.apache.hadoop.hbase.regionserver.TestMemStore
> Tests run: 20, Failures: 0, Errors: 0, Skipped: 0, Time elapsed: 0.467 sec
> Running org.apache.hadoop.hbase.rest.TestScannerResource
> Tests run: 5, Failures: 0, Errors: 0, Skipped: 0, Time elapsed: 68.975 sec
> Running org.apache.hadoop.hbase.io.hfile.TestLruBlockCache
> Tests run: 7, Failures: 0, Errors: 0, Skipped: 0, Time elapsed: 1.071 sec
> Running org.apache.hadoop.hbase.master.TestDeadServer
> Tests run: 1, Failures: 0, Errors: 0, Skipped: 0, Time elapsed: 0.018 sec
> Running org.apache.hadoop.hbase.mapreduce.TestTableMapReduce
> Tests run: 2, Failures: 0, Errors: 0, Skipped: 0, Time elapsed: 119.623 sec
> Running org.apache.hadoop.hbase.TestKeyValue
> Tests run: 9, Failures: 0, Errors: 0, Skipped: 0, Time elapsed: 0.028 sec
> Running org.apache.hadoop.hbase.client.TestMultiParallel
> Tests run: 9, Failures: 0, Errors: 0, Skipped: 0, Time elapsed: 70.252 sec
> Running org.apache.hadoop.hbase.master.TestMaster
> Tests run: 1, Failures: 0, Errors: 0, Skipped: 0, Time elapsed: 85.941 sec
> Running org.apache.hadoop.hbase.master.TestRollingRestart
> Tests run: 1, Failures: 0, Errors: 0, Skipped: 0, Time elapsed: 79.907 sec
> Running org.apache.hadoop.hbase.client.TestResult
> Tests run: 2, Failures: 0, Errors: 0, Skipped: 0, Time elapsed: 0.039 sec
> Running org.apache.hadoop.hbase.client.TestHTablePool
> Tests run: 5, Failures: 0, Errors: 0, Skipped: 0, Time elapsed: 39.966 sec
> Running org.apache.hadoop.hbase.rest.model.TestTableSchemaModel
> Tests run: 3, Failures: 0, Errors: 0, Skipped: 0, Time elapsed: 0.16 sec
> Running org.apache.hadoop.hbase.util.TestByteBloomFilter
> Tests run: 3, Failures: 0, Errors: 0, Skipped: 0, Time elapsed: 1.71 sec
> Running org.apache.hadoop.hbase.filter.TestFilterList
> Tests run: 4, Failures: 0, Errors: 0, Skipped: 0, Time elapsed: 0.038 sec
> Running org.apache.hadoop.hbase.mapreduce.TestTableInputFormatScan
> Tests run: 11, Failures: 0, Errors: 0, Skipped: 0, Time elapsed: 346.894 sec
> Running org.apache.hadoop.hbase.regionserver.TestHRegion
> Tests run: 51, Failures: 0, Errors: 0, Skipped: 0, Time elapsed: 33.608 sec
> Running org.apache.hadoop.hbase.master.TestMasterFailover
> Tests run: 3, Failures: 0, Errors: 0, Skipped: 0, Time elapsed: 119.941 sec
> Running org.apache.hadoop.hbase.rest.model.TestTableRegionModel
> Tests run: 4, Failures: 0, Errors: 0, Skipped: 0, Time elapsed: 0.033 sec
> Running org.apache.hadoop.hbase.client.TestTimestampsFilter
> Tests run: 2, Failures: 0, Errors: 0, Skipped: 0, Time elapsed: 69.262 sec
> Running org.apache.hadoop.hbase.master.TestLoadBalancer
> Tests run: 4, Failures: 0, Errors: 0, Skipped: 0, Time elapsed: 0.594 sec
> Running org.apache.hadoop.hbase.util.TestRootPath
> Tests run: 1, Failures: 0, Errors: 0, Skipped: 0, Time elapsed: 0.022 sec
> Running org.apache.hadoop.hbase.client.TestScannerTimeout
> Tests run: 2, Failures: 0, Errors: 0, Skipped: 0, Time elapsed: 74.112 sec
> Running org.apache.hadoop.hbase.mapred.TestTableMapReduce
> Tests run: 1, Failures: 0, Errors: 0, Skipped: 0, Time elapsed: 52.479 sec
> Running org.apache.hadoop.hbase.regionserver.wal.TestWALObserver
> Tests run: 1, Failures: 0, Errors: 0, Skipped: 0, Time elapsed: 0.503 sec
> Running org.apache.hadoop.hbase.master.TestActiveMasterManager
> Tests run: 2, Failures: 0, Errors: 0, Skipped: 0, Time elapsed: 0.595 sec
> Running org.apache.hadoop.hbase.replication.regionserver.TestReplicationSourceManager
> Tests run: 1, Failures: 0, Errors: 0, Skipped: 0, Time elapsed: 0.88 sec
> Running org.apache.hadoop.hbase.util.TestBytes
> Tests run: 10, Failures: 0, Errors: 0, Skipped: 0, Time elapsed: 0.023 sec
> Running org.apache.hadoop.hbase.util.TestCompressionTest
> Tests run: 1, Failures: 0, Errors: 0, Skipped: 0, Time elapsed: 0.035 sec
> Running org.apache.hadoop.hbase.client.TestGetRowVersions
> Tests run: 1, Failures: 0, Errors: 0, Skipped: 0, Time elapsed: 44.645 sec
> Running org.apache.hadoop.hbase.filter.TestDependentColumnFilter
> Tests run: 2, Failures: 0, Errors: 0, Skipped: 0, Time elapsed: 0.366 sec
> Running org.apache.hadoop.hbase.rest.model.TestCellModel
> Tests run: 3, Failures: 0, Errors: 0, Skipped: 0, Time elapsed: 0.151 sec
> Running org.apache.hadoop.hbase.master.TestCatalogJanitor
> Tests run: 2, Failures: 0, Errors: 0, Skipped: 0, Time elapsed: 0.525 sec
> Running org.apache.hadoop.hbase.catalog.TestCatalogTracker
> Tests run: 8, Failures: 0, Errors: 0, Skipped: 0, Time elapsed: 3.727 sec
> Running org.apache.hadoop.hbase.replication.TestReplicationSource
> Tests run: 1, Failures: 0, Errors: 0, Skipped: 0, Time elapsed: 6.346 sec
> Running org.apache.hadoop.hbase.rest.TestRowResource
> Tests run: 10, Failures: 0, Errors: 0, Skipped: 0, Time elapsed: 35.371 sec
> Running org.apache.hadoop.hbase.io.hfile.TestHFile
> Tests run: 7, Failures: 0, Errors: 0, Skipped: 0, Time elapsed: 0.399 sec
> Running org.apache.hadoop.hbase.catalog.TestMetaReaderEditor
> Tests run: 3, Failures: 0, Errors: 0, Skipped: 0, Time elapsed: 36.065 sec
> Running org.apache.hadoop.hbase.mapreduce.TestImportTsv
> Tests run: 6, Failures: 0, Errors: 0, Skipped: 0, Time elapsed: 0.044 sec
> Running org.apache.hadoop.hbase.rest.client.TestRemoteAdmin
> Tests run: 2, Failures: 0, Errors: 0, Skipped: 0, Time elapsed: 38.013 sec
> Running org.apache.hadoop.hbase.regionserver.wal.TestHLog
> Tests run: 8, Failures: 0, Errors: 0, Skipped: 0, Time elapsed: 67.998 sec
> Running org.apache.hadoop.hbase.client.TestTimestamp
> Tests run: 1, Failures: 0, Errors: 0, Skipped: 0, Time elapsed: 28.816 sec
> Running org.apache.hadoop.hbase.TestScanMultipleVersions
> Tests run: 1, Failures: 0, Errors: 0, Skipped: 0, Time elapsed: 26.027 sec
> Running org.apache.hadoop.hbase.rest.model.TestStorageClusterVersionModel
> Tests run: 2, Failures: 0, Errors: 0, Skipped: 0, Time elapsed: 0.031 sec
> Running org.apache.hadoop.hbase.client.TestHCM
> Tests run: 2, Failures: 0, Errors: 0, Skipped: 0, Time elapsed: 39.102 sec
>
> Results :
>
> Tests in error:
>
> Tests run: 596, Failures: 0, Errors: 3, Skipped: 9
>
> [INFO] ------------------------------------------------------------------------
> [ERROR] BUILD FAILURE
> [INFO] ------------------------------------------------------------------------
> [INFO] There are test failures.
>
> Please refer to <https://hudson.apache.org/hudson/job/HBase-TRUNK/ws/trunk/target/surefire-reports>
for the individual test results.
> [INFO] ------------------------------------------------------------------------
> [INFO] For more information, run Maven with the -e switch
> [INFO] ------------------------------------------------------------------------
> [INFO] Total time: 87 minutes 59 seconds
> [INFO] Finished at: Fri Nov 12 23:24:11 UTC 2010
> [INFO] Final Memory: 90M/756M
> [INFO] ------------------------------------------------------------------------
> [locks-and-latches] Releasing all the locks
> [locks-and-latches] All the locks released
> Archiving artifacts
> Recording test results
>
>

Mime
View raw message