hbase-dev mailing list archives

Site index · List index
Message view « Date » · « Thread »
Top « Date » · « Thread »
From Apache Hudson Server <hud...@hudson.apache.org>
Subject Build failed in Hudson: HBase-TRUNK #1504
Date Mon, 04 Oct 2010 20:34:43 GMT
See <https://hudson.apache.org/hudson/job/HBase-TRUNK/1504/changes>

Changes:

[stack] HBASE-3043 'hbase-daemon.sh stop regionserver' should kill compactions that are in
progress

[stack] HBASE-2917 Reseek directly to next row

[stack] HBASE-3043 'hbase-daemon.sh stop regionserver' should kill compactions that are in
progress

------------------------------------------
[...truncated 1010 lines...]
2010-10-04 18:34:56,026 WARN  [main] hbase.HBaseConfiguration(44): instantiating HBaseConfiguration()
is deprecated. Please use HBaseConfiguration#create() to construct a plain Configuration
2010-10-04 18:34:56,027 WARN  [main] hbase.HBaseConfiguration(44): instantiating HBaseConfiguration()
is deprecated. Please use HBaseConfiguration#create() to construct a plain Configuration
2010-10-04 18:34:56,027 WARN  [main] hbase.HBaseConfiguration(44): instantiating HBaseConfiguration()
is deprecated. Please use HBaseConfiguration#create() to construct a plain Configuration
2010-10-04 18:34:56,027 WARN  [main] hbase.HBaseConfiguration(44): instantiating HBaseConfiguration()
is deprecated. Please use HBaseConfiguration#create() to construct a plain Configuration
2010-10-04 18:34:56,028 WARN  [main] hbase.HBaseConfiguration(44): instantiating HBaseConfiguration()
is deprecated. Please use HBaseConfiguration#create() to construct a plain Configuration
2010-10-04 18:34:56,028 WARN  [main] hbase.HBaseConfiguration(44): instantiating HBaseConfiguration()
is deprecated. Please use HBaseConfiguration#create() to construct a plain Configuration
2010-10-04 18:34:56,028 WARN  [main] hbase.HBaseConfiguration(44): instantiating HBaseConfiguration()
is deprecated. Please use HBaseConfiguration#create() to construct a plain Configuration
2010-10-04 18:34:56,029 WARN  [main] hbase.HBaseConfiguration(44): instantiating HBaseConfiguration()
is deprecated. Please use HBaseConfiguration#create() to construct a plain Configuration
2010-10-04 18:34:56,029 WARN  [main] hbase.HBaseConfiguration(44): instantiating HBaseConfiguration()
is deprecated. Please use HBaseConfiguration#create() to construct a plain Configuration
2010-10-04 18:34:56,029 WARN  [main] hbase.HBaseConfiguration(44): instantiating HBaseConfiguration()
is deprecated. Please use HBaseConfiguration#create() to construct a plain Configuration
2010-10-04 18:34:56,030 WARN  [main] hbase.HBaseConfiguration(44): instantiating HBaseConfiguration()
is deprecated. Please use HBaseConfiguration#create() to construct a plain Configuration
2010-10-04 18:34:56,030 WARN  [main] hbase.HBaseConfiguration(44): instantiating HBaseConfiguration()
is deprecated. Please use HBaseConfiguration#create() to construct a plain Configuration
2010-10-04 18:34:56,030 WARN  [main] hbase.HBaseConfiguration(44): instantiating HBaseConfiguration()
is deprecated. Please use HBaseConfiguration#create() to construct a plain Configuration
2010-10-04 18:34:56,031 WARN  [main] hbase.HBaseConfiguration(44): instantiating HBaseConfiguration()
is deprecated. Please use HBaseConfiguration#create() to construct a plain Configuration
2010-10-04 18:34:56,031 WARN  [main] hbase.HBaseConfiguration(44): instantiating HBaseConfiguration()
is deprecated. Please use HBaseConfiguration#create() to construct a plain Configuration
2010-10-04 18:34:56,031 WARN  [main] hbase.HBaseConfiguration(44): instantiating HBaseConfiguration()
is deprecated. Please use HBaseConfiguration#create() to construct a plain Configuration
2010-10-04 18:34:56,031 WARN  [main] hbase.HBaseConfiguration(44): instantiating HBaseConfiguration()
is deprecated. Please use HBaseConfiguration#create() to construct a plain Configuration
2010-10-04 18:34:56,032 WARN  [main] hbase.HBaseConfiguration(44): instantiating HBaseConfiguration()
is deprecated. Please use HBaseConfiguration#create() to construct a plain Configuration
2010-10-04 18:34:56,032 WARN  [main] hbase.HBaseConfiguration(44): instantiating HBaseConfiguration()
is deprecated. Please use HBaseConfiguration#create() to construct a plain Configuration
2010-10-04 18:34:56,032 WARN  [main] hbase.HBaseConfiguration(44): instantiating HBaseConfiguration()
is deprecated. Please use HBaseConfiguration#create() to construct a plain Configuration
2010-10-04 18:34:56,032 WARN  [main] hbase.HBaseConfiguration(44): instantiating HBaseConfiguration()
is deprecated. Please use HBaseConfiguration#create() to construct a plain Configuration
2010-10-04 18:34:56,033 WARN  [main] hbase.HBaseConfiguration(44): instantiating HBaseConfiguration()
is deprecated. Please use HBaseConfiguration#create() to construct a plain Configuration
2010-10-04 18:34:56,033 WARN  [main] hbase.HBaseConfiguration(44): instantiating HBaseConfiguration()
is deprecated. Please use HBaseConfiguration#create() to construct a plain Configuration
2010-10-04 18:34:56,033 WARN  [main] hbase.HBaseConfiguration(44): instantiating HBaseConfiguration()
is deprecated. Please use HBaseConfiguration#create() to construct a plain Configuration
2010-10-04 18:34:56,034 WARN  [main] hbase.HBaseConfiguration(44): instantiating HBaseConfiguration()
is deprecated. Please use HBaseConfiguration#create() to construct a plain Configuration
2010-10-04 18:34:56,034 WARN  [main] hbase.HBaseConfiguration(44): instantiating HBaseConfiguration()
is deprecated. Please use HBaseConfiguration#create() to construct a plain Configuration
2010-10-04 18:34:56,034 WARN  [main] hbase.HBaseConfiguration(44): instantiating HBaseConfiguration()
is deprecated. Please use HBaseConfiguration#create() to construct a plain Configuration
2010-10-04 18:34:56,034 WARN  [main] hbase.HBaseConfiguration(44): instantiating HBaseConfiguration()
is deprecated. Please use HBaseConfiguration#create() to construct a plain Configuration
2010-10-04 18:34:56,035 WARN  [main] hbase.HBaseConfiguration(44): instantiating HBaseConfiguration()
is deprecated. Please use HBaseConfiguration#create() to construct a plain Configuration
2010-10-04 18:34:56,035 WARN  [main] hbase.HBaseConfiguration(44): instantiating HBaseConfiguration()
is deprecated. Please use HBaseConfiguration#create() to construct a plain Configuration
2010-10-04 18:34:56,035 WARN  [main] hbase.HBaseConfiguration(44): instantiating HBaseConfiguration()
is deprecated. Please use HBaseConfiguration#create() to construct a plain Configuration
2010-10-04 18:34:56,036 WARN  [main] hbase.HBaseConfiguration(44): instantiating HBaseConfiguration()
is deprecated. Please use HBaseConfiguration#create() to construct a plain Configuration
2010-10-04 18:34:56,036 WARN  [main] hbase.HBaseConfiguration(44): instantiating HBaseConfiguration()
is deprecated. Please use HBaseConfiguration#create() to construct a plain Configuration
2010-10-04 18:34:56,036 WARN  [main] hbase.HBaseConfiguration(44): instantiating HBaseConfiguration()
is deprecated. Please use HBaseConfiguration#create() to construct a plain Configuration
2010-10-04 18:34:56,036 WARN  [main] hbase.HBaseConfiguration(44): instantiating HBaseConfiguration()
is deprecated. Please use HBaseConfiguration#create() to construct a plain Configuration
2010-10-04 18:34:56,037 WARN  [main] hbase.HBaseConfiguration(44): instantiating HBaseConfiguration()
is deprecated. Please use HBaseConfiguration#create() to construct a plain Configuration
2010-10-04 18:34:56,037 WARN  [main] hbase.HBaseConfiguration(44): instantiating HBaseConfiguration()
is deprecated. Please use HBaseConfiguration#create() to construct a plain Configuration
2010-10-04 18:34:56,037 WARN  [main] hbase.HBaseConfiguration(44): instantiating HBaseConfiguration()
is deprecated. Please use HBaseConfiguration#create() to construct a plain Configuration
2010-10-04 18:34:56,037 WARN  [main] hbase.HBaseConfiguration(44): instantiating HBaseConfiguration()
is deprecated. Please use HBaseConfiguration#create() to construct a plain Configuration
2010-10-04 18:34:56,038 WARN  [main] hbase.HBaseConfiguration(44): instantiating HBaseConfiguration()
is deprecated. Please use HBaseConfiguration#create() to construct a plain Configuration
2010-10-04 18:34:56,038 WARN  [main] hbase.HBaseConfiguration(44): instantiating HBaseConfiguration()
is deprecated. Please use HBaseConfiguration#create() to construct a plain Configuration
2010-10-04 18:34:56,038 WARN  [main] hbase.HBaseConfiguration(44): instantiating HBaseConfiguration()
is deprecated. Please use HBaseConfiguration#create() to construct a plain Configuration
2010-10-04 18:34:56,038 WARN  [main] hbase.HBaseConfiguration(44): instantiating HBaseConfiguration()
is deprecated. Please use HBaseConfiguration#create() to construct a plain Configuration
2010-10-04 18:34:56,039 WARN  [main] hbase.HBaseConfiguration(44): instantiating HBaseConfiguration()
is deprecated. Please use HBaseConfiguration#create() to construct a plain Configuration
2010-10-04 18:34:56,040 WARN  [main] hbase.HBaseConfiguration(44): instantiating HBaseConfiguration()
is deprecated. Please use HBaseConfiguration#create() to construct a plain Configuration
2010-10-04 18:34:56,040 WARN  [main] hbase.HBaseConfiguration(44): instantiating HBaseConfiguration()
is deprecated. Please use HBaseConfiguration#create() to construct a plain Configuration
2010-10-04 18:34:56,056 WARN  [main] hbase.HBaseConfiguration(44): instantiating HBaseConfiguration()
is deprecated. Please use HBaseConfiguration#create() to construct a plain Configuration
2010-10-04 18:34:56,254 WARN  [main] hbase.HBaseConfiguration(44): instantiating HBaseConfiguration()
is deprecated. Please use HBaseConfiguration#create() to construct a plain Configuration
2010-10-04 18:34:56,264 WARN  [main] hbase.HBaseConfiguration(44): instantiating HBaseConfiguration()
is deprecated. Please use HBaseConfiguration#create() to construct a plain Configuration
2010-10-04 18:34:56,274 WARN  [main] hbase.HBaseConfiguration(44): instantiating HBaseConfiguration()
is deprecated. Please use HBaseConfiguration#create() to construct a plain Configuration

-------------------------------------------------------
 T E S T S
-------------------------------------------------------
Running org.apache.hadoop.hbase.regionserver.TestColumnSeeking
Tests run: 2, Failures: 0, Errors: 0, Skipped: 0, Time elapsed: 10.411 sec
Running org.apache.hadoop.hbase.client.TestMultipleTimestamps
Tests run: 8, Failures: 0, Errors: 0, Skipped: 0, Time elapsed: 113.141 sec
Running org.apache.hadoop.hbase.TestZooKeeper
Tests run: 4, Failures: 1, Errors: 1, Skipped: 0, Time elapsed: 155.377 sec <<< FAILURE!
Running org.apache.hadoop.hbase.regionserver.wal.TestLogRolling
Tests run: 2, Failures: 0, Errors: 0, Skipped: 0, Time elapsed: 121.469 sec
Running org.apache.hadoop.hbase.io.hfile.TestCachedBlockQueue
Tests run: 2, Failures: 0, Errors: 0, Skipped: 0, Time elapsed: 0.018 sec
Running org.apache.hadoop.hbase.filter.TestPrefixFilter
Tests run: 3, Failures: 0, Errors: 0, Skipped: 0, Time elapsed: 0.018 sec
Running org.apache.hadoop.hbase.util.TestMergeMeta
Tests run: 1, Failures: 0, Errors: 0, Skipped: 0, Time elapsed: 62.48 sec
Running org.apache.hadoop.hbase.io.TestImmutableBytesWritable
Tests run: 3, Failures: 0, Errors: 0, Skipped: 0, Time elapsed: 0.017 sec
Running org.apache.hadoop.hbase.io.TestHeapSize
Tests run: 2, Failures: 0, Errors: 0, Skipped: 0, Time elapsed: 0.03 sec
Running org.apache.hadoop.hbase.rest.model.TestRowModel
Tests run: 2, Failures: 0, Errors: 0, Skipped: 0, Time elapsed: 0.047 sec
Running org.apache.hadoop.hbase.io.hfile.TestHFileSeek
Tests run: 1, Failures: 0, Errors: 0, Skipped: 0, Time elapsed: 4.922 sec
Running org.apache.hadoop.hbase.regionserver.TestStore
Tests run: 8, Failures: 0, Errors: 0, Skipped: 0, Time elapsed: 0.899 sec
Running org.apache.hadoop.hbase.zookeeper.TestHQuorumPeer
Tests run: 3, Failures: 0, Errors: 0, Skipped: 0, Time elapsed: 0.207 sec
Running org.apache.hadoop.hbase.rest.TestScannersWithFilters
Tests run: 1, Failures: 0, Errors: 0, Skipped: 0, Time elapsed: 48.506 sec
Running org.apache.hadoop.hbase.io.hfile.TestHFilePerformance
Tests run: 1, Failures: 0, Errors: 0, Skipped: 0, Time elapsed: 5.987 sec
Running org.apache.hadoop.hbase.io.TestHbaseObjectWritable
Tests run: 2, Failures: 0, Errors: 0, Skipped: 0, Time elapsed: 0.044 sec
Running org.apache.hadoop.hbase.regionserver.wal.TestHLogSplit
Tests run: 15, Failures: 0, Errors: 0, Skipped: 0, Time elapsed: 44.514 sec
Running org.apache.hadoop.hbase.thrift.TestThriftServer
Tests run: 1, Failures: 0, Errors: 0, Skipped: 0, Time elapsed: 67.812 sec
Running org.apache.hadoop.hbase.filter.TestColumnPrefixFilter
Tests run: 1, Failures: 0, Errors: 0, Skipped: 0, Time elapsed: 1.253 sec
Running org.apache.hadoop.hbase.master.TestZKBasedOpenCloseRegion
Tests run: 2, Failures: 0, Errors: 0, Skipped: 0, Time elapsed: 35.67 sec
Running org.apache.hadoop.hbase.TestCompare
Tests run: 1, Failures: 0, Errors: 0, Skipped: 0, Time elapsed: 0.017 sec
Running org.apache.hadoop.hbase.regionserver.TestExplicitColumnTracker
Tests run: 4, Failures: 0, Errors: 0, Skipped: 0, Time elapsed: 0.526 sec
Running org.apache.hadoop.hbase.util.TestEnvironmentEdgeManager
Tests run: 2, Failures: 0, Errors: 0, Skipped: 0, Time elapsed: 0.274 sec
Running org.apache.hadoop.hbase.util.TestDefaultEnvironmentEdge
Tests run: 1, Failures: 0, Errors: 0, Skipped: 0, Time elapsed: 0.019 sec
Running org.apache.hadoop.hbase.util.TestFSUtils
Tests run: 1, Failures: 0, Errors: 0, Skipped: 0, Time elapsed: 4.14 sec
Running org.apache.hadoop.hbase.master.TestMasterTransitions
Tests run: 3, Failures: 0, Errors: 0, Skipped: 3, Time elapsed: 53.545 sec
Running org.apache.hadoop.hbase.regionserver.TestScanWildcardColumnTracker
Tests run: 2, Failures: 0, Errors: 0, Skipped: 0, Time elapsed: 0.115 sec
Running org.apache.hadoop.hbase.regionserver.TestKeyValueSkipListSet
Tests run: 4, Failures: 0, Errors: 0, Skipped: 0, Time elapsed: 0.022 sec
Running org.apache.hadoop.hbase.filter.TestPageFilter
Tests run: 2, Failures: 0, Errors: 0, Skipped: 0, Time elapsed: 0.016 sec
Running org.apache.hadoop.hbase.io.hfile.TestSeekTo
Tests run: 3, Failures: 0, Errors: 0, Skipped: 0, Time elapsed: 0.223 sec
Running org.apache.hadoop.hbase.filter.TestColumnPaginationFilter
Tests run: 1, Failures: 0, Errors: 0, Skipped: 0, Time elapsed: 0.016 sec
Running org.apache.hadoop.hbase.rest.TestStatusResource
Tests run: 1, Failures: 0, Errors: 0, Skipped: 0, Time elapsed: 39.897 sec
Running org.apache.hadoop.hbase.client.TestFromClientSide
Tests run: 38, Failures: 0, Errors: 0, Skipped: 3, Time elapsed: 325.505 sec
Running org.apache.hadoop.hbase.replication.TestReplication
Tests run: 5, Failures: 0, Errors: 0, Skipped: 5, Time elapsed: 0.032 sec
Running org.apache.hadoop.hbase.regionserver.TestCompaction
Tests run: 3, Failures: 0, Errors: 0, Skipped: 0, Time elapsed: 108.727 sec
Running org.apache.hadoop.hbase.filter.TestSingleColumnValueFilter
Tests run: 2, Failures: 0, Errors: 0, Skipped: 0, Time elapsed: 0.036 sec
Running org.apache.hadoop.hbase.mapreduce.TestTimeRangeMapRed
Tests run: 1, Failures: 0, Errors: 0, Skipped: 0, Time elapsed: 33.888 sec
Running org.apache.hadoop.hbase.mapreduce.TestSimpleTotalOrderPartitioner
Tests run: 1, Failures: 0, Errors: 0, Skipped: 0, Time elapsed: 0.11 sec
Running org.apache.hadoop.hbase.mapreduce.TestHFileOutputFormat
Tests run: 5, Failures: 0, Errors: 1, Skipped: 0, Time elapsed: 192.66 sec <<< FAILURE!
Running org.apache.hadoop.hbase.regionserver.TestFSErrorsExposed
Tests run: 3, Failures: 0, Errors: 0, Skipped: 0, Time elapsed: 47.406 sec
Running org.apache.hadoop.hbase.regionserver.TestScanDeleteTracker
Tests run: 6, Failures: 0, Errors: 0, Skipped: 0, Time elapsed: 0.201 sec
Running org.apache.hadoop.hbase.client.TestMetaScanner
Tests run: 1, Failures: 0, Errors: 0, Skipped: 0, Time elapsed: 31.304 sec
Running org.apache.hadoop.hbase.metrics.TestMetricsMBeanBase
Tests run: 2, Failures: 0, Errors: 0, Skipped: 0, Time elapsed: 0.032 sec
Running org.apache.hadoop.hbase.TestRegionRebalancing
Tests run: 1, Failures: 0, Errors: 0, Skipped: 0, Time elapsed: 117.561 sec
Running org.apache.hadoop.hbase.filter.TestSingleColumnValueExcludeFilter
Tests run: 1, Failures: 0, Errors: 0, Skipped: 0, Time elapsed: 0.017 sec
Running org.apache.hadoop.hbase.filter.TestInclusiveStopFilter
Tests run: 2, Failures: 0, Errors: 0, Skipped: 0, Time elapsed: 0.018 sec
Running org.apache.hadoop.hbase.rest.TestTableResource
Tests run: 1, Failures: 0, Errors: 0, Skipped: 0, Time elapsed: 57.572 sec
Running org.apache.hadoop.hbase.TestHBaseTestingUtility
Tests run: 4, Failures: 0, Errors: 0, Skipped: 0, Time elapsed: 23.774 sec
Running org.apache.hadoop.hbase.mapreduce.TestLoadIncrementalHFiles
Tests run: 3, Failures: 0, Errors: 0, Skipped: 0, Time elapsed: 45.459 sec
Running org.apache.hadoop.hbase.rest.TestSchemaResource
Tests run: 1, Failures: 1, Errors: 0, Skipped: 0, Time elapsed: 380.836 sec <<< FAILURE!
Running org.apache.hadoop.hbase.regionserver.wal.TestWALReplay
Tests run: 4, Failures: 0, Errors: 0, Skipped: 0, Time elapsed: 28.001 sec
Running org.apache.hadoop.hbase.regionserver.TestKeyValueScanFixture
Tests run: 1, Failures: 0, Errors: 0, Skipped: 0, Time elapsed: 0.016 sec
Running org.apache.hadoop.hbase.rest.model.TestTableListModel
Tests run: 3, Failures: 0, Errors: 0, Skipped: 0, Time elapsed: 0.137 sec
Running org.apache.hadoop.hbase.rest.model.TestColumnSchemaModel
Tests run: 2, Failures: 0, Errors: 0, Skipped: 0, Time elapsed: 0.033 sec
Running org.apache.hadoop.hbase.regionserver.TestStoreFile
Tests run: 6, Failures: 0, Errors: 0, Skipped: 0, Time elapsed: 54.682 sec
Running org.apache.hadoop.hbase.zookeeper.TestZooKeeperNodeTracker
Tests run: 1, Failures: 0, Errors: 0, Skipped: 0, Time elapsed: 0.563 sec
Running org.apache.hadoop.hbase.rest.model.TestScannerModel
Tests run: 3, Failures: 0, Errors: 0, Skipped: 0, Time elapsed: 0.138 sec
Running org.apache.hadoop.hbase.regionserver.wal.TestHLogMethods
Tests run: 1, Failures: 0, Errors: 0, Skipped: 0, Time elapsed: 0.292 sec
Running org.apache.hadoop.hbase.rest.TestVersionResource
Tests run: 1, Failures: 0, Errors: 0, Skipped: 0, Time elapsed: 22.989 sec
Running org.apache.hadoop.hbase.filter.TestFilter
Tests run: 15, Failures: 0, Errors: 0, Skipped: 0, Time elapsed: 2.749 sec
Running org.apache.hadoop.hbase.regionserver.TestWideScanner
Tests run: 1, Failures: 0, Errors: 0, Skipped: 0, Time elapsed: 37.219 sec
Running org.apache.hadoop.hbase.regionserver.TestSplitTransaction
Tests run: 5, Failures: 0, Errors: 0, Skipped: 0, Time elapsed: 4.797 sec
Running org.apache.hadoop.hbase.util.TestMergeTable
Tests run: 1, Failures: 0, Errors: 0, Skipped: 0, Time elapsed: 104.275 sec
Running org.apache.hadoop.hbase.regionserver.TestReadWriteConsistencyControl
Tests run: 1, Failures: 0, Errors: 0, Skipped: 0, Time elapsed: 10.031 sec
Running org.apache.hadoop.hbase.regionserver.TestGetClosestAtOrBefore
Tests run: 3, Failures: 0, Errors: 0, Skipped: 0, Time elapsed: 28.694 sec
Running org.apache.hadoop.hbase.rest.model.TestVersionModel
Tests run: 3, Failures: 0, Errors: 0, Skipped: 0, Time elapsed: 0.139 sec
Running org.apache.hadoop.hbase.rest.model.TestCellSetModel
Tests run: 3, Failures: 0, Errors: 0, Skipped: 0, Time elapsed: 0.145 sec
Running org.apache.hadoop.hbase.rest.client.TestRemoteTable
Tests run: 5, Failures: 0, Errors: 4, Skipped: 0, Time elapsed: 338.754 sec <<< FAILURE!
Running org.apache.hadoop.hbase.rest.model.TestStorageClusterStatusModel
Tests run: 3, Failures: 0, Errors: 0, Skipped: 0, Time elapsed: 0.144 sec
Running org.apache.hadoop.hbase.avro.TestAvroServer
Tests run: 3, Failures: 0, Errors: 0, Skipped: 0, Time elapsed: 50.767 sec
Running org.apache.hadoop.hbase.TestFullLogReconstruction
Tests run: 1, Failures: 0, Errors: 0, Skipped: 0, Time elapsed: 125.453 sec
Running org.apache.hadoop.hbase.TestSerialization
Tests run: 19, Failures: 0, Errors: 0, Skipped: 0, Time elapsed: 0.069 sec
Running org.apache.hadoop.hbase.regionserver.TestKeyValueHeap
Tests run: 3, Failures: 0, Errors: 0, Skipped: 0, Time elapsed: 0.143 sec
Running org.apache.hadoop.hbase.regionserver.TestStoreScanner
Tests run: 14, Failures: 0, Errors: 0, Skipped: 0, Time elapsed: 0.036 sec
Running org.apache.hadoop.hbase.TestHMsg
Tests run: 2, Failures: 0, Errors: 0, Skipped: 0, Time elapsed: 0.023 sec
Running org.apache.hadoop.hbase.io.hfile.TestReseekTo
Tests run: 1, Failures: 0, Errors: 0, Skipped: 0, Time elapsed: 0.263 sec
Running org.apache.hadoop.hbase.util.TestIncrementingEnvironmentEdge
Tests run: 1, Failures: 0, Errors: 0, Skipped: 0, Time elapsed: 0.016 sec
Running org.apache.hadoop.hbase.util.TestKeying
Tests run: 1, Failures: 0, Errors: 0, Skipped: 0, Time elapsed: 0.017 sec
Running org.apache.hadoop.hbase.regionserver.TestScanner
Tests run: 6, Failures: 0, Errors: 0, Skipped: 0, Time elapsed: 91.79 sec
Running org.apache.hadoop.hbase.regionserver.TestHRegionInfo
Tests run: 2, Failures: 0, Errors: 0, Skipped: 0, Time elapsed: 0.018 sec
Running org.apache.hadoop.hbase.master.TestRestartCluster
Tests run: 2, Failures: 0, Errors: 0, Skipped: 0, Time elapsed: 86.548 sec
Running org.apache.hadoop.hbase.client.TestShell
Tests run: 1, Failures: 0, Errors: 0, Skipped: 0, Time elapsed: 241.46 sec
Running org.apache.hadoop.hbase.rest.model.TestTableInfoModel
Tests run: 3, Failures: 0, Errors: 0, Skipped: 0, Time elapsed: 0.14 sec
Running org.apache.hadoop.hbase.regionserver.TestMinorCompactingStoreScanner
Tests run: 2, Failures: 0, Errors: 0, Skipped: 0, Time elapsed: 0.018 sec
Running org.apache.hadoop.hbase.TestInfoServers
Tests run: 1, Failures: 0, Errors: 0, Skipped: 0, Time elapsed: 45.068 sec
Running org.apache.hadoop.hbase.master.TestLogsCleaner
Tests run: 1, Failures: 0, Errors: 0, Skipped: 1, Time elapsed: 0.142 sec
Running org.apache.hadoop.hbase.regionserver.TestMasterAddressManager
Tests run: 1, Failures: 0, Errors: 0, Skipped: 0, Time elapsed: 0.461 sec
Running org.apache.hadoop.hbase.regionserver.TestQueryMatcher
Tests run: 4, Failures: 0, Errors: 0, Skipped: 0, Time elapsed: 0.177 sec
Running org.apache.hadoop.hbase.client.TestAdmin
killed.
[INFO] ------------------------------------------------------------------------
[ERROR] BUILD ERROR
[INFO] ------------------------------------------------------------------------
[INFO] Error while executing forked tests.; nested exception is org.apache.maven.surefire.booter.shade.org.codehaus.plexus.util.cli.CommandLineException:
Error while executing external command, process killed.

Process timeout out after 3600 seconds
[INFO] ------------------------------------------------------------------------
[INFO] For more information, run Maven with the -e switch
[INFO] ------------------------------------------------------------------------
[INFO] Total time: 119 minutes 44 seconds
[INFO] Finished at: Mon Oct 04 20:34:24 UTC 2010
[INFO] Final Memory: 54M/582M
[INFO] ------------------------------------------------------------------------
[locks-and-latches] Releasing all the locks
[locks-and-latches] All the locks released
Archiving artifacts
Recording test results


Mime
View raw message