hbase-dev mailing list archives

Site index · List index
Message view « Date » · « Thread »
Top « Date » · « Thread »
From Apache Hudson Server <hud...@hudson.apache.org>
Subject Build failed in Hudson: HBase-TRUNK #1598
Date Sat, 30 Oct 2010 03:22:27 GMT
See <https://hudson.apache.org/hudson/job/HBase-TRUNK/1598/changes>

Changes:

[stack] HBASE-2406 Define semantics of cell timestamps/versions

------------------------------------------
[...truncated 998 lines...]
Tests run: 2, Failures: 0, Errors: 0, Skipped: 0, Time elapsed: 0.017 sec
Running org.apache.hadoop.hbase.io.hfile.TestSeekTo
Tests run: 3, Failures: 0, Errors: 0, Skipped: 0, Time elapsed: 0.224 sec
Running org.apache.hadoop.hbase.filter.TestColumnPaginationFilter
Tests run: 1, Failures: 0, Errors: 0, Skipped: 0, Time elapsed: 0.016 sec
Running org.apache.hadoop.hbase.rest.TestStatusResource
Tests run: 1, Failures: 0, Errors: 0, Skipped: 0, Time elapsed: 21.569 sec
Running org.apache.hadoop.hbase.executor.TestExecutorService
Tests run: 1, Failures: 0, Errors: 0, Skipped: 0, Time elapsed: 2.049 sec
Running org.apache.hadoop.hbase.client.TestFromClientSide
Tests run: 40, Failures: 0, Errors: 0, Skipped: 3, Time elapsed: 298.753 sec
Running org.apache.hadoop.hbase.replication.TestReplication
Tests run: 7, Failures: 0, Errors: 0, Skipped: 0, Time elapsed: 164.306 sec
Running org.apache.hadoop.hbase.regionserver.TestCompaction
Tests run: 3, Failures: 0, Errors: 0, Skipped: 0, Time elapsed: 104.051 sec
Running org.apache.hadoop.hbase.filter.TestSingleColumnValueFilter
Tests run: 2, Failures: 0, Errors: 0, Skipped: 0, Time elapsed: 0.034 sec
Running org.apache.hadoop.hbase.mapreduce.TestTimeRangeMapRed
Tests run: 1, Failures: 0, Errors: 0, Skipped: 0, Time elapsed: 29.812 sec
Running org.apache.hadoop.hbase.zookeeper.TestZooKeeperMainServerArg
Tests run: 1, Failures: 0, Errors: 0, Skipped: 0, Time elapsed: 0.034 sec
Running org.apache.hadoop.hbase.mapreduce.TestSimpleTotalOrderPartitioner
Tests run: 1, Failures: 0, Errors: 0, Skipped: 0, Time elapsed: 0.105 sec
Running org.apache.hadoop.hbase.mapreduce.TestHFileOutputFormat
Tests run: 5, Failures: 0, Errors: 0, Skipped: 0, Time elapsed: 157.692 sec
Running org.apache.hadoop.hbase.regionserver.TestFSErrorsExposed
Tests run: 3, Failures: 0, Errors: 0, Skipped: 0, Time elapsed: 38.363 sec
Running org.apache.hadoop.hbase.client.replication.TestReplicationAdmin
Tests run: 1, Failures: 0, Errors: 0, Skipped: 0, Time elapsed: 0.486 sec
Running org.apache.hadoop.hbase.regionserver.TestScanDeleteTracker
Tests run: 6, Failures: 0, Errors: 0, Skipped: 0, Time elapsed: 0.2 sec
Running org.apache.hadoop.hbase.client.TestMetaScanner
Tests run: 1, Failures: 0, Errors: 0, Skipped: 0, Time elapsed: 29.847 sec
Running org.apache.hadoop.hbase.metrics.TestMetricsMBeanBase
Tests run: 2, Failures: 0, Errors: 0, Skipped: 0, Time elapsed: 0.03 sec
Running org.apache.hadoop.hbase.TestRegionRebalancing
Tests run: 1, Failures: 0, Errors: 0, Skipped: 0, Time elapsed: 98.787 sec
Running org.apache.hadoop.hbase.filter.TestSingleColumnValueExcludeFilter
Tests run: 1, Failures: 0, Errors: 0, Skipped: 0, Time elapsed: 0.016 sec
Running org.apache.hadoop.hbase.filter.TestInclusiveStopFilter
Tests run: 2, Failures: 0, Errors: 0, Skipped: 0, Time elapsed: 0.018 sec
Running org.apache.hadoop.hbase.rest.TestTableResource
Tests run: 1, Failures: 0, Errors: 0, Skipped: 0, Time elapsed: 60.226 sec
Running org.apache.hadoop.hbase.TestHBaseTestingUtility
Tests run: 5, Failures: 0, Errors: 0, Skipped: 0, Time elapsed: 88.934 sec
Running org.apache.hadoop.hbase.mapreduce.TestLoadIncrementalHFiles
Tests run: 3, Failures: 0, Errors: 0, Skipped: 0, Time elapsed: 39.962 sec
Running org.apache.hadoop.hbase.rest.TestSchemaResource
Tests run: 1, Failures: 0, Errors: 0, Skipped: 0, Time elapsed: 34.864 sec
Running org.apache.hadoop.hbase.regionserver.wal.TestWALReplay
Tests run: 4, Failures: 0, Errors: 0, Skipped: 0, Time elapsed: 30.754 sec
Running org.apache.hadoop.hbase.regionserver.TestKeyValueScanFixture
Tests run: 1, Failures: 0, Errors: 0, Skipped: 0, Time elapsed: 0.016 sec
Running org.apache.hadoop.hbase.rest.model.TestTableListModel
Tests run: 3, Failures: 0, Errors: 0, Skipped: 0, Time elapsed: 0.132 sec
Running org.apache.hadoop.hbase.rest.model.TestColumnSchemaModel
Tests run: 2, Failures: 0, Errors: 0, Skipped: 0, Time elapsed: 0.032 sec
Running org.apache.hadoop.hbase.regionserver.TestStoreFile
Tests run: 7, Failures: 0, Errors: 0, Skipped: 0, Time elapsed: 41.392 sec
Running org.apache.hadoop.hbase.zookeeper.TestZooKeeperNodeTracker
Tests run: 2, Failures: 0, Errors: 0, Skipped: 0, Time elapsed: 0.508 sec
Running org.apache.hadoop.hbase.rest.model.TestScannerModel
Tests run: 3, Failures: 0, Errors: 0, Skipped: 0, Time elapsed: 0.139 sec
Running org.apache.hadoop.hbase.regionserver.wal.TestHLogMethods
Tests run: 1, Failures: 0, Errors: 0, Skipped: 0, Time elapsed: 0.208 sec
Running org.apache.hadoop.hbase.rest.TestVersionResource
Tests run: 1, Failures: 0, Errors: 0, Skipped: 0, Time elapsed: 21.73 sec
Running org.apache.hadoop.hbase.filter.TestFilter
Tests run: 16, Failures: 0, Errors: 0, Skipped: 0, Time elapsed: 2.772 sec
Running org.apache.hadoop.hbase.regionserver.TestWideScanner
Tests run: 1, Failures: 0, Errors: 0, Skipped: 0, Time elapsed: 9.87 sec
Running org.apache.hadoop.hbase.regionserver.TestSplitTransaction
Tests run: 5, Failures: 0, Errors: 0, Skipped: 0, Time elapsed: 4.066 sec
Running org.apache.hadoop.hbase.replication.regionserver.TestReplicationSink
Tests run: 5, Failures: 0, Errors: 0, Skipped: 0, Time elapsed: 43.133 sec
Running org.apache.hadoop.hbase.util.TestMergeTable
Tests run: 1, Failures: 0, Errors: 0, Skipped: 0, Time elapsed: 65.415 sec
Running org.apache.hadoop.hbase.regionserver.TestReadWriteConsistencyControl
Tests run: 1, Failures: 0, Errors: 0, Skipped: 0, Time elapsed: 10.02 sec
Running org.apache.hadoop.hbase.regionserver.TestGetClosestAtOrBefore
Tests run: 3, Failures: 0, Errors: 0, Skipped: 0, Time elapsed: 21.696 sec
Running org.apache.hadoop.hbase.rest.model.TestVersionModel
Tests run: 3, Failures: 0, Errors: 0, Skipped: 0, Time elapsed: 0.131 sec
Running org.apache.hadoop.hbase.rest.model.TestCellSetModel
Tests run: 3, Failures: 0, Errors: 0, Skipped: 0, Time elapsed: 0.141 sec
Running org.apache.hadoop.hbase.rest.client.TestRemoteTable
Tests run: 5, Failures: 0, Errors: 0, Skipped: 0, Time elapsed: 133.079 sec
Running org.apache.hadoop.hbase.rest.model.TestStorageClusterStatusModel
Tests run: 3, Failures: 0, Errors: 0, Skipped: 0, Time elapsed: 0.143 sec
Running org.apache.hadoop.hbase.avro.TestAvroServer
Tests run: 3, Failures: 0, Errors: 0, Skipped: 0, Time elapsed: 50.381 sec
Running org.apache.hadoop.hbase.TestFullLogReconstruction
Tests run: 1, Failures: 0, Errors: 0, Skipped: 0, Time elapsed: 89.83 sec
Running org.apache.hadoop.hbase.TestSerialization
Tests run: 19, Failures: 0, Errors: 0, Skipped: 0, Time elapsed: 0.059 sec
Running org.apache.hadoop.hbase.regionserver.TestKeyValueHeap
Tests run: 3, Failures: 0, Errors: 0, Skipped: 0, Time elapsed: 0.14 sec
Running org.apache.hadoop.hbase.regionserver.TestStoreScanner
Tests run: 14, Failures: 0, Errors: 0, Skipped: 0, Time elapsed: 0.035 sec
Running org.apache.hadoop.hbase.TestHMsg
Tests run: 2, Failures: 0, Errors: 0, Skipped: 0, Time elapsed: 0.023 sec
Running org.apache.hadoop.hbase.io.hfile.TestReseekTo
Tests run: 1, Failures: 0, Errors: 0, Skipped: 0, Time elapsed: 0.244 sec
Running org.apache.hadoop.hbase.util.TestIncrementingEnvironmentEdge
Tests run: 1, Failures: 0, Errors: 0, Skipped: 0, Time elapsed: 0.017 sec
Running org.apache.hadoop.hbase.util.TestKeying
Tests run: 1, Failures: 0, Errors: 0, Skipped: 0, Time elapsed: 0.016 sec
Running org.apache.hadoop.hbase.regionserver.TestScanner
Tests run: 6, Failures: 0, Errors: 0, Skipped: 0, Time elapsed: 62.939 sec
Running org.apache.hadoop.hbase.regionserver.TestHRegionInfo
Tests run: 2, Failures: 0, Errors: 0, Skipped: 0, Time elapsed: 0.018 sec
Running org.apache.hadoop.hbase.master.TestRestartCluster
Tests run: 2, Failures: 0, Errors: 0, Skipped: 0, Time elapsed: 82.412 sec
Running org.apache.hadoop.hbase.client.TestShell
Tests run: 1, Failures: 0, Errors: 0, Skipped: 0, Time elapsed: 651.245 sec
Running org.apache.hadoop.hbase.rest.model.TestTableInfoModel
Tests run: 3, Failures: 0, Errors: 0, Skipped: 0, Time elapsed: 0.135 sec
Running org.apache.hadoop.hbase.regionserver.TestMinorCompactingStoreScanner
Tests run: 2, Failures: 0, Errors: 0, Skipped: 0, Time elapsed: 0.018 sec
Running org.apache.hadoop.hbase.TestInfoServers
Tests run: 1, Failures: 0, Errors: 0, Skipped: 0, Time elapsed: 20.442 sec
Running org.apache.hadoop.hbase.master.TestLogsCleaner
Tests run: 1, Failures: 0, Errors: 0, Skipped: 1, Time elapsed: 0.146 sec
Running org.apache.hadoop.hbase.regionserver.TestMasterAddressManager
Tests run: 1, Failures: 0, Errors: 0, Skipped: 0, Time elapsed: 0.357 sec
Running org.apache.hadoop.hbase.regionserver.TestQueryMatcher
Tests run: 4, Failures: 0, Errors: 0, Skipped: 0, Time elapsed: 0.169 sec
Running org.apache.hadoop.hbase.client.TestAdmin
Tests run: 16, Failures: 0, Errors: 0, Skipped: 0, Time elapsed: 440.258 sec
Running org.apache.hadoop.hbase.regionserver.TestPriorityCompactionQueue
Tests run: 1, Failures: 1, Errors: 0, Skipped: 0, Time elapsed: 0.045 sec <<< FAILURE!
Running org.apache.hadoop.hbase.util.TestMergeTool
Tests run: 1, Failures: 0, Errors: 0, Skipped: 0, Time elapsed: 38.615 sec
Running org.apache.hadoop.hbase.TestAcidGuarantees
Tests run: 3, Failures: 0, Errors: 0, Skipped: 3, Time elapsed: 0.016 sec
Running org.apache.hadoop.hbase.util.TestBase64
Tests run: 1, Failures: 0, Errors: 0, Skipped: 0, Time elapsed: 0.018 sec
Running org.apache.hadoop.hbase.regionserver.TestMemStore
Tests run: 20, Failures: 0, Errors: 0, Skipped: 0, Time elapsed: 0.421 sec
Running org.apache.hadoop.hbase.rest.TestScannerResource
Tests run: 1, Failures: 0, Errors: 0, Skipped: 0, Time elapsed: 53.583 sec
Running org.apache.hadoop.hbase.io.hfile.TestLruBlockCache
Tests run: 7, Failures: 0, Errors: 0, Skipped: 0, Time elapsed: 1.053 sec
Running org.apache.hadoop.hbase.master.TestDeadServer
Tests run: 1, Failures: 0, Errors: 0, Skipped: 0, Time elapsed: 0.018 sec
Running org.apache.hadoop.hbase.mapreduce.TestTableMapReduce
Tests run: 2, Failures: 0, Errors: 0, Skipped: 0, Time elapsed: 97.732 sec
Running org.apache.hadoop.hbase.TestKeyValue
Tests run: 8, Failures: 0, Errors: 0, Skipped: 0, Time elapsed: 0.025 sec
Running org.apache.hadoop.hbase.client.TestMultiParallel
Tests run: 8, Failures: 0, Errors: 0, Skipped: 0, Time elapsed: 66.488 sec
Running org.apache.hadoop.hbase.master.TestMaster
Tests run: 1, Failures: 0, Errors: 0, Skipped: 0, Time elapsed: 92.252 sec
Running org.apache.hadoop.hbase.master.TestRollingRestart
Tests run: 1, Failures: 0, Errors: 0, Skipped: 0, Time elapsed: 81.378 sec
Running org.apache.hadoop.hbase.client.TestResult
Tests run: 2, Failures: 0, Errors: 0, Skipped: 0, Time elapsed: 0.039 sec
Running org.apache.hadoop.hbase.client.TestHTablePool
Tests run: 5, Failures: 0, Errors: 0, Skipped: 0, Time elapsed: 36.423 sec
Running org.apache.hadoop.hbase.rest.model.TestTableSchemaModel
Tests run: 3, Failures: 0, Errors: 0, Skipped: 0, Time elapsed: 0.14 sec
Running org.apache.hadoop.hbase.util.TestByteBloomFilter
Tests run: 3, Failures: 0, Errors: 0, Skipped: 0, Time elapsed: 1.604 sec
Running org.apache.hadoop.hbase.filter.TestFilterList
Tests run: 4, Failures: 0, Errors: 0, Skipped: 0, Time elapsed: 0.038 sec
Running org.apache.hadoop.hbase.mapreduce.TestTableInputFormatScan
Tests run: 11, Failures: 0, Errors: 0, Skipped: 0, Time elapsed: 340.013 sec
Running org.apache.hadoop.hbase.regionserver.TestHRegion
Tests run: 51, Failures: 0, Errors: 0, Skipped: 0, Time elapsed: 36.447 sec
Running org.apache.hadoop.hbase.master.TestMasterFailover
Tests run: 3, Failures: 0, Errors: 0, Skipped: 0, Time elapsed: 99.53 sec
Running org.apache.hadoop.hbase.rest.model.TestTableRegionModel
Tests run: 4, Failures: 0, Errors: 0, Skipped: 0, Time elapsed: 0.035 sec
Running org.apache.hadoop.hbase.client.TestTimestampsFilter
Tests run: 2, Failures: 0, Errors: 0, Skipped: 0, Time elapsed: 50.392 sec
Running org.apache.hadoop.hbase.master.TestLoadBalancer
Tests run: 3, Failures: 0, Errors: 0, Skipped: 0, Time elapsed: 0.574 sec
Running org.apache.hadoop.hbase.util.TestRootPath
Tests run: 1, Failures: 0, Errors: 0, Skipped: 0, Time elapsed: 0.022 sec
Running org.apache.hadoop.hbase.client.TestScannerTimeout
Tests run: 2, Failures: 0, Errors: 0, Skipped: 0, Time elapsed: 56.817 sec
Running org.apache.hadoop.hbase.mapred.TestTableMapReduce
Tests run: 1, Failures: 0, Errors: 0, Skipped: 0, Time elapsed: 53.602 sec
Running org.apache.hadoop.hbase.regionserver.wal.TestWALObserver
Tests run: 1, Failures: 0, Errors: 0, Skipped: 0, Time elapsed: 0.5 sec
Running org.apache.hadoop.hbase.master.TestActiveMasterManager
Tests run: 2, Failures: 0, Errors: 0, Skipped: 0, Time elapsed: 0.481 sec
Running org.apache.hadoop.hbase.replication.regionserver.TestReplicationSourceManager
Tests run: 1, Failures: 0, Errors: 0, Skipped: 0, Time elapsed: 0.92 sec
Running org.apache.hadoop.hbase.util.TestBytes
Tests run: 10, Failures: 0, Errors: 0, Skipped: 0, Time elapsed: 0.023 sec
Running org.apache.hadoop.hbase.util.TestCompressionTest
Tests run: 1, Failures: 0, Errors: 0, Skipped: 0, Time elapsed: 0.037 sec
Running org.apache.hadoop.hbase.client.TestGetRowVersions
Tests run: 1, Failures: 0, Errors: 0, Skipped: 0, Time elapsed: 45.64 sec
Running org.apache.hadoop.hbase.filter.TestDependentColumnFilter
Tests run: 2, Failures: 0, Errors: 0, Skipped: 0, Time elapsed: 0.406 sec
Running org.apache.hadoop.hbase.rest.model.TestCellModel
Tests run: 3, Failures: 0, Errors: 0, Skipped: 0, Time elapsed: 0.131 sec
Running org.apache.hadoop.hbase.master.TestCatalogJanitor
Tests run: 2, Failures: 0, Errors: 0, Skipped: 0, Time elapsed: 0.54 sec
Running org.apache.hadoop.hbase.catalog.TestCatalogTracker
Tests run: 8, Failures: 0, Errors: 0, Skipped: 0, Time elapsed: 4.178 sec
Running org.apache.hadoop.hbase.replication.TestReplicationSource
Tests run: 1, Failures: 0, Errors: 0, Skipped: 0, Time elapsed: 2.538 sec
Running org.apache.hadoop.hbase.rest.TestRowResource
Tests run: 1, Failures: 0, Errors: 0, Skipped: 0, Time elapsed: 41.817 sec
Running org.apache.hadoop.hbase.io.hfile.TestHFile
Tests run: 7, Failures: 0, Errors: 0, Skipped: 0, Time elapsed: 0.41 sec
Running org.apache.hadoop.hbase.catalog.TestMetaReaderEditor
Tests run: 3, Failures: 0, Errors: 0, Skipped: 0, Time elapsed: 32.226 sec
Running org.apache.hadoop.hbase.mapreduce.TestImportTsv
Tests run: 6, Failures: 0, Errors: 0, Skipped: 0, Time elapsed: 0.044 sec
Running org.apache.hadoop.hbase.rest.client.TestRemoteAdmin
Tests run: 2, Failures: 0, Errors: 0, Skipped: 0, Time elapsed: 58.297 sec
Running org.apache.hadoop.hbase.regionserver.wal.TestHLog
Tests run: 7, Failures: 0, Errors: 0, Skipped: 0, Time elapsed: 63.837 sec
Running org.apache.hadoop.hbase.client.TestTimestamp
Tests run: 1, Failures: 0, Errors: 0, Skipped: 0, Time elapsed: 24.702 sec
Running org.apache.hadoop.hbase.TestScanMultipleVersions
Tests run: 1, Failures: 0, Errors: 0, Skipped: 0, Time elapsed: 21.443 sec
Running org.apache.hadoop.hbase.rest.model.TestStorageClusterVersionModel
Tests run: 2, Failures: 0, Errors: 0, Skipped: 0, Time elapsed: 0.032 sec
Running org.apache.hadoop.hbase.client.TestHCM
Tests run: 2, Failures: 0, Errors: 0, Skipped: 0, Time elapsed: 36.257 sec

Results :

Failed tests: 

Tests run: 546, Failures: 1, Errors: 0, Skipped: 10

[INFO] ------------------------------------------------------------------------
[ERROR] BUILD FAILURE
[INFO] ------------------------------------------------------------------------
[INFO] There are test failures.

Please refer to <https://hudson.apache.org/hudson/job/HBase-TRUNK/ws/trunk/target/surefire-reports>
for the individual test results.
[INFO] ------------------------------------------------------------------------
[INFO] For more information, run Maven with the -e switch
[INFO] ------------------------------------------------------------------------
[INFO] Total time: 86 minutes 27 seconds
[INFO] Finished at: Sat Oct 30 03:22:12 UTC 2010
[INFO] Final Memory: 52M/611M
[INFO] ------------------------------------------------------------------------
[locks-and-latches] Releasing all the locks
[locks-and-latches] All the locks released
Archiving artifacts
Recording test results


Mime
View raw message