hbase-dev mailing list archives

Site index · List index
Message view « Date » · « Thread »
Top « Date » · « Thread »
From Apache Hudson Server <hud...@hudson.apache.org>
Subject Build failed in Hudson: HBase-TRUNK #1516
Date Thu, 07 Oct 2010 20:35:13 GMT
See <https://hudson.apache.org/hudson/job/HBase-TRUNK/1516/changes>

Changes:

[stack] HBASE-3088 TestAvroServer and TestThriftServer broken because use same table in all
tests and tests enable/disable/delete

------------------------------------------
[...truncated 1022 lines...]
2010-10-07 18:36:59,202 WARN  [main] hbase.HBaseConfiguration(44): instantiating HBaseConfiguration()
is deprecated. Please use HBaseConfiguration#create() to construct a plain Configuration
2010-10-07 18:36:59,202 WARN  [main] hbase.HBaseConfiguration(44): instantiating HBaseConfiguration()
is deprecated. Please use HBaseConfiguration#create() to construct a plain Configuration
2010-10-07 18:36:59,202 WARN  [main] hbase.HBaseConfiguration(44): instantiating HBaseConfiguration()
is deprecated. Please use HBaseConfiguration#create() to construct a plain Configuration
2010-10-07 18:36:59,202 WARN  [main] hbase.HBaseConfiguration(44): instantiating HBaseConfiguration()
is deprecated. Please use HBaseConfiguration#create() to construct a plain Configuration
2010-10-07 18:36:59,203 WARN  [main] hbase.HBaseConfiguration(44): instantiating HBaseConfiguration()
is deprecated. Please use HBaseConfiguration#create() to construct a plain Configuration
2010-10-07 18:36:59,203 WARN  [main] hbase.HBaseConfiguration(44): instantiating HBaseConfiguration()
is deprecated. Please use HBaseConfiguration#create() to construct a plain Configuration
2010-10-07 18:36:59,203 WARN  [main] hbase.HBaseConfiguration(44): instantiating HBaseConfiguration()
is deprecated. Please use HBaseConfiguration#create() to construct a plain Configuration
2010-10-07 18:36:59,204 WARN  [main] hbase.HBaseConfiguration(44): instantiating HBaseConfiguration()
is deprecated. Please use HBaseConfiguration#create() to construct a plain Configuration
2010-10-07 18:36:59,204 WARN  [main] hbase.HBaseConfiguration(44): instantiating HBaseConfiguration()
is deprecated. Please use HBaseConfiguration#create() to construct a plain Configuration
2010-10-07 18:36:59,204 WARN  [main] hbase.HBaseConfiguration(44): instantiating HBaseConfiguration()
is deprecated. Please use HBaseConfiguration#create() to construct a plain Configuration
2010-10-07 18:36:59,204 WARN  [main] hbase.HBaseConfiguration(44): instantiating HBaseConfiguration()
is deprecated. Please use HBaseConfiguration#create() to construct a plain Configuration
2010-10-07 18:36:59,205 WARN  [main] hbase.HBaseConfiguration(44): instantiating HBaseConfiguration()
is deprecated. Please use HBaseConfiguration#create() to construct a plain Configuration
2010-10-07 18:36:59,205 WARN  [main] hbase.HBaseConfiguration(44): instantiating HBaseConfiguration()
is deprecated. Please use HBaseConfiguration#create() to construct a plain Configuration
2010-10-07 18:36:59,205 WARN  [main] hbase.HBaseConfiguration(44): instantiating HBaseConfiguration()
is deprecated. Please use HBaseConfiguration#create() to construct a plain Configuration
2010-10-07 18:36:59,205 WARN  [main] hbase.HBaseConfiguration(44): instantiating HBaseConfiguration()
is deprecated. Please use HBaseConfiguration#create() to construct a plain Configuration
2010-10-07 18:36:59,206 WARN  [main] hbase.HBaseConfiguration(44): instantiating HBaseConfiguration()
is deprecated. Please use HBaseConfiguration#create() to construct a plain Configuration
2010-10-07 18:36:59,206 WARN  [main] hbase.HBaseConfiguration(44): instantiating HBaseConfiguration()
is deprecated. Please use HBaseConfiguration#create() to construct a plain Configuration
2010-10-07 18:36:59,206 WARN  [main] hbase.HBaseConfiguration(44): instantiating HBaseConfiguration()
is deprecated. Please use HBaseConfiguration#create() to construct a plain Configuration
2010-10-07 18:36:59,207 WARN  [main] hbase.HBaseConfiguration(44): instantiating HBaseConfiguration()
is deprecated. Please use HBaseConfiguration#create() to construct a plain Configuration
2010-10-07 18:36:59,207 WARN  [main] hbase.HBaseConfiguration(44): instantiating HBaseConfiguration()
is deprecated. Please use HBaseConfiguration#create() to construct a plain Configuration
2010-10-07 18:36:59,207 WARN  [main] hbase.HBaseConfiguration(44): instantiating HBaseConfiguration()
is deprecated. Please use HBaseConfiguration#create() to construct a plain Configuration
2010-10-07 18:36:59,207 WARN  [main] hbase.HBaseConfiguration(44): instantiating HBaseConfiguration()
is deprecated. Please use HBaseConfiguration#create() to construct a plain Configuration
2010-10-07 18:36:59,208 WARN  [main] hbase.HBaseConfiguration(44): instantiating HBaseConfiguration()
is deprecated. Please use HBaseConfiguration#create() to construct a plain Configuration
2010-10-07 18:36:59,208 WARN  [main] hbase.HBaseConfiguration(44): instantiating HBaseConfiguration()
is deprecated. Please use HBaseConfiguration#create() to construct a plain Configuration
2010-10-07 18:36:59,208 WARN  [main] hbase.HBaseConfiguration(44): instantiating HBaseConfiguration()
is deprecated. Please use HBaseConfiguration#create() to construct a plain Configuration
2010-10-07 18:36:59,209 WARN  [main] hbase.HBaseConfiguration(44): instantiating HBaseConfiguration()
is deprecated. Please use HBaseConfiguration#create() to construct a plain Configuration
2010-10-07 18:36:59,209 WARN  [main] hbase.HBaseConfiguration(44): instantiating HBaseConfiguration()
is deprecated. Please use HBaseConfiguration#create() to construct a plain Configuration
2010-10-07 18:36:59,209 WARN  [main] hbase.HBaseConfiguration(44): instantiating HBaseConfiguration()
is deprecated. Please use HBaseConfiguration#create() to construct a plain Configuration
2010-10-07 18:36:59,209 WARN  [main] hbase.HBaseConfiguration(44): instantiating HBaseConfiguration()
is deprecated. Please use HBaseConfiguration#create() to construct a plain Configuration
2010-10-07 18:36:59,210 WARN  [main] hbase.HBaseConfiguration(44): instantiating HBaseConfiguration()
is deprecated. Please use HBaseConfiguration#create() to construct a plain Configuration
2010-10-07 18:36:59,210 WARN  [main] hbase.HBaseConfiguration(44): instantiating HBaseConfiguration()
is deprecated. Please use HBaseConfiguration#create() to construct a plain Configuration
2010-10-07 18:36:59,210 WARN  [main] hbase.HBaseConfiguration(44): instantiating HBaseConfiguration()
is deprecated. Please use HBaseConfiguration#create() to construct a plain Configuration
2010-10-07 18:36:59,210 WARN  [main] hbase.HBaseConfiguration(44): instantiating HBaseConfiguration()
is deprecated. Please use HBaseConfiguration#create() to construct a plain Configuration
2010-10-07 18:36:59,211 WARN  [main] hbase.HBaseConfiguration(44): instantiating HBaseConfiguration()
is deprecated. Please use HBaseConfiguration#create() to construct a plain Configuration
2010-10-07 18:36:59,211 WARN  [main] hbase.HBaseConfiguration(44): instantiating HBaseConfiguration()
is deprecated. Please use HBaseConfiguration#create() to construct a plain Configuration
2010-10-07 18:36:59,212 WARN  [main] hbase.HBaseConfiguration(44): instantiating HBaseConfiguration()
is deprecated. Please use HBaseConfiguration#create() to construct a plain Configuration
2010-10-07 18:36:59,228 WARN  [main] hbase.HBaseConfiguration(44): instantiating HBaseConfiguration()
is deprecated. Please use HBaseConfiguration#create() to construct a plain Configuration
2010-10-07 18:36:59,411 WARN  [main] hbase.HBaseConfiguration(44): instantiating HBaseConfiguration()
is deprecated. Please use HBaseConfiguration#create() to construct a plain Configuration
2010-10-07 18:36:59,422 WARN  [main] hbase.HBaseConfiguration(44): instantiating HBaseConfiguration()
is deprecated. Please use HBaseConfiguration#create() to construct a plain Configuration
2010-10-07 18:36:59,432 WARN  [main] hbase.HBaseConfiguration(44): instantiating HBaseConfiguration()
is deprecated. Please use HBaseConfiguration#create() to construct a plain Configuration

-------------------------------------------------------
 T E S T S
-------------------------------------------------------
Running org.apache.hadoop.hbase.regionserver.TestColumnSeeking
Tests run: 2, Failures: 0, Errors: 0, Skipped: 0, Time elapsed: 10.658 sec
Running org.apache.hadoop.hbase.client.TestMultipleTimestamps
Tests run: 8, Failures: 0, Errors: 0, Skipped: 0, Time elapsed: 106.41 sec
Running org.apache.hadoop.hbase.TestZooKeeper
Tests run: 4, Failures: 1, Errors: 1, Skipped: 0, Time elapsed: 155.07 sec <<< FAILURE!
Running org.apache.hadoop.hbase.regionserver.wal.TestLogRolling
Tests run: 2, Failures: 0, Errors: 0, Skipped: 0, Time elapsed: 123.927 sec
Running org.apache.hadoop.hbase.io.hfile.TestCachedBlockQueue
Tests run: 2, Failures: 0, Errors: 0, Skipped: 0, Time elapsed: 0.018 sec
Running org.apache.hadoop.hbase.filter.TestPrefixFilter
Tests run: 3, Failures: 0, Errors: 0, Skipped: 0, Time elapsed: 0.019 sec
Running org.apache.hadoop.hbase.util.TestMergeMeta
Tests run: 1, Failures: 0, Errors: 0, Skipped: 0, Time elapsed: 64.115 sec
Running org.apache.hadoop.hbase.io.TestImmutableBytesWritable
Tests run: 3, Failures: 0, Errors: 0, Skipped: 0, Time elapsed: 0.018 sec
Running org.apache.hadoop.hbase.io.TestHeapSize
Tests run: 2, Failures: 0, Errors: 0, Skipped: 0, Time elapsed: 0.03 sec
Running org.apache.hadoop.hbase.rest.model.TestRowModel
Tests run: 2, Failures: 0, Errors: 0, Skipped: 0, Time elapsed: 0.044 sec
Running org.apache.hadoop.hbase.io.hfile.TestHFileSeek
Tests run: 1, Failures: 0, Errors: 0, Skipped: 0, Time elapsed: 5.041 sec
Running org.apache.hadoop.hbase.regionserver.TestStore
Tests run: 9, Failures: 0, Errors: 0, Skipped: 0, Time elapsed: 1.406 sec
Running org.apache.hadoop.hbase.zookeeper.TestHQuorumPeer
Tests run: 3, Failures: 0, Errors: 0, Skipped: 0, Time elapsed: 0.29 sec
Running org.apache.hadoop.hbase.rest.TestScannersWithFilters
Tests run: 1, Failures: 0, Errors: 0, Skipped: 0, Time elapsed: 31.413 sec
Running org.apache.hadoop.hbase.io.hfile.TestHFilePerformance
Tests run: 1, Failures: 0, Errors: 0, Skipped: 0, Time elapsed: 8.188 sec
Running org.apache.hadoop.hbase.io.TestHbaseObjectWritable
Tests run: 2, Failures: 0, Errors: 0, Skipped: 0, Time elapsed: 0.044 sec
Running org.apache.hadoop.hbase.regionserver.wal.TestHLogSplit
Tests run: 15, Failures: 0, Errors: 0, Skipped: 0, Time elapsed: 52.358 sec
Running org.apache.hadoop.hbase.thrift.TestThriftServer
Tests run: 1, Failures: 0, Errors: 0, Skipped: 0, Time elapsed: 56.281 sec
Running org.apache.hadoop.hbase.filter.TestColumnPrefixFilter
Tests run: 1, Failures: 0, Errors: 0, Skipped: 0, Time elapsed: 1.229 sec
Running org.apache.hadoop.hbase.master.TestZKBasedOpenCloseRegion
Tests run: 2, Failures: 0, Errors: 0, Skipped: 0, Time elapsed: 37.585 sec
Running org.apache.hadoop.hbase.TestCompare
Tests run: 1, Failures: 0, Errors: 0, Skipped: 0, Time elapsed: 0.017 sec
Running org.apache.hadoop.hbase.regionserver.TestExplicitColumnTracker
Tests run: 4, Failures: 0, Errors: 0, Skipped: 0, Time elapsed: 0.491 sec
Running org.apache.hadoop.hbase.util.TestEnvironmentEdgeManager
Tests run: 2, Failures: 0, Errors: 0, Skipped: 0, Time elapsed: 0.452 sec
Running org.apache.hadoop.hbase.util.TestDefaultEnvironmentEdge
Tests run: 1, Failures: 0, Errors: 0, Skipped: 0, Time elapsed: 0.018 sec
Running org.apache.hadoop.hbase.util.TestFSUtils
Tests run: 1, Failures: 0, Errors: 0, Skipped: 0, Time elapsed: 23.104 sec
Running org.apache.hadoop.hbase.master.TestMasterTransitions
Tests run: 3, Failures: 0, Errors: 0, Skipped: 3, Time elapsed: 50.991 sec
Running org.apache.hadoop.hbase.regionserver.TestScanWildcardColumnTracker
Tests run: 2, Failures: 0, Errors: 0, Skipped: 0, Time elapsed: 0.121 sec
Running org.apache.hadoop.hbase.regionserver.TestKeyValueSkipListSet
Tests run: 4, Failures: 0, Errors: 0, Skipped: 0, Time elapsed: 0.021 sec
Running org.apache.hadoop.hbase.filter.TestPageFilter
Tests run: 2, Failures: 0, Errors: 0, Skipped: 0, Time elapsed: 0.017 sec
Running org.apache.hadoop.hbase.io.hfile.TestSeekTo
Tests run: 3, Failures: 0, Errors: 0, Skipped: 0, Time elapsed: 0.242 sec
Running org.apache.hadoop.hbase.filter.TestColumnPaginationFilter
Tests run: 1, Failures: 0, Errors: 0, Skipped: 0, Time elapsed: 0.016 sec
Running org.apache.hadoop.hbase.rest.TestStatusResource
Tests run: 1, Failures: 0, Errors: 0, Skipped: 0, Time elapsed: 22.791 sec
Running org.apache.hadoop.hbase.client.TestFromClientSide
Tests run: 38, Failures: 0, Errors: 0, Skipped: 3, Time elapsed: 333.17 sec
Running org.apache.hadoop.hbase.replication.TestReplication
Tests run: 5, Failures: 0, Errors: 0, Skipped: 5, Time elapsed: 0.032 sec
Running org.apache.hadoop.hbase.regionserver.TestCompaction
Tests run: 3, Failures: 0, Errors: 0, Skipped: 0, Time elapsed: 114.738 sec
Running org.apache.hadoop.hbase.filter.TestSingleColumnValueFilter
Tests run: 2, Failures: 0, Errors: 0, Skipped: 0, Time elapsed: 0.036 sec
Running org.apache.hadoop.hbase.mapreduce.TestTimeRangeMapRed
Tests run: 1, Failures: 0, Errors: 0, Skipped: 0, Time elapsed: 33.201 sec
Running org.apache.hadoop.hbase.mapreduce.TestSimpleTotalOrderPartitioner
Tests run: 1, Failures: 0, Errors: 0, Skipped: 0, Time elapsed: 0.107 sec
Running org.apache.hadoop.hbase.mapreduce.TestHFileOutputFormat
Tests run: 5, Failures: 0, Errors: 0, Skipped: 0, Time elapsed: 166.958 sec
Running org.apache.hadoop.hbase.regionserver.TestFSErrorsExposed
Tests run: 3, Failures: 0, Errors: 0, Skipped: 0, Time elapsed: 50.034 sec
Running org.apache.hadoop.hbase.regionserver.TestScanDeleteTracker
Tests run: 6, Failures: 0, Errors: 0, Skipped: 0, Time elapsed: 0.222 sec
Running org.apache.hadoop.hbase.client.TestMetaScanner
Tests run: 1, Failures: 0, Errors: 0, Skipped: 0, Time elapsed: 42.194 sec
Running org.apache.hadoop.hbase.metrics.TestMetricsMBeanBase
Tests run: 2, Failures: 0, Errors: 0, Skipped: 0, Time elapsed: 0.034 sec
Running org.apache.hadoop.hbase.TestRegionRebalancing
Tests run: 1, Failures: 0, Errors: 0, Skipped: 0, Time elapsed: 92.865 sec
Running org.apache.hadoop.hbase.filter.TestSingleColumnValueExcludeFilter
Tests run: 1, Failures: 0, Errors: 0, Skipped: 0, Time elapsed: 0.016 sec
Running org.apache.hadoop.hbase.filter.TestInclusiveStopFilter
Tests run: 2, Failures: 0, Errors: 0, Skipped: 0, Time elapsed: 0.017 sec
Running org.apache.hadoop.hbase.rest.TestTableResource
Tests run: 1, Failures: 0, Errors: 0, Skipped: 0, Time elapsed: 54.691 sec
Running org.apache.hadoop.hbase.TestHBaseTestingUtility
Tests run: 4, Failures: 0, Errors: 0, Skipped: 0, Time elapsed: 30.361 sec
Running org.apache.hadoop.hbase.mapreduce.TestLoadIncrementalHFiles
Tests run: 3, Failures: 0, Errors: 0, Skipped: 0, Time elapsed: 84.035 sec
Running org.apache.hadoop.hbase.rest.TestSchemaResource
Tests run: 1, Failures: 0, Errors: 0, Skipped: 0, Time elapsed: 38.909 sec
Running org.apache.hadoop.hbase.regionserver.wal.TestWALReplay
Tests run: 4, Failures: 0, Errors: 0, Skipped: 0, Time elapsed: 30.157 sec
Running org.apache.hadoop.hbase.regionserver.TestKeyValueScanFixture
Tests run: 1, Failures: 0, Errors: 0, Skipped: 0, Time elapsed: 0.017 sec
Running org.apache.hadoop.hbase.rest.model.TestTableListModel
Tests run: 3, Failures: 0, Errors: 0, Skipped: 0, Time elapsed: 0.136 sec
Running org.apache.hadoop.hbase.rest.model.TestColumnSchemaModel
Tests run: 2, Failures: 0, Errors: 0, Skipped: 0, Time elapsed: 0.032 sec
Running org.apache.hadoop.hbase.regionserver.TestStoreFile
Tests run: 6, Failures: 0, Errors: 0, Skipped: 0, Time elapsed: 38.409 sec
Running org.apache.hadoop.hbase.zookeeper.TestZooKeeperNodeTracker
Tests run: 1, Failures: 0, Errors: 0, Skipped: 0, Time elapsed: 0.613 sec
Running org.apache.hadoop.hbase.rest.model.TestScannerModel
Tests run: 3, Failures: 0, Errors: 0, Skipped: 0, Time elapsed: 0.151 sec
Running org.apache.hadoop.hbase.regionserver.wal.TestHLogMethods
Tests run: 1, Failures: 0, Errors: 0, Skipped: 0, Time elapsed: 0.328 sec
Running org.apache.hadoop.hbase.rest.TestVersionResource
Tests run: 1, Failures: 0, Errors: 0, Skipped: 0, Time elapsed: 27.009 sec
Running org.apache.hadoop.hbase.filter.TestFilter
Tests run: 15, Failures: 0, Errors: 0, Skipped: 0, Time elapsed: 2.907 sec
Running org.apache.hadoop.hbase.regionserver.TestWideScanner
Tests run: 1, Failures: 0, Errors: 0, Skipped: 0, Time elapsed: 11.533 sec
Running org.apache.hadoop.hbase.regionserver.TestSplitTransaction
Tests run: 5, Failures: 0, Errors: 0, Skipped: 0, Time elapsed: 4.709 sec
Running org.apache.hadoop.hbase.util.TestMergeTable
Tests run: 1, Failures: 0, Errors: 0, Skipped: 0, Time elapsed: 116.231 sec
Running org.apache.hadoop.hbase.regionserver.TestReadWriteConsistencyControl
Tests run: 1, Failures: 0, Errors: 0, Skipped: 0, Time elapsed: 10.021 sec
Running org.apache.hadoop.hbase.regionserver.TestGetClosestAtOrBefore
Tests run: 3, Failures: 0, Errors: 0, Skipped: 0, Time elapsed: 12.239 sec
Running org.apache.hadoop.hbase.rest.model.TestVersionModel
Tests run: 3, Failures: 0, Errors: 0, Skipped: 0, Time elapsed: 0.142 sec
Running org.apache.hadoop.hbase.rest.model.TestCellSetModel
Tests run: 3, Failures: 0, Errors: 0, Skipped: 0, Time elapsed: 0.144 sec
Running org.apache.hadoop.hbase.rest.client.TestRemoteTable
Tests run: 5, Failures: 0, Errors: 4, Skipped: 0, Time elapsed: 166.031 sec <<< FAILURE!
Running org.apache.hadoop.hbase.rest.model.TestStorageClusterStatusModel
Tests run: 3, Failures: 0, Errors: 0, Skipped: 0, Time elapsed: 0.144 sec
Running org.apache.hadoop.hbase.avro.TestAvroServer
Tests run: 3, Failures: 0, Errors: 0, Skipped: 0, Time elapsed: 51.716 sec
Running org.apache.hadoop.hbase.TestFullLogReconstruction
Tests run: 1, Failures: 0, Errors: 0, Skipped: 0, Time elapsed: 120.127 sec
Running org.apache.hadoop.hbase.TestSerialization
Tests run: 19, Failures: 0, Errors: 0, Skipped: 0, Time elapsed: 0.069 sec
Running org.apache.hadoop.hbase.regionserver.TestKeyValueHeap
Tests run: 3, Failures: 0, Errors: 0, Skipped: 0, Time elapsed: 0.163 sec
Running org.apache.hadoop.hbase.regionserver.TestStoreScanner
Tests run: 14, Failures: 0, Errors: 0, Skipped: 0, Time elapsed: 0.039 sec
Running org.apache.hadoop.hbase.TestHMsg
Tests run: 2, Failures: 0, Errors: 0, Skipped: 0, Time elapsed: 0.023 sec
Running org.apache.hadoop.hbase.io.hfile.TestReseekTo
Tests run: 1, Failures: 0, Errors: 0, Skipped: 0, Time elapsed: 0.342 sec
Running org.apache.hadoop.hbase.util.TestIncrementingEnvironmentEdge
Tests run: 1, Failures: 0, Errors: 0, Skipped: 0, Time elapsed: 0.017 sec
Running org.apache.hadoop.hbase.util.TestKeying
Tests run: 1, Failures: 0, Errors: 0, Skipped: 0, Time elapsed: 0.017 sec
Running org.apache.hadoop.hbase.regionserver.TestScanner
Tests run: 6, Failures: 0, Errors: 0, Skipped: 0, Time elapsed: 75.19 sec
Running org.apache.hadoop.hbase.regionserver.TestHRegionInfo
Tests run: 2, Failures: 0, Errors: 0, Skipped: 0, Time elapsed: 0.018 sec
Running org.apache.hadoop.hbase.master.TestRestartCluster
Tests run: 2, Failures: 0, Errors: 1, Skipped: 0, Time elapsed: 53.188 sec <<< FAILURE!
Running org.apache.hadoop.hbase.client.TestShell
Tests run: 1, Failures: 0, Errors: 0, Skipped: 0, Time elapsed: 241.171 sec
Running org.apache.hadoop.hbase.rest.model.TestTableInfoModel
Tests run: 3, Failures: 0, Errors: 0, Skipped: 0, Time elapsed: 0.141 sec
Running org.apache.hadoop.hbase.regionserver.TestMinorCompactingStoreScanner
Tests run: 2, Failures: 0, Errors: 0, Skipped: 0, Time elapsed: 0.019 sec
Running org.apache.hadoop.hbase.TestInfoServers
Tests run: 1, Failures: 0, Errors: 0, Skipped: 0, Time elapsed: 22.191 sec
Running org.apache.hadoop.hbase.master.TestLogsCleaner
Tests run: 1, Failures: 0, Errors: 0, Skipped: 1, Time elapsed: 0.16 sec
Running org.apache.hadoop.hbase.regionserver.TestMasterAddressManager
Tests run: 1, Failures: 0, Errors: 0, Skipped: 0, Time elapsed: 0.472 sec
Running org.apache.hadoop.hbase.regionserver.TestQueryMatcher
Tests run: 4, Failures: 0, Errors: 0, Skipped: 0, Time elapsed: 0.176 sec
Running org.apache.hadoop.hbase.client.TestAdmin
Tests run: 16, Failures: 0, Errors: 0, Skipped: 0, Time elapsed: 464.09 sec
Running org.apache.hadoop.hbase.TestMultiClusters
Tests run: 1, Failures: 0, Errors: 0, Skipped: 0, Time elapsed: 45.443 sec
Running org.apache.hadoop.hbase.util.TestMergeTool
Tests run: 1, Failures: 0, Errors: 0, Skipped: 0, Time elapsed: 25.565 sec
Running org.apache.hadoop.hbase.regionserver.TestPriorityCompactionQueue
Tests run: 1, Failures: 0, Errors: 0, Skipped: 0, Time elapsed: 1.087 sec
Running org.apache.hadoop.hbase.TestAcidGuarantees
Tests run: 3, Failures: 0, Errors: 0, Skipped: 3, Time elapsed: 0.016 sec
Running org.apache.hadoop.hbase.master.TestKillingServersFromMaster
killed.
[INFO] ------------------------------------------------------------------------
[ERROR] BUILD ERROR
[INFO] ------------------------------------------------------------------------
[INFO] Error while executing forked tests.; nested exception is org.apache.maven.surefire.booter.shade.org.codehaus.plexus.util.cli.CommandLineException:
Error while executing external command, process killed.

Process timeout out after 3600 seconds
[INFO] ------------------------------------------------------------------------
[INFO] For more information, run Maven with the -e switch
[INFO] ------------------------------------------------------------------------
[INFO] Total time: 118 minutes 23 seconds
[INFO] Finished at: Thu Oct 07 20:35:04 UTC 2010
[INFO] Final Memory: 56M/702M
[INFO] ------------------------------------------------------------------------
[locks-and-latches] Releasing all the locks
[locks-and-latches] All the locks released
Archiving artifacts
Recording test results


Mime
View raw message