hbase-dev mailing list archives

Site index · List index
Message view « Date » · « Thread »
Top « Date » · « Thread »
From Apache Hudson Server <hud...@hudson.apache.org>
Subject Build failed in Hudson: HBase-TRUNK #1514
Date Wed, 06 Oct 2010 23:35:32 GMT
See <https://hudson.apache.org/hudson/job/HBase-TRUNK/1514/changes>

Changes:

[jgray] HBASE-3053  Add ability to have multiple Masters LocalHBaseCluster for test writing

[rawson] HBASE-3008  Memstore.updateColumnValue passes wrong flag to heapSizeChange (Causes
memstore size to go negative)

[stack] Yet more debug for baffling zk test failure up on hudson

------------------------------------------
[...truncated 998 lines...]
2010-10-06 21:44:30,437 WARN  [main] hbase.HBaseConfiguration(44): instantiating HBaseConfiguration()
is deprecated. Please use HBaseConfiguration#create() to construct a plain Configuration
2010-10-06 21:44:30,438 WARN  [main] hbase.HBaseConfiguration(44): instantiating HBaseConfiguration()
is deprecated. Please use HBaseConfiguration#create() to construct a plain Configuration
2010-10-06 21:44:30,440 WARN  [main] hbase.HBaseConfiguration(44): instantiating HBaseConfiguration()
is deprecated. Please use HBaseConfiguration#create() to construct a plain Configuration
2010-10-06 21:44:30,440 WARN  [main] hbase.HBaseConfiguration(44): instantiating HBaseConfiguration()
is deprecated. Please use HBaseConfiguration#create() to construct a plain Configuration
2010-10-06 21:44:30,440 WARN  [main] hbase.HBaseConfiguration(44): instantiating HBaseConfiguration()
is deprecated. Please use HBaseConfiguration#create() to construct a plain Configuration
2010-10-06 21:44:30,440 WARN  [main] hbase.HBaseConfiguration(44): instantiating HBaseConfiguration()
is deprecated. Please use HBaseConfiguration#create() to construct a plain Configuration
2010-10-06 21:44:30,443 WARN  [main] hbase.HBaseConfiguration(44): instantiating HBaseConfiguration()
is deprecated. Please use HBaseConfiguration#create() to construct a plain Configuration
2010-10-06 21:44:30,450 WARN  [main] hbase.HBaseConfiguration(44): instantiating HBaseConfiguration()
is deprecated. Please use HBaseConfiguration#create() to construct a plain Configuration
2010-10-06 21:44:30,450 WARN  [main] hbase.HBaseConfiguration(44): instantiating HBaseConfiguration()
is deprecated. Please use HBaseConfiguration#create() to construct a plain Configuration
2010-10-06 21:44:30,450 WARN  [main] hbase.HBaseConfiguration(44): instantiating HBaseConfiguration()
is deprecated. Please use HBaseConfiguration#create() to construct a plain Configuration
2010-10-06 21:44:30,450 WARN  [main] hbase.HBaseConfiguration(44): instantiating HBaseConfiguration()
is deprecated. Please use HBaseConfiguration#create() to construct a plain Configuration
2010-10-06 21:44:30,451 WARN  [main] hbase.HBaseConfiguration(44): instantiating HBaseConfiguration()
is deprecated. Please use HBaseConfiguration#create() to construct a plain Configuration
2010-10-06 21:44:30,451 WARN  [main] hbase.HBaseConfiguration(44): instantiating HBaseConfiguration()
is deprecated. Please use HBaseConfiguration#create() to construct a plain Configuration
2010-10-06 21:44:30,451 WARN  [main] hbase.HBaseConfiguration(44): instantiating HBaseConfiguration()
is deprecated. Please use HBaseConfiguration#create() to construct a plain Configuration
2010-10-06 21:44:30,452 WARN  [main] hbase.HBaseConfiguration(44): instantiating HBaseConfiguration()
is deprecated. Please use HBaseConfiguration#create() to construct a plain Configuration
2010-10-06 21:44:30,452 WARN  [main] hbase.HBaseConfiguration(44): instantiating HBaseConfiguration()
is deprecated. Please use HBaseConfiguration#create() to construct a plain Configuration
2010-10-06 21:44:30,452 WARN  [main] hbase.HBaseConfiguration(44): instantiating HBaseConfiguration()
is deprecated. Please use HBaseConfiguration#create() to construct a plain Configuration
2010-10-06 21:44:30,452 WARN  [main] hbase.HBaseConfiguration(44): instantiating HBaseConfiguration()
is deprecated. Please use HBaseConfiguration#create() to construct a plain Configuration
2010-10-06 21:44:30,453 WARN  [main] hbase.HBaseConfiguration(44): instantiating HBaseConfiguration()
is deprecated. Please use HBaseConfiguration#create() to construct a plain Configuration
2010-10-06 21:44:30,453 WARN  [main] hbase.HBaseConfiguration(44): instantiating HBaseConfiguration()
is deprecated. Please use HBaseConfiguration#create() to construct a plain Configuration
2010-10-06 21:44:30,453 WARN  [main] hbase.HBaseConfiguration(44): instantiating HBaseConfiguration()
is deprecated. Please use HBaseConfiguration#create() to construct a plain Configuration
2010-10-06 21:44:30,453 WARN  [main] hbase.HBaseConfiguration(44): instantiating HBaseConfiguration()
is deprecated. Please use HBaseConfiguration#create() to construct a plain Configuration
2010-10-06 21:44:30,454 WARN  [main] hbase.HBaseConfiguration(44): instantiating HBaseConfiguration()
is deprecated. Please use HBaseConfiguration#create() to construct a plain Configuration
2010-10-06 21:44:30,454 WARN  [main] hbase.HBaseConfiguration(44): instantiating HBaseConfiguration()
is deprecated. Please use HBaseConfiguration#create() to construct a plain Configuration
2010-10-06 21:44:30,455 WARN  [main] hbase.HBaseConfiguration(44): instantiating HBaseConfiguration()
is deprecated. Please use HBaseConfiguration#create() to construct a plain Configuration
2010-10-06 21:44:30,455 WARN  [main] hbase.HBaseConfiguration(44): instantiating HBaseConfiguration()
is deprecated. Please use HBaseConfiguration#create() to construct a plain Configuration
2010-10-06 21:44:30,455 WARN  [main] hbase.HBaseConfiguration(44): instantiating HBaseConfiguration()
is deprecated. Please use HBaseConfiguration#create() to construct a plain Configuration
2010-10-06 21:44:30,455 WARN  [main] hbase.HBaseConfiguration(44): instantiating HBaseConfiguration()
is deprecated. Please use HBaseConfiguration#create() to construct a plain Configuration
2010-10-06 21:44:30,456 WARN  [main] hbase.HBaseConfiguration(44): instantiating HBaseConfiguration()
is deprecated. Please use HBaseConfiguration#create() to construct a plain Configuration
2010-10-06 21:44:30,456 WARN  [main] hbase.HBaseConfiguration(44): instantiating HBaseConfiguration()
is deprecated. Please use HBaseConfiguration#create() to construct a plain Configuration
2010-10-06 21:44:30,456 WARN  [main] hbase.HBaseConfiguration(44): instantiating HBaseConfiguration()
is deprecated. Please use HBaseConfiguration#create() to construct a plain Configuration
2010-10-06 21:44:30,456 WARN  [main] hbase.HBaseConfiguration(44): instantiating HBaseConfiguration()
is deprecated. Please use HBaseConfiguration#create() to construct a plain Configuration
2010-10-06 21:44:30,457 WARN  [main] hbase.HBaseConfiguration(44): instantiating HBaseConfiguration()
is deprecated. Please use HBaseConfiguration#create() to construct a plain Configuration
2010-10-06 21:44:30,457 WARN  [main] hbase.HBaseConfiguration(44): instantiating HBaseConfiguration()
is deprecated. Please use HBaseConfiguration#create() to construct a plain Configuration
2010-10-06 21:44:30,457 WARN  [main] hbase.HBaseConfiguration(44): instantiating HBaseConfiguration()
is deprecated. Please use HBaseConfiguration#create() to construct a plain Configuration
2010-10-06 21:44:30,457 WARN  [main] hbase.HBaseConfiguration(44): instantiating HBaseConfiguration()
is deprecated. Please use HBaseConfiguration#create() to construct a plain Configuration
2010-10-06 21:44:30,458 WARN  [main] hbase.HBaseConfiguration(44): instantiating HBaseConfiguration()
is deprecated. Please use HBaseConfiguration#create() to construct a plain Configuration
2010-10-06 21:44:30,458 WARN  [main] hbase.HBaseConfiguration(44): instantiating HBaseConfiguration()
is deprecated. Please use HBaseConfiguration#create() to construct a plain Configuration
2010-10-06 21:44:30,458 WARN  [main] hbase.HBaseConfiguration(44): instantiating HBaseConfiguration()
is deprecated. Please use HBaseConfiguration#create() to construct a plain Configuration
2010-10-06 21:44:30,458 WARN  [main] hbase.HBaseConfiguration(44): instantiating HBaseConfiguration()
is deprecated. Please use HBaseConfiguration#create() to construct a plain Configuration
2010-10-06 21:44:30,458 WARN  [main] hbase.HBaseConfiguration(44): instantiating HBaseConfiguration()
is deprecated. Please use HBaseConfiguration#create() to construct a plain Configuration
2010-10-06 21:44:30,459 WARN  [main] hbase.HBaseConfiguration(44): instantiating HBaseConfiguration()
is deprecated. Please use HBaseConfiguration#create() to construct a plain Configuration
2010-10-06 21:44:30,459 WARN  [main] hbase.HBaseConfiguration(44): instantiating HBaseConfiguration()
is deprecated. Please use HBaseConfiguration#create() to construct a plain Configuration
2010-10-06 21:44:30,459 WARN  [main] hbase.HBaseConfiguration(44): instantiating HBaseConfiguration()
is deprecated. Please use HBaseConfiguration#create() to construct a plain Configuration
2010-10-06 21:44:30,459 WARN  [main] hbase.HBaseConfiguration(44): instantiating HBaseConfiguration()
is deprecated. Please use HBaseConfiguration#create() to construct a plain Configuration
2010-10-06 21:44:30,460 WARN  [main] hbase.HBaseConfiguration(44): instantiating HBaseConfiguration()
is deprecated. Please use HBaseConfiguration#create() to construct a plain Configuration
2010-10-06 21:44:30,460 WARN  [main] hbase.HBaseConfiguration(44): instantiating HBaseConfiguration()
is deprecated. Please use HBaseConfiguration#create() to construct a plain Configuration
2010-10-06 21:44:30,460 WARN  [main] hbase.HBaseConfiguration(44): instantiating HBaseConfiguration()
is deprecated. Please use HBaseConfiguration#create() to construct a plain Configuration
2010-10-06 21:44:30,461 WARN  [main] hbase.HBaseConfiguration(44): instantiating HBaseConfiguration()
is deprecated. Please use HBaseConfiguration#create() to construct a plain Configuration
2010-10-06 21:44:30,461 WARN  [main] hbase.HBaseConfiguration(44): instantiating HBaseConfiguration()
is deprecated. Please use HBaseConfiguration#create() to construct a plain Configuration
2010-10-06 21:44:30,461 WARN  [main] hbase.HBaseConfiguration(44): instantiating HBaseConfiguration()
is deprecated. Please use HBaseConfiguration#create() to construct a plain Configuration
2010-10-06 21:44:30,461 WARN  [main] hbase.HBaseConfiguration(44): instantiating HBaseConfiguration()
is deprecated. Please use HBaseConfiguration#create() to construct a plain Configuration
2010-10-06 21:44:30,461 WARN  [main] hbase.HBaseConfiguration(44): instantiating HBaseConfiguration()
is deprecated. Please use HBaseConfiguration#create() to construct a plain Configuration
2010-10-06 21:44:30,462 WARN  [main] hbase.HBaseConfiguration(44): instantiating HBaseConfiguration()
is deprecated. Please use HBaseConfiguration#create() to construct a plain Configuration
2010-10-06 21:44:30,462 WARN  [main] hbase.HBaseConfiguration(44): instantiating HBaseConfiguration()
is deprecated. Please use HBaseConfiguration#create() to construct a plain Configuration
2010-10-06 21:44:30,462 WARN  [main] hbase.HBaseConfiguration(44): instantiating HBaseConfiguration()
is deprecated. Please use HBaseConfiguration#create() to construct a plain Configuration
2010-10-06 21:44:30,462 WARN  [main] hbase.HBaseConfiguration(44): instantiating HBaseConfiguration()
is deprecated. Please use HBaseConfiguration#create() to construct a plain Configuration
2010-10-06 21:44:30,463 WARN  [main] hbase.HBaseConfiguration(44): instantiating HBaseConfiguration()
is deprecated. Please use HBaseConfiguration#create() to construct a plain Configuration
2010-10-06 21:44:30,464 WARN  [main] hbase.HBaseConfiguration(44): instantiating HBaseConfiguration()
is deprecated. Please use HBaseConfiguration#create() to construct a plain Configuration
2010-10-06 21:44:30,464 WARN  [main] hbase.HBaseConfiguration(44): instantiating HBaseConfiguration()
is deprecated. Please use HBaseConfiguration#create() to construct a plain Configuration
2010-10-06 21:44:30,480 WARN  [main] hbase.HBaseConfiguration(44): instantiating HBaseConfiguration()
is deprecated. Please use HBaseConfiguration#create() to construct a plain Configuration
2010-10-06 21:44:30,613 WARN  [main] hbase.HBaseConfiguration(44): instantiating HBaseConfiguration()
is deprecated. Please use HBaseConfiguration#create() to construct a plain Configuration
2010-10-06 21:44:30,623 WARN  [main] hbase.HBaseConfiguration(44): instantiating HBaseConfiguration()
is deprecated. Please use HBaseConfiguration#create() to construct a plain Configuration
2010-10-06 21:44:30,634 WARN  [main] hbase.HBaseConfiguration(44): instantiating HBaseConfiguration()
is deprecated. Please use HBaseConfiguration#create() to construct a plain Configuration

-------------------------------------------------------
 T E S T S
-------------------------------------------------------
Running org.apache.hadoop.hbase.regionserver.TestColumnSeeking
Tests run: 2, Failures: 0, Errors: 0, Skipped: 0, Time elapsed: 14.164 sec
Running org.apache.hadoop.hbase.client.TestMultipleTimestamps
Tests run: 8, Failures: 0, Errors: 0, Skipped: 0, Time elapsed: 110.211 sec
Running org.apache.hadoop.hbase.TestZooKeeper
Tests run: 4, Failures: 1, Errors: 1, Skipped: 0, Time elapsed: 154.382 sec <<< FAILURE!
Running org.apache.hadoop.hbase.regionserver.wal.TestLogRolling
Tests run: 2, Failures: 0, Errors: 1, Skipped: 0, Time elapsed: 295.297 sec <<< FAILURE!
Running org.apache.hadoop.hbase.io.hfile.TestCachedBlockQueue
Tests run: 2, Failures: 0, Errors: 0, Skipped: 0, Time elapsed: 0.018 sec
Running org.apache.hadoop.hbase.filter.TestPrefixFilter
Tests run: 3, Failures: 0, Errors: 0, Skipped: 0, Time elapsed: 0.019 sec
Running org.apache.hadoop.hbase.util.TestMergeMeta
Tests run: 1, Failures: 0, Errors: 0, Skipped: 0, Time elapsed: 70.525 sec
Running org.apache.hadoop.hbase.io.TestImmutableBytesWritable
Tests run: 3, Failures: 0, Errors: 0, Skipped: 0, Time elapsed: 0.018 sec
Running org.apache.hadoop.hbase.io.TestHeapSize
Tests run: 2, Failures: 0, Errors: 0, Skipped: 0, Time elapsed: 0.031 sec
Running org.apache.hadoop.hbase.rest.model.TestRowModel
Tests run: 2, Failures: 0, Errors: 0, Skipped: 0, Time elapsed: 0.035 sec
Running org.apache.hadoop.hbase.io.hfile.TestHFileSeek
Tests run: 1, Failures: 0, Errors: 0, Skipped: 0, Time elapsed: 4.907 sec
Running org.apache.hadoop.hbase.regionserver.TestStore
Tests run: 9, Failures: 0, Errors: 0, Skipped: 0, Time elapsed: 1.321 sec
Running org.apache.hadoop.hbase.zookeeper.TestHQuorumPeer
Tests run: 3, Failures: 0, Errors: 0, Skipped: 0, Time elapsed: 0.189 sec
Running org.apache.hadoop.hbase.rest.TestScannersWithFilters
Tests run: 1, Failures: 0, Errors: 0, Skipped: 0, Time elapsed: 32.813 sec
Running org.apache.hadoop.hbase.io.hfile.TestHFilePerformance
Tests run: 1, Failures: 0, Errors: 0, Skipped: 0, Time elapsed: 8.405 sec
Running org.apache.hadoop.hbase.io.TestHbaseObjectWritable
Tests run: 2, Failures: 0, Errors: 0, Skipped: 0, Time elapsed: 0.044 sec
Running org.apache.hadoop.hbase.regionserver.wal.TestHLogSplit
Tests run: 15, Failures: 0, Errors: 0, Skipped: 0, Time elapsed: 43.34 sec
Running org.apache.hadoop.hbase.thrift.TestThriftServer
Tests run: 1, Failures: 0, Errors: 1, Skipped: 0, Time elapsed: 134.13 sec <<< FAILURE!
Running org.apache.hadoop.hbase.filter.TestColumnPrefixFilter
Tests run: 1, Failures: 0, Errors: 0, Skipped: 0, Time elapsed: 1.145 sec
Running org.apache.hadoop.hbase.master.TestZKBasedOpenCloseRegion
Tests run: 2, Failures: 0, Errors: 0, Skipped: 0, Time elapsed: 37.001 sec
Running org.apache.hadoop.hbase.TestCompare
Tests run: 1, Failures: 0, Errors: 0, Skipped: 0, Time elapsed: 0.017 sec
Running org.apache.hadoop.hbase.regionserver.TestExplicitColumnTracker
Tests run: 4, Failures: 0, Errors: 0, Skipped: 0, Time elapsed: 0.473 sec
Running org.apache.hadoop.hbase.util.TestEnvironmentEdgeManager
Tests run: 2, Failures: 0, Errors: 0, Skipped: 0, Time elapsed: 0.155 sec
Running org.apache.hadoop.hbase.util.TestDefaultEnvironmentEdge
Tests run: 1, Failures: 0, Errors: 0, Skipped: 0, Time elapsed: 0.018 sec
Running org.apache.hadoop.hbase.util.TestFSUtils
Tests run: 1, Failures: 0, Errors: 0, Skipped: 0, Time elapsed: 4.064 sec
Running org.apache.hadoop.hbase.master.TestMasterTransitions
Tests run: 3, Failures: 0, Errors: 0, Skipped: 3, Time elapsed: 38.651 sec
Running org.apache.hadoop.hbase.regionserver.TestScanWildcardColumnTracker
Tests run: 2, Failures: 0, Errors: 0, Skipped: 0, Time elapsed: 0.128 sec
Running org.apache.hadoop.hbase.regionserver.TestKeyValueSkipListSet
Tests run: 4, Failures: 0, Errors: 0, Skipped: 0, Time elapsed: 0.021 sec
Running org.apache.hadoop.hbase.filter.TestPageFilter
Tests run: 2, Failures: 0, Errors: 0, Skipped: 0, Time elapsed: 0.017 sec
Running org.apache.hadoop.hbase.io.hfile.TestSeekTo
Tests run: 3, Failures: 0, Errors: 0, Skipped: 0, Time elapsed: 0.243 sec
Running org.apache.hadoop.hbase.filter.TestColumnPaginationFilter
Tests run: 1, Failures: 0, Errors: 0, Skipped: 0, Time elapsed: 0.016 sec
Running org.apache.hadoop.hbase.rest.TestStatusResource
Tests run: 1, Failures: 0, Errors: 0, Skipped: 0, Time elapsed: 22.807 sec
Running org.apache.hadoop.hbase.client.TestFromClientSide
Tests run: 38, Failures: 0, Errors: 0, Skipped: 3, Time elapsed: 353.904 sec
Running org.apache.hadoop.hbase.replication.TestReplication
Tests run: 5, Failures: 0, Errors: 0, Skipped: 5, Time elapsed: 0.032 sec
Running org.apache.hadoop.hbase.regionserver.TestCompaction
Tests run: 3, Failures: 0, Errors: 0, Skipped: 0, Time elapsed: 102.129 sec
Running org.apache.hadoop.hbase.filter.TestSingleColumnValueFilter
Tests run: 2, Failures: 0, Errors: 0, Skipped: 0, Time elapsed: 0.035 sec
Running org.apache.hadoop.hbase.mapreduce.TestTimeRangeMapRed
Tests run: 1, Failures: 0, Errors: 0, Skipped: 0, Time elapsed: 29.93 sec
Running org.apache.hadoop.hbase.mapreduce.TestSimpleTotalOrderPartitioner
Tests run: 1, Failures: 0, Errors: 0, Skipped: 0, Time elapsed: 0.109 sec
Running org.apache.hadoop.hbase.mapreduce.TestHFileOutputFormat
Tests run: 5, Failures: 0, Errors: 0, Skipped: 0, Time elapsed: 174.968 sec
Running org.apache.hadoop.hbase.regionserver.TestFSErrorsExposed
Tests run: 3, Failures: 0, Errors: 0, Skipped: 0, Time elapsed: 44.494 sec
Running org.apache.hadoop.hbase.regionserver.TestScanDeleteTracker
Tests run: 6, Failures: 0, Errors: 0, Skipped: 0, Time elapsed: 0.219 sec
Running org.apache.hadoop.hbase.client.TestMetaScanner
Tests run: 1, Failures: 0, Errors: 0, Skipped: 0, Time elapsed: 30.072 sec
Running org.apache.hadoop.hbase.metrics.TestMetricsMBeanBase
Tests run: 2, Failures: 0, Errors: 0, Skipped: 0, Time elapsed: 0.032 sec
Running org.apache.hadoop.hbase.TestRegionRebalancing
Tests run: 1, Failures: 1, Errors: 0, Skipped: 0, Time elapsed: 136.845 sec <<< FAILURE!
Running org.apache.hadoop.hbase.filter.TestSingleColumnValueExcludeFilter
Tests run: 1, Failures: 0, Errors: 0, Skipped: 0, Time elapsed: 0.017 sec
Running org.apache.hadoop.hbase.filter.TestInclusiveStopFilter
Tests run: 2, Failures: 0, Errors: 0, Skipped: 0, Time elapsed: 0.018 sec
Running org.apache.hadoop.hbase.rest.TestTableResource
Tests run: 1, Failures: 0, Errors: 0, Skipped: 0, Time elapsed: 84.448 sec
Running org.apache.hadoop.hbase.TestHBaseTestingUtility
Tests run: 4, Failures: 0, Errors: 0, Skipped: 0, Time elapsed: 22.382 sec
Running org.apache.hadoop.hbase.mapreduce.TestLoadIncrementalHFiles
Tests run: 3, Failures: 0, Errors: 0, Skipped: 0, Time elapsed: 44.509 sec
Running org.apache.hadoop.hbase.rest.TestSchemaResource
Tests run: 1, Failures: 0, Errors: 0, Skipped: 0, Time elapsed: 72.026 sec
Running org.apache.hadoop.hbase.regionserver.wal.TestWALReplay
Tests run: 4, Failures: 0, Errors: 0, Skipped: 0, Time elapsed: 26.965 sec
Running org.apache.hadoop.hbase.regionserver.TestKeyValueScanFixture
Tests run: 1, Failures: 0, Errors: 0, Skipped: 0, Time elapsed: 0.016 sec
Running org.apache.hadoop.hbase.rest.model.TestTableListModel
Tests run: 3, Failures: 0, Errors: 0, Skipped: 0, Time elapsed: 0.136 sec
Running org.apache.hadoop.hbase.rest.model.TestColumnSchemaModel
Tests run: 2, Failures: 0, Errors: 0, Skipped: 0, Time elapsed: 0.033 sec
Running org.apache.hadoop.hbase.regionserver.TestStoreFile
Tests run: 6, Failures: 0, Errors: 0, Skipped: 0, Time elapsed: 62.856 sec
Running org.apache.hadoop.hbase.zookeeper.TestZooKeeperNodeTracker
Tests run: 1, Failures: 0, Errors: 0, Skipped: 0, Time elapsed: 0.569 sec
Running org.apache.hadoop.hbase.rest.model.TestScannerModel
Tests run: 3, Failures: 0, Errors: 0, Skipped: 0, Time elapsed: 0.138 sec
Running org.apache.hadoop.hbase.regionserver.wal.TestHLogMethods
Tests run: 1, Failures: 0, Errors: 0, Skipped: 0, Time elapsed: 0.228 sec
Running org.apache.hadoop.hbase.rest.TestVersionResource
Tests run: 1, Failures: 0, Errors: 0, Skipped: 0, Time elapsed: 22.893 sec
Running org.apache.hadoop.hbase.filter.TestFilter
Tests run: 15, Failures: 0, Errors: 0, Skipped: 0, Time elapsed: 2.655 sec
Running org.apache.hadoop.hbase.regionserver.TestWideScanner
Tests run: 1, Failures: 0, Errors: 0, Skipped: 0, Time elapsed: 31.095 sec
Running org.apache.hadoop.hbase.regionserver.TestSplitTransaction
Tests run: 5, Failures: 0, Errors: 0, Skipped: 0, Time elapsed: 4.805 sec
Running org.apache.hadoop.hbase.util.TestMergeTable
Tests run: 1, Failures: 0, Errors: 0, Skipped: 0, Time elapsed: 105.548 sec
Running org.apache.hadoop.hbase.regionserver.TestReadWriteConsistencyControl
Tests run: 1, Failures: 0, Errors: 0, Skipped: 0, Time elapsed: 10.021 sec
Running org.apache.hadoop.hbase.regionserver.TestGetClosestAtOrBefore
Tests run: 3, Failures: 0, Errors: 0, Skipped: 0, Time elapsed: 9.247 sec
Running org.apache.hadoop.hbase.rest.model.TestVersionModel
Tests run: 3, Failures: 0, Errors: 0, Skipped: 0, Time elapsed: 0.137 sec
Running org.apache.hadoop.hbase.rest.model.TestCellSetModel
Tests run: 3, Failures: 0, Errors: 0, Skipped: 0, Time elapsed: 0.147 sec
Running org.apache.hadoop.hbase.rest.client.TestRemoteTable
Tests run: 5, Failures: 0, Errors: 4, Skipped: 0, Time elapsed: 186.972 sec <<< FAILURE!
Running org.apache.hadoop.hbase.rest.model.TestStorageClusterStatusModel
Tests run: 3, Failures: 0, Errors: 0, Skipped: 0, Time elapsed: 0.144 sec
Running org.apache.hadoop.hbase.avro.TestAvroServer
Tests run: 3, Failures: 0, Errors: 2, Skipped: 0, Time elapsed: 145.582 sec <<< FAILURE!
Running org.apache.hadoop.hbase.TestFullLogReconstruction
Tests run: 1, Failures: 0, Errors: 0, Skipped: 0, Time elapsed: 117.935 sec
Running org.apache.hadoop.hbase.TestSerialization
Tests run: 19, Failures: 0, Errors: 0, Skipped: 0, Time elapsed: 0.068 sec
Running org.apache.hadoop.hbase.regionserver.TestKeyValueHeap
Tests run: 3, Failures: 0, Errors: 0, Skipped: 0, Time elapsed: 0.171 sec
Running org.apache.hadoop.hbase.regionserver.TestStoreScanner
Tests run: 14, Failures: 0, Errors: 0, Skipped: 0, Time elapsed: 0.035 sec
Running org.apache.hadoop.hbase.TestHMsg
Tests run: 2, Failures: 0, Errors: 0, Skipped: 0, Time elapsed: 0.023 sec
Running org.apache.hadoop.hbase.io.hfile.TestReseekTo
Tests run: 1, Failures: 0, Errors: 0, Skipped: 0, Time elapsed: 0.28 sec
Running org.apache.hadoop.hbase.util.TestIncrementingEnvironmentEdge
Tests run: 1, Failures: 0, Errors: 0, Skipped: 0, Time elapsed: 0.017 sec
Running org.apache.hadoop.hbase.util.TestKeying
Tests run: 1, Failures: 0, Errors: 0, Skipped: 0, Time elapsed: 0.017 sec
Running org.apache.hadoop.hbase.regionserver.TestScanner
Tests run: 6, Failures: 0, Errors: 0, Skipped: 0, Time elapsed: 63.837 sec
Running org.apache.hadoop.hbase.regionserver.TestHRegionInfo
Tests run: 2, Failures: 0, Errors: 0, Skipped: 0, Time elapsed: 0.018 sec
Running org.apache.hadoop.hbase.master.TestRestartCluster
Tests run: 2, Failures: 0, Errors: 1, Skipped: 0, Time elapsed: 52.733 sec <<< FAILURE!
Running org.apache.hadoop.hbase.client.TestShell
killed.
[INFO] ------------------------------------------------------------------------
[ERROR] BUILD ERROR
[INFO] ------------------------------------------------------------------------
[INFO] Error while executing forked tests.; nested exception is org.apache.maven.surefire.booter.shade.org.codehaus.plexus.util.cli.CommandLineException:
Error while executing external command, process killed.

Process timeout out after 3600 seconds
[INFO] ------------------------------------------------------------------------
[INFO] For more information, run Maven with the -e switch
[INFO] ------------------------------------------------------------------------
[INFO] Total time: 110 minutes 58 seconds
[INFO] Finished at: Wed Oct 06 23:35:14 UTC 2010
[INFO] Final Memory: 55M/568M
[INFO] ------------------------------------------------------------------------
[locks-and-latches] Releasing all the locks
[locks-and-latches] All the locks released
Archiving artifacts
Recording test results


Mime
View raw message