hbase-dev mailing list archives

Site index · List index
Message view « Date » · « Thread »
Top « Date » · « Thread »
From Apache Hudson Server <hud...@hudson.apache.org>
Subject Build failed in Hudson: HBase-TRUNK #1512
Date Wed, 06 Oct 2010 06:41:58 GMT
See <https://hudson.apache.org/hudson/job/HBase-TRUNK/1512/changes>

Changes:

[rawson] HBASE-3073  Build fix

------------------------------------------
[...truncated 1011 lines...]
2010-10-06 04:42:30,794 WARN  [main] hbase.HBaseConfiguration(44): instantiating HBaseConfiguration()
is deprecated. Please use HBaseConfiguration#create() to construct a plain Configuration
2010-10-06 04:42:30,794 WARN  [main] hbase.HBaseConfiguration(44): instantiating HBaseConfiguration()
is deprecated. Please use HBaseConfiguration#create() to construct a plain Configuration
2010-10-06 04:42:30,794 WARN  [main] hbase.HBaseConfiguration(44): instantiating HBaseConfiguration()
is deprecated. Please use HBaseConfiguration#create() to construct a plain Configuration
2010-10-06 04:42:30,795 WARN  [main] hbase.HBaseConfiguration(44): instantiating HBaseConfiguration()
is deprecated. Please use HBaseConfiguration#create() to construct a plain Configuration
2010-10-06 04:42:30,795 WARN  [main] hbase.HBaseConfiguration(44): instantiating HBaseConfiguration()
is deprecated. Please use HBaseConfiguration#create() to construct a plain Configuration
2010-10-06 04:42:30,795 WARN  [main] hbase.HBaseConfiguration(44): instantiating HBaseConfiguration()
is deprecated. Please use HBaseConfiguration#create() to construct a plain Configuration
2010-10-06 04:42:30,795 WARN  [main] hbase.HBaseConfiguration(44): instantiating HBaseConfiguration()
is deprecated. Please use HBaseConfiguration#create() to construct a plain Configuration
2010-10-06 04:42:30,796 WARN  [main] hbase.HBaseConfiguration(44): instantiating HBaseConfiguration()
is deprecated. Please use HBaseConfiguration#create() to construct a plain Configuration
2010-10-06 04:42:30,796 WARN  [main] hbase.HBaseConfiguration(44): instantiating HBaseConfiguration()
is deprecated. Please use HBaseConfiguration#create() to construct a plain Configuration
2010-10-06 04:42:30,797 WARN  [main] hbase.HBaseConfiguration(44): instantiating HBaseConfiguration()
is deprecated. Please use HBaseConfiguration#create() to construct a plain Configuration
2010-10-06 04:42:30,797 WARN  [main] hbase.HBaseConfiguration(44): instantiating HBaseConfiguration()
is deprecated. Please use HBaseConfiguration#create() to construct a plain Configuration
2010-10-06 04:42:30,797 WARN  [main] hbase.HBaseConfiguration(44): instantiating HBaseConfiguration()
is deprecated. Please use HBaseConfiguration#create() to construct a plain Configuration
2010-10-06 04:42:30,797 WARN  [main] hbase.HBaseConfiguration(44): instantiating HBaseConfiguration()
is deprecated. Please use HBaseConfiguration#create() to construct a plain Configuration
2010-10-06 04:42:30,798 WARN  [main] hbase.HBaseConfiguration(44): instantiating HBaseConfiguration()
is deprecated. Please use HBaseConfiguration#create() to construct a plain Configuration
2010-10-06 04:42:30,798 WARN  [main] hbase.HBaseConfiguration(44): instantiating HBaseConfiguration()
is deprecated. Please use HBaseConfiguration#create() to construct a plain Configuration
2010-10-06 04:42:30,798 WARN  [main] hbase.HBaseConfiguration(44): instantiating HBaseConfiguration()
is deprecated. Please use HBaseConfiguration#create() to construct a plain Configuration
2010-10-06 04:42:30,798 WARN  [main] hbase.HBaseConfiguration(44): instantiating HBaseConfiguration()
is deprecated. Please use HBaseConfiguration#create() to construct a plain Configuration
2010-10-06 04:42:30,799 WARN  [main] hbase.HBaseConfiguration(44): instantiating HBaseConfiguration()
is deprecated. Please use HBaseConfiguration#create() to construct a plain Configuration
2010-10-06 04:42:30,799 WARN  [main] hbase.HBaseConfiguration(44): instantiating HBaseConfiguration()
is deprecated. Please use HBaseConfiguration#create() to construct a plain Configuration
2010-10-06 04:42:30,799 WARN  [main] hbase.HBaseConfiguration(44): instantiating HBaseConfiguration()
is deprecated. Please use HBaseConfiguration#create() to construct a plain Configuration
2010-10-06 04:42:30,799 WARN  [main] hbase.HBaseConfiguration(44): instantiating HBaseConfiguration()
is deprecated. Please use HBaseConfiguration#create() to construct a plain Configuration
2010-10-06 04:42:30,800 WARN  [main] hbase.HBaseConfiguration(44): instantiating HBaseConfiguration()
is deprecated. Please use HBaseConfiguration#create() to construct a plain Configuration
2010-10-06 04:42:30,800 WARN  [main] hbase.HBaseConfiguration(44): instantiating HBaseConfiguration()
is deprecated. Please use HBaseConfiguration#create() to construct a plain Configuration
2010-10-06 04:42:30,800 WARN  [main] hbase.HBaseConfiguration(44): instantiating HBaseConfiguration()
is deprecated. Please use HBaseConfiguration#create() to construct a plain Configuration
2010-10-06 04:42:30,800 WARN  [main] hbase.HBaseConfiguration(44): instantiating HBaseConfiguration()
is deprecated. Please use HBaseConfiguration#create() to construct a plain Configuration
2010-10-06 04:42:30,801 WARN  [main] hbase.HBaseConfiguration(44): instantiating HBaseConfiguration()
is deprecated. Please use HBaseConfiguration#create() to construct a plain Configuration
2010-10-06 04:42:30,801 WARN  [main] hbase.HBaseConfiguration(44): instantiating HBaseConfiguration()
is deprecated. Please use HBaseConfiguration#create() to construct a plain Configuration
2010-10-06 04:42:30,801 WARN  [main] hbase.HBaseConfiguration(44): instantiating HBaseConfiguration()
is deprecated. Please use HBaseConfiguration#create() to construct a plain Configuration
2010-10-06 04:42:30,801 WARN  [main] hbase.HBaseConfiguration(44): instantiating HBaseConfiguration()
is deprecated. Please use HBaseConfiguration#create() to construct a plain Configuration
2010-10-06 04:42:30,802 WARN  [main] hbase.HBaseConfiguration(44): instantiating HBaseConfiguration()
is deprecated. Please use HBaseConfiguration#create() to construct a plain Configuration
2010-10-06 04:42:30,802 WARN  [main] hbase.HBaseConfiguration(44): instantiating HBaseConfiguration()
is deprecated. Please use HBaseConfiguration#create() to construct a plain Configuration
2010-10-06 04:42:30,802 WARN  [main] hbase.HBaseConfiguration(44): instantiating HBaseConfiguration()
is deprecated. Please use HBaseConfiguration#create() to construct a plain Configuration
2010-10-06 04:42:30,802 WARN  [main] hbase.HBaseConfiguration(44): instantiating HBaseConfiguration()
is deprecated. Please use HBaseConfiguration#create() to construct a plain Configuration
2010-10-06 04:42:30,803 WARN  [main] hbase.HBaseConfiguration(44): instantiating HBaseConfiguration()
is deprecated. Please use HBaseConfiguration#create() to construct a plain Configuration
2010-10-06 04:42:30,803 WARN  [main] hbase.HBaseConfiguration(44): instantiating HBaseConfiguration()
is deprecated. Please use HBaseConfiguration#create() to construct a plain Configuration
2010-10-06 04:42:30,803 WARN  [main] hbase.HBaseConfiguration(44): instantiating HBaseConfiguration()
is deprecated. Please use HBaseConfiguration#create() to construct a plain Configuration
2010-10-06 04:42:30,803 WARN  [main] hbase.HBaseConfiguration(44): instantiating HBaseConfiguration()
is deprecated. Please use HBaseConfiguration#create() to construct a plain Configuration
2010-10-06 04:42:30,804 WARN  [main] hbase.HBaseConfiguration(44): instantiating HBaseConfiguration()
is deprecated. Please use HBaseConfiguration#create() to construct a plain Configuration
2010-10-06 04:42:30,804 WARN  [main] hbase.HBaseConfiguration(44): instantiating HBaseConfiguration()
is deprecated. Please use HBaseConfiguration#create() to construct a plain Configuration
2010-10-06 04:42:30,804 WARN  [main] hbase.HBaseConfiguration(44): instantiating HBaseConfiguration()
is deprecated. Please use HBaseConfiguration#create() to construct a plain Configuration
2010-10-06 04:42:30,804 WARN  [main] hbase.HBaseConfiguration(44): instantiating HBaseConfiguration()
is deprecated. Please use HBaseConfiguration#create() to construct a plain Configuration
2010-10-06 04:42:30,805 WARN  [main] hbase.HBaseConfiguration(44): instantiating HBaseConfiguration()
is deprecated. Please use HBaseConfiguration#create() to construct a plain Configuration
2010-10-06 04:42:30,805 WARN  [main] hbase.HBaseConfiguration(44): instantiating HBaseConfiguration()
is deprecated. Please use HBaseConfiguration#create() to construct a plain Configuration
2010-10-06 04:42:30,805 WARN  [main] hbase.HBaseConfiguration(44): instantiating HBaseConfiguration()
is deprecated. Please use HBaseConfiguration#create() to construct a plain Configuration
2010-10-06 04:42:30,806 WARN  [main] hbase.HBaseConfiguration(44): instantiating HBaseConfiguration()
is deprecated. Please use HBaseConfiguration#create() to construct a plain Configuration
2010-10-06 04:42:30,807 WARN  [main] hbase.HBaseConfiguration(44): instantiating HBaseConfiguration()
is deprecated. Please use HBaseConfiguration#create() to construct a plain Configuration
2010-10-06 04:42:30,823 WARN  [main] hbase.HBaseConfiguration(44): instantiating HBaseConfiguration()
is deprecated. Please use HBaseConfiguration#create() to construct a plain Configuration
2010-10-06 04:42:30,952 WARN  [main] hbase.HBaseConfiguration(44): instantiating HBaseConfiguration()
is deprecated. Please use HBaseConfiguration#create() to construct a plain Configuration
2010-10-06 04:42:30,963 WARN  [main] hbase.HBaseConfiguration(44): instantiating HBaseConfiguration()
is deprecated. Please use HBaseConfiguration#create() to construct a plain Configuration
2010-10-06 04:42:30,973 WARN  [main] hbase.HBaseConfiguration(44): instantiating HBaseConfiguration()
is deprecated. Please use HBaseConfiguration#create() to construct a plain Configuration

-------------------------------------------------------
 T E S T S
-------------------------------------------------------
Running org.apache.hadoop.hbase.regionserver.TestColumnSeeking
Tests run: 2, Failures: 0, Errors: 0, Skipped: 0, Time elapsed: 11.583 sec
Running org.apache.hadoop.hbase.client.TestMultipleTimestamps
Tests run: 8, Failures: 0, Errors: 0, Skipped: 0, Time elapsed: 106.812 sec
Running org.apache.hadoop.hbase.TestZooKeeper
Tests run: 4, Failures: 1, Errors: 1, Skipped: 0, Time elapsed: 155.282 sec <<< FAILURE!
Running org.apache.hadoop.hbase.regionserver.wal.TestLogRolling
Tests run: 2, Failures: 0, Errors: 1, Skipped: 0, Time elapsed: 297.863 sec <<< FAILURE!
Running org.apache.hadoop.hbase.io.hfile.TestCachedBlockQueue
Tests run: 2, Failures: 0, Errors: 0, Skipped: 0, Time elapsed: 0.018 sec
Running org.apache.hadoop.hbase.filter.TestPrefixFilter
Tests run: 3, Failures: 0, Errors: 0, Skipped: 0, Time elapsed: 0.019 sec
Running org.apache.hadoop.hbase.util.TestMergeMeta
Tests run: 1, Failures: 0, Errors: 0, Skipped: 0, Time elapsed: 68.98 sec
Running org.apache.hadoop.hbase.io.TestImmutableBytesWritable
Tests run: 3, Failures: 0, Errors: 0, Skipped: 0, Time elapsed: 0.018 sec
Running org.apache.hadoop.hbase.io.TestHeapSize
Tests run: 2, Failures: 0, Errors: 0, Skipped: 0, Time elapsed: 0.03 sec
Running org.apache.hadoop.hbase.rest.model.TestRowModel
Tests run: 2, Failures: 0, Errors: 0, Skipped: 0, Time elapsed: 0.035 sec
Running org.apache.hadoop.hbase.io.hfile.TestHFileSeek
Tests run: 1, Failures: 0, Errors: 0, Skipped: 0, Time elapsed: 4.931 sec
Running org.apache.hadoop.hbase.regionserver.TestStore
Tests run: 8, Failures: 0, Errors: 0, Skipped: 0, Time elapsed: 0.844 sec
Running org.apache.hadoop.hbase.zookeeper.TestHQuorumPeer
Tests run: 3, Failures: 0, Errors: 0, Skipped: 0, Time elapsed: 0.185 sec
Running org.apache.hadoop.hbase.rest.TestScannersWithFilters
Tests run: 1, Failures: 0, Errors: 0, Skipped: 0, Time elapsed: 33.248 sec
Running org.apache.hadoop.hbase.io.hfile.TestHFilePerformance
Tests run: 1, Failures: 0, Errors: 0, Skipped: 0, Time elapsed: 5.829 sec
Running org.apache.hadoop.hbase.io.TestHbaseObjectWritable
Tests run: 2, Failures: 0, Errors: 0, Skipped: 0, Time elapsed: 0.045 sec
Running org.apache.hadoop.hbase.regionserver.wal.TestHLogSplit
Tests run: 15, Failures: 0, Errors: 0, Skipped: 0, Time elapsed: 45.776 sec
Running org.apache.hadoop.hbase.thrift.TestThriftServer
Tests run: 1, Failures: 0, Errors: 1, Skipped: 0, Time elapsed: 111.269 sec <<< FAILURE!
Running org.apache.hadoop.hbase.filter.TestColumnPrefixFilter
Tests run: 1, Failures: 0, Errors: 0, Skipped: 0, Time elapsed: 1.14 sec
Running org.apache.hadoop.hbase.master.TestZKBasedOpenCloseRegion
Tests run: 2, Failures: 0, Errors: 0, Skipped: 0, Time elapsed: 62.523 sec
Running org.apache.hadoop.hbase.TestCompare
Tests run: 1, Failures: 0, Errors: 0, Skipped: 0, Time elapsed: 0.017 sec
Running org.apache.hadoop.hbase.regionserver.TestExplicitColumnTracker
Tests run: 4, Failures: 0, Errors: 0, Skipped: 0, Time elapsed: 0.471 sec
Running org.apache.hadoop.hbase.util.TestEnvironmentEdgeManager
Tests run: 2, Failures: 0, Errors: 0, Skipped: 0, Time elapsed: 0.153 sec
Running org.apache.hadoop.hbase.util.TestDefaultEnvironmentEdge
Tests run: 1, Failures: 0, Errors: 0, Skipped: 0, Time elapsed: 0.018 sec
Running org.apache.hadoop.hbase.util.TestFSUtils
Tests run: 1, Failures: 0, Errors: 0, Skipped: 0, Time elapsed: 4.367 sec
Running org.apache.hadoop.hbase.master.TestMasterTransitions
Tests run: 3, Failures: 0, Errors: 0, Skipped: 3, Time elapsed: 130.812 sec
Running org.apache.hadoop.hbase.regionserver.TestScanWildcardColumnTracker
Tests run: 2, Failures: 0, Errors: 0, Skipped: 0, Time elapsed: 0.123 sec
Running org.apache.hadoop.hbase.regionserver.TestKeyValueSkipListSet
Tests run: 4, Failures: 0, Errors: 0, Skipped: 0, Time elapsed: 0.021 sec
Running org.apache.hadoop.hbase.filter.TestPageFilter
Tests run: 2, Failures: 0, Errors: 0, Skipped: 0, Time elapsed: 0.016 sec
Running org.apache.hadoop.hbase.io.hfile.TestSeekTo
Tests run: 3, Failures: 0, Errors: 0, Skipped: 0, Time elapsed: 0.241 sec
Running org.apache.hadoop.hbase.filter.TestColumnPaginationFilter
Tests run: 1, Failures: 0, Errors: 0, Skipped: 0, Time elapsed: 0.015 sec
Running org.apache.hadoop.hbase.rest.TestStatusResource
Tests run: 1, Failures: 0, Errors: 0, Skipped: 0, Time elapsed: 22.739 sec
Running org.apache.hadoop.hbase.client.TestFromClientSide
Tests run: 38, Failures: 0, Errors: 0, Skipped: 3, Time elapsed: 369.715 sec
Running org.apache.hadoop.hbase.replication.TestReplication
Tests run: 5, Failures: 0, Errors: 0, Skipped: 5, Time elapsed: 0.032 sec
Running org.apache.hadoop.hbase.regionserver.TestCompaction
Tests run: 3, Failures: 0, Errors: 0, Skipped: 0, Time elapsed: 110.855 sec
Running org.apache.hadoop.hbase.filter.TestSingleColumnValueFilter
Tests run: 2, Failures: 0, Errors: 0, Skipped: 0, Time elapsed: 0.036 sec
Running org.apache.hadoop.hbase.mapreduce.TestTimeRangeMapRed
Tests run: 1, Failures: 0, Errors: 0, Skipped: 0, Time elapsed: 32.723 sec
Running org.apache.hadoop.hbase.mapreduce.TestSimpleTotalOrderPartitioner
Tests run: 1, Failures: 0, Errors: 0, Skipped: 0, Time elapsed: 0.103 sec
Running org.apache.hadoop.hbase.mapreduce.TestHFileOutputFormat
Tests run: 5, Failures: 0, Errors: 0, Skipped: 0, Time elapsed: 160.492 sec
Running org.apache.hadoop.hbase.regionserver.TestFSErrorsExposed
Tests run: 3, Failures: 0, Errors: 0, Skipped: 0, Time elapsed: 47.579 sec
Running org.apache.hadoop.hbase.regionserver.TestScanDeleteTracker
Tests run: 6, Failures: 0, Errors: 0, Skipped: 0, Time elapsed: 0.206 sec
Running org.apache.hadoop.hbase.client.TestMetaScanner
Tests run: 1, Failures: 0, Errors: 0, Skipped: 0, Time elapsed: 31.571 sec
Running org.apache.hadoop.hbase.metrics.TestMetricsMBeanBase
Tests run: 2, Failures: 0, Errors: 0, Skipped: 0, Time elapsed: 0.031 sec
Running org.apache.hadoop.hbase.TestRegionRebalancing
Tests run: 1, Failures: 0, Errors: 0, Skipped: 0, Time elapsed: 121.724 sec
Running org.apache.hadoop.hbase.filter.TestSingleColumnValueExcludeFilter
Tests run: 1, Failures: 0, Errors: 0, Skipped: 0, Time elapsed: 0.017 sec
Running org.apache.hadoop.hbase.filter.TestInclusiveStopFilter
Tests run: 2, Failures: 0, Errors: 0, Skipped: 0, Time elapsed: 0.017 sec
Running org.apache.hadoop.hbase.rest.TestTableResource
Tests run: 1, Failures: 0, Errors: 0, Skipped: 0, Time elapsed: 56.122 sec
Running org.apache.hadoop.hbase.TestHBaseTestingUtility
Tests run: 4, Failures: 0, Errors: 0, Skipped: 0, Time elapsed: 23.261 sec
Running org.apache.hadoop.hbase.mapreduce.TestLoadIncrementalHFiles
Tests run: 3, Failures: 0, Errors: 0, Skipped: 0, Time elapsed: 45.973 sec
Running org.apache.hadoop.hbase.rest.TestSchemaResource
Tests run: 1, Failures: 0, Errors: 0, Skipped: 0, Time elapsed: 36.899 sec
Running org.apache.hadoop.hbase.regionserver.wal.TestWALReplay
Tests run: 4, Failures: 0, Errors: 0, Skipped: 0, Time elapsed: 29.173 sec
Running org.apache.hadoop.hbase.regionserver.TestKeyValueScanFixture
Tests run: 1, Failures: 0, Errors: 0, Skipped: 0, Time elapsed: 0.017 sec
Running org.apache.hadoop.hbase.rest.model.TestTableListModel
Tests run: 3, Failures: 0, Errors: 0, Skipped: 0, Time elapsed: 0.137 sec
Running org.apache.hadoop.hbase.rest.model.TestColumnSchemaModel
Tests run: 2, Failures: 0, Errors: 0, Skipped: 0, Time elapsed: 0.032 sec
Running org.apache.hadoop.hbase.regionserver.TestStoreFile
Tests run: 6, Failures: 0, Errors: 0, Skipped: 0, Time elapsed: 61.932 sec
Running org.apache.hadoop.hbase.zookeeper.TestZooKeeperNodeTracker
Tests run: 1, Failures: 0, Errors: 0, Skipped: 0, Time elapsed: 0.553 sec
Running org.apache.hadoop.hbase.rest.model.TestScannerModel
Tests run: 3, Failures: 0, Errors: 0, Skipped: 0, Time elapsed: 0.138 sec
Running org.apache.hadoop.hbase.regionserver.wal.TestHLogMethods
Tests run: 1, Failures: 0, Errors: 0, Skipped: 0, Time elapsed: 0.217 sec
Running org.apache.hadoop.hbase.rest.TestVersionResource
Tests run: 1, Failures: 0, Errors: 0, Skipped: 0, Time elapsed: 22.163 sec
Running org.apache.hadoop.hbase.filter.TestFilter
Tests run: 15, Failures: 0, Errors: 0, Skipped: 0, Time elapsed: 2.674 sec
Running org.apache.hadoop.hbase.regionserver.TestWideScanner
Tests run: 1, Failures: 0, Errors: 0, Skipped: 0, Time elapsed: 10.301 sec
Running org.apache.hadoop.hbase.regionserver.TestSplitTransaction
Tests run: 5, Failures: 0, Errors: 0, Skipped: 0, Time elapsed: 4.289 sec
Running org.apache.hadoop.hbase.util.TestMergeTable
Tests run: 1, Failures: 0, Errors: 0, Skipped: 0, Time elapsed: 120.587 sec
Running org.apache.hadoop.hbase.regionserver.TestReadWriteConsistencyControl
Tests run: 1, Failures: 0, Errors: 0, Skipped: 0, Time elapsed: 10.021 sec
Running org.apache.hadoop.hbase.regionserver.TestGetClosestAtOrBefore
Tests run: 3, Failures: 0, Errors: 0, Skipped: 0, Time elapsed: 9.323 sec
Running org.apache.hadoop.hbase.rest.model.TestVersionModel
Tests run: 3, Failures: 0, Errors: 0, Skipped: 0, Time elapsed: 0.137 sec
Running org.apache.hadoop.hbase.rest.model.TestCellSetModel
Tests run: 3, Failures: 0, Errors: 0, Skipped: 0, Time elapsed: 0.144 sec
Running org.apache.hadoop.hbase.rest.client.TestRemoteTable
Tests run: 5, Failures: 0, Errors: 4, Skipped: 0, Time elapsed: 319.632 sec <<< FAILURE!
Running org.apache.hadoop.hbase.rest.model.TestStorageClusterStatusModel
Tests run: 3, Failures: 0, Errors: 0, Skipped: 0, Time elapsed: 0.144 sec
Running org.apache.hadoop.hbase.avro.TestAvroServer
Tests run: 3, Failures: 0, Errors: 2, Skipped: 0, Time elapsed: 116.779 sec <<< FAILURE!
Running org.apache.hadoop.hbase.TestFullLogReconstruction
Tests run: 1, Failures: 0, Errors: 0, Skipped: 0, Time elapsed: 124.888 sec
Running org.apache.hadoop.hbase.TestSerialization
Tests run: 19, Failures: 0, Errors: 0, Skipped: 0, Time elapsed: 0.067 sec
Running org.apache.hadoop.hbase.regionserver.TestKeyValueHeap
Tests run: 3, Failures: 0, Errors: 0, Skipped: 0, Time elapsed: 0.162 sec
Running org.apache.hadoop.hbase.regionserver.TestStoreScanner
Tests run: 14, Failures: 0, Errors: 0, Skipped: 0, Time elapsed: 0.035 sec
Running org.apache.hadoop.hbase.TestHMsg
Tests run: 2, Failures: 0, Errors: 0, Skipped: 0, Time elapsed: 0.023 sec
Running org.apache.hadoop.hbase.io.hfile.TestReseekTo
Tests run: 1, Failures: 0, Errors: 0, Skipped: 0, Time elapsed: 0.275 sec
Running org.apache.hadoop.hbase.util.TestIncrementingEnvironmentEdge
Tests run: 1, Failures: 0, Errors: 0, Skipped: 0, Time elapsed: 0.017 sec
Running org.apache.hadoop.hbase.util.TestKeying
Tests run: 1, Failures: 0, Errors: 0, Skipped: 0, Time elapsed: 0.017 sec
Running org.apache.hadoop.hbase.regionserver.TestScanner
Tests run: 6, Failures: 0, Errors: 0, Skipped: 0, Time elapsed: 92.011 sec
Running org.apache.hadoop.hbase.regionserver.TestHRegionInfo
Tests run: 2, Failures: 0, Errors: 0, Skipped: 0, Time elapsed: 0.018 sec
Running org.apache.hadoop.hbase.master.TestRestartCluster
Tests run: 2, Failures: 0, Errors: 0, Skipped: 0, Time elapsed: 99.579 sec
Running org.apache.hadoop.hbase.client.TestShell
Tests run: 1, Failures: 0, Errors: 0, Skipped: 0, Time elapsed: 241.324 sec
Running org.apache.hadoop.hbase.rest.model.TestTableInfoModel
Tests run: 3, Failures: 0, Errors: 0, Skipped: 0, Time elapsed: 0.139 sec
Running org.apache.hadoop.hbase.regionserver.TestMinorCompactingStoreScanner
Tests run: 2, Failures: 0, Errors: 0, Skipped: 0, Time elapsed: 0.019 sec
Running org.apache.hadoop.hbase.TestInfoServers
Tests run: 1, Failures: 0, Errors: 0, Skipped: 0, Time elapsed: 48.307 sec
Running org.apache.hadoop.hbase.master.TestLogsCleaner
Tests run: 1, Failures: 0, Errors: 0, Skipped: 1, Time elapsed: 0.149 sec
Running org.apache.hadoop.hbase.regionserver.TestMasterAddressManager
Tests run: 1, Failures: 0, Errors: 0, Skipped: 0, Time elapsed: 0.462 sec
Running org.apache.hadoop.hbase.regionserver.TestQueryMatcher
Tests run: 4, Failures: 0, Errors: 0, Skipped: 0, Time elapsed: 0.167 sec
Running org.apache.hadoop.hbase.client.TestAdmin
killed.
[INFO] ------------------------------------------------------------------------
[ERROR] BUILD ERROR
[INFO] ------------------------------------------------------------------------
[INFO] Error while executing forked tests.; nested exception is org.apache.maven.surefire.booter.shade.org.codehaus.plexus.util.cli.CommandLineException:
Error while executing external command, process killed.

Process timeout out after 3600 seconds
[INFO] ------------------------------------------------------------------------
[INFO] For more information, run Maven with the -e switch
[INFO] ------------------------------------------------------------------------
[INFO] Total time: 119 minutes 29 seconds
[INFO] Finished at: Wed Oct 06 06:41:45 UTC 2010
[INFO] Final Memory: 55M/604M
[INFO] ------------------------------------------------------------------------
[locks-and-latches] Releasing all the locks
[locks-and-latches] All the locks released
Archiving artifacts
Recording test results


Mime
View raw message