hbase-dev mailing list archives

Site index · List index
Message view « Date » · « Thread »
Top « Date » · « Thread »
From Apache Hudson Server <hud...@hudson.apache.org>
Subject Build failed in Hudson: HBase-TRUNK #1506
Date Tue, 05 Oct 2010 01:12:59 GMT
See <https://hudson.apache.org/hudson/job/HBase-TRUNK/1506/changes>

Changes:

[stack] Adding even more logging to figure why we're reading old root region location though
its been updated in zk -- for failing TestZooKeeper

[stack] Add wait on disable to complete to TestHFileOutputFormat by watching regions in transition...;
seems to fix unit test

[stack] Adding even more logging to figure why we're reading old root region location though
its been updated in zk -- for failing TestZooKeeper

[stack] Adding even more logging to figure why we're reading old root region location though
its been updated in zk -- for failing TestZooKeeper

------------------------------------------
[...truncated 1010 lines...]
2010-10-04 23:16:10,010 WARN  [main] hbase.HBaseConfiguration(44): instantiating HBaseConfiguration()
is deprecated. Please use HBaseConfiguration#create() to construct a plain Configuration
2010-10-04 23:16:10,011 WARN  [main] hbase.HBaseConfiguration(44): instantiating HBaseConfiguration()
is deprecated. Please use HBaseConfiguration#create() to construct a plain Configuration
2010-10-04 23:16:10,011 WARN  [main] hbase.HBaseConfiguration(44): instantiating HBaseConfiguration()
is deprecated. Please use HBaseConfiguration#create() to construct a plain Configuration
2010-10-04 23:16:10,011 WARN  [main] hbase.HBaseConfiguration(44): instantiating HBaseConfiguration()
is deprecated. Please use HBaseConfiguration#create() to construct a plain Configuration
2010-10-04 23:16:10,012 WARN  [main] hbase.HBaseConfiguration(44): instantiating HBaseConfiguration()
is deprecated. Please use HBaseConfiguration#create() to construct a plain Configuration
2010-10-04 23:16:10,012 WARN  [main] hbase.HBaseConfiguration(44): instantiating HBaseConfiguration()
is deprecated. Please use HBaseConfiguration#create() to construct a plain Configuration
2010-10-04 23:16:10,012 WARN  [main] hbase.HBaseConfiguration(44): instantiating HBaseConfiguration()
is deprecated. Please use HBaseConfiguration#create() to construct a plain Configuration
2010-10-04 23:16:10,013 WARN  [main] hbase.HBaseConfiguration(44): instantiating HBaseConfiguration()
is deprecated. Please use HBaseConfiguration#create() to construct a plain Configuration
2010-10-04 23:16:10,013 WARN  [main] hbase.HBaseConfiguration(44): instantiating HBaseConfiguration()
is deprecated. Please use HBaseConfiguration#create() to construct a plain Configuration
2010-10-04 23:16:10,013 WARN  [main] hbase.HBaseConfiguration(44): instantiating HBaseConfiguration()
is deprecated. Please use HBaseConfiguration#create() to construct a plain Configuration
2010-10-04 23:16:10,014 WARN  [main] hbase.HBaseConfiguration(44): instantiating HBaseConfiguration()
is deprecated. Please use HBaseConfiguration#create() to construct a plain Configuration
2010-10-04 23:16:10,014 WARN  [main] hbase.HBaseConfiguration(44): instantiating HBaseConfiguration()
is deprecated. Please use HBaseConfiguration#create() to construct a plain Configuration
2010-10-04 23:16:10,014 WARN  [main] hbase.HBaseConfiguration(44): instantiating HBaseConfiguration()
is deprecated. Please use HBaseConfiguration#create() to construct a plain Configuration
2010-10-04 23:16:10,015 WARN  [main] hbase.HBaseConfiguration(44): instantiating HBaseConfiguration()
is deprecated. Please use HBaseConfiguration#create() to construct a plain Configuration
2010-10-04 23:16:10,015 WARN  [main] hbase.HBaseConfiguration(44): instantiating HBaseConfiguration()
is deprecated. Please use HBaseConfiguration#create() to construct a plain Configuration
2010-10-04 23:16:10,015 WARN  [main] hbase.HBaseConfiguration(44): instantiating HBaseConfiguration()
is deprecated. Please use HBaseConfiguration#create() to construct a plain Configuration
2010-10-04 23:16:10,015 WARN  [main] hbase.HBaseConfiguration(44): instantiating HBaseConfiguration()
is deprecated. Please use HBaseConfiguration#create() to construct a plain Configuration
2010-10-04 23:16:10,016 WARN  [main] hbase.HBaseConfiguration(44): instantiating HBaseConfiguration()
is deprecated. Please use HBaseConfiguration#create() to construct a plain Configuration
2010-10-04 23:16:10,016 WARN  [main] hbase.HBaseConfiguration(44): instantiating HBaseConfiguration()
is deprecated. Please use HBaseConfiguration#create() to construct a plain Configuration
2010-10-04 23:16:10,016 WARN  [main] hbase.HBaseConfiguration(44): instantiating HBaseConfiguration()
is deprecated. Please use HBaseConfiguration#create() to construct a plain Configuration
2010-10-04 23:16:10,017 WARN  [main] hbase.HBaseConfiguration(44): instantiating HBaseConfiguration()
is deprecated. Please use HBaseConfiguration#create() to construct a plain Configuration
2010-10-04 23:16:10,017 WARN  [main] hbase.HBaseConfiguration(44): instantiating HBaseConfiguration()
is deprecated. Please use HBaseConfiguration#create() to construct a plain Configuration
2010-10-04 23:16:10,017 WARN  [main] hbase.HBaseConfiguration(44): instantiating HBaseConfiguration()
is deprecated. Please use HBaseConfiguration#create() to construct a plain Configuration
2010-10-04 23:16:10,017 WARN  [main] hbase.HBaseConfiguration(44): instantiating HBaseConfiguration()
is deprecated. Please use HBaseConfiguration#create() to construct a plain Configuration
2010-10-04 23:16:10,018 WARN  [main] hbase.HBaseConfiguration(44): instantiating HBaseConfiguration()
is deprecated. Please use HBaseConfiguration#create() to construct a plain Configuration
2010-10-04 23:16:10,018 WARN  [main] hbase.HBaseConfiguration(44): instantiating HBaseConfiguration()
is deprecated. Please use HBaseConfiguration#create() to construct a plain Configuration
2010-10-04 23:16:10,018 WARN  [main] hbase.HBaseConfiguration(44): instantiating HBaseConfiguration()
is deprecated. Please use HBaseConfiguration#create() to construct a plain Configuration
2010-10-04 23:16:10,019 WARN  [main] hbase.HBaseConfiguration(44): instantiating HBaseConfiguration()
is deprecated. Please use HBaseConfiguration#create() to construct a plain Configuration
2010-10-04 23:16:10,019 WARN  [main] hbase.HBaseConfiguration(44): instantiating HBaseConfiguration()
is deprecated. Please use HBaseConfiguration#create() to construct a plain Configuration
2010-10-04 23:16:10,019 WARN  [main] hbase.HBaseConfiguration(44): instantiating HBaseConfiguration()
is deprecated. Please use HBaseConfiguration#create() to construct a plain Configuration
2010-10-04 23:16:10,019 WARN  [main] hbase.HBaseConfiguration(44): instantiating HBaseConfiguration()
is deprecated. Please use HBaseConfiguration#create() to construct a plain Configuration
2010-10-04 23:16:10,020 WARN  [main] hbase.HBaseConfiguration(44): instantiating HBaseConfiguration()
is deprecated. Please use HBaseConfiguration#create() to construct a plain Configuration
2010-10-04 23:16:10,020 WARN  [main] hbase.HBaseConfiguration(44): instantiating HBaseConfiguration()
is deprecated. Please use HBaseConfiguration#create() to construct a plain Configuration
2010-10-04 23:16:10,020 WARN  [main] hbase.HBaseConfiguration(44): instantiating HBaseConfiguration()
is deprecated. Please use HBaseConfiguration#create() to construct a plain Configuration
2010-10-04 23:16:10,021 WARN  [main] hbase.HBaseConfiguration(44): instantiating HBaseConfiguration()
is deprecated. Please use HBaseConfiguration#create() to construct a plain Configuration
2010-10-04 23:16:10,021 WARN  [main] hbase.HBaseConfiguration(44): instantiating HBaseConfiguration()
is deprecated. Please use HBaseConfiguration#create() to construct a plain Configuration
2010-10-04 23:16:10,021 WARN  [main] hbase.HBaseConfiguration(44): instantiating HBaseConfiguration()
is deprecated. Please use HBaseConfiguration#create() to construct a plain Configuration
2010-10-04 23:16:10,021 WARN  [main] hbase.HBaseConfiguration(44): instantiating HBaseConfiguration()
is deprecated. Please use HBaseConfiguration#create() to construct a plain Configuration
2010-10-04 23:16:10,022 WARN  [main] hbase.HBaseConfiguration(44): instantiating HBaseConfiguration()
is deprecated. Please use HBaseConfiguration#create() to construct a plain Configuration
2010-10-04 23:16:10,022 WARN  [main] hbase.HBaseConfiguration(44): instantiating HBaseConfiguration()
is deprecated. Please use HBaseConfiguration#create() to construct a plain Configuration
2010-10-04 23:16:10,022 WARN  [main] hbase.HBaseConfiguration(44): instantiating HBaseConfiguration()
is deprecated. Please use HBaseConfiguration#create() to construct a plain Configuration
2010-10-04 23:16:10,023 WARN  [main] hbase.HBaseConfiguration(44): instantiating HBaseConfiguration()
is deprecated. Please use HBaseConfiguration#create() to construct a plain Configuration
2010-10-04 23:16:10,023 WARN  [main] hbase.HBaseConfiguration(44): instantiating HBaseConfiguration()
is deprecated. Please use HBaseConfiguration#create() to construct a plain Configuration
2010-10-04 23:16:10,023 WARN  [main] hbase.HBaseConfiguration(44): instantiating HBaseConfiguration()
is deprecated. Please use HBaseConfiguration#create() to construct a plain Configuration
2010-10-04 23:16:10,024 WARN  [main] hbase.HBaseConfiguration(44): instantiating HBaseConfiguration()
is deprecated. Please use HBaseConfiguration#create() to construct a plain Configuration
2010-10-04 23:16:10,025 WARN  [main] hbase.HBaseConfiguration(44): instantiating HBaseConfiguration()
is deprecated. Please use HBaseConfiguration#create() to construct a plain Configuration
2010-10-04 23:16:10,040 WARN  [main] hbase.HBaseConfiguration(44): instantiating HBaseConfiguration()
is deprecated. Please use HBaseConfiguration#create() to construct a plain Configuration
2010-10-04 23:16:10,169 WARN  [main] hbase.HBaseConfiguration(44): instantiating HBaseConfiguration()
is deprecated. Please use HBaseConfiguration#create() to construct a plain Configuration
2010-10-04 23:16:10,179 WARN  [main] hbase.HBaseConfiguration(44): instantiating HBaseConfiguration()
is deprecated. Please use HBaseConfiguration#create() to construct a plain Configuration
2010-10-04 23:16:10,189 WARN  [main] hbase.HBaseConfiguration(44): instantiating HBaseConfiguration()
is deprecated. Please use HBaseConfiguration#create() to construct a plain Configuration

-------------------------------------------------------
 T E S T S
-------------------------------------------------------
Running org.apache.hadoop.hbase.regionserver.TestColumnSeeking
Tests run: 2, Failures: 0, Errors: 0, Skipped: 0, Time elapsed: 11.08 sec
Running org.apache.hadoop.hbase.client.TestMultipleTimestamps
Tests run: 8, Failures: 0, Errors: 0, Skipped: 0, Time elapsed: 110.719 sec
Running org.apache.hadoop.hbase.TestZooKeeper
Tests run: 4, Failures: 0, Errors: 0, Skipped: 0, Time elapsed: 73.682 sec
Running org.apache.hadoop.hbase.regionserver.wal.TestLogRolling
Tests run: 2, Failures: 0, Errors: 0, Skipped: 0, Time elapsed: 104.117 sec
Running org.apache.hadoop.hbase.io.hfile.TestCachedBlockQueue
Tests run: 2, Failures: 0, Errors: 0, Skipped: 0, Time elapsed: 0.018 sec
Running org.apache.hadoop.hbase.filter.TestPrefixFilter
Tests run: 3, Failures: 0, Errors: 0, Skipped: 0, Time elapsed: 0.018 sec
Running org.apache.hadoop.hbase.util.TestMergeMeta
Tests run: 1, Failures: 0, Errors: 0, Skipped: 0, Time elapsed: 70.321 sec
Running org.apache.hadoop.hbase.io.TestImmutableBytesWritable
Tests run: 3, Failures: 0, Errors: 0, Skipped: 0, Time elapsed: 0.017 sec
Running org.apache.hadoop.hbase.io.TestHeapSize
Tests run: 2, Failures: 0, Errors: 0, Skipped: 0, Time elapsed: 0.031 sec
Running org.apache.hadoop.hbase.rest.model.TestRowModel
Tests run: 2, Failures: 0, Errors: 0, Skipped: 0, Time elapsed: 0.035 sec
Running org.apache.hadoop.hbase.io.hfile.TestHFileSeek
Tests run: 1, Failures: 0, Errors: 0, Skipped: 0, Time elapsed: 4.942 sec
Running org.apache.hadoop.hbase.regionserver.TestStore
Tests run: 8, Failures: 0, Errors: 0, Skipped: 0, Time elapsed: 0.92 sec
Running org.apache.hadoop.hbase.zookeeper.TestHQuorumPeer
Tests run: 3, Failures: 0, Errors: 0, Skipped: 0, Time elapsed: 0.332 sec
Running org.apache.hadoop.hbase.rest.TestScannersWithFilters
Tests run: 1, Failures: 0, Errors: 0, Skipped: 0, Time elapsed: 32.6 sec
Running org.apache.hadoop.hbase.io.hfile.TestHFilePerformance
Tests run: 1, Failures: 0, Errors: 0, Skipped: 0, Time elapsed: 5.816 sec
Running org.apache.hadoop.hbase.io.TestHbaseObjectWritable
Tests run: 2, Failures: 0, Errors: 0, Skipped: 0, Time elapsed: 0.044 sec
Running org.apache.hadoop.hbase.regionserver.wal.TestHLogSplit
Tests run: 15, Failures: 0, Errors: 0, Skipped: 0, Time elapsed: 43.28 sec
Running org.apache.hadoop.hbase.thrift.TestThriftServer
Tests run: 1, Failures: 0, Errors: 0, Skipped: 0, Time elapsed: 58.485 sec
Running org.apache.hadoop.hbase.filter.TestColumnPrefixFilter
Tests run: 1, Failures: 0, Errors: 0, Skipped: 0, Time elapsed: 1.226 sec
Running org.apache.hadoop.hbase.master.TestZKBasedOpenCloseRegion
Tests run: 2, Failures: 0, Errors: 0, Skipped: 0, Time elapsed: 49.921 sec
Running org.apache.hadoop.hbase.TestCompare
Tests run: 1, Failures: 0, Errors: 0, Skipped: 0, Time elapsed: 0.019 sec
Running org.apache.hadoop.hbase.regionserver.TestExplicitColumnTracker
Tests run: 4, Failures: 0, Errors: 0, Skipped: 0, Time elapsed: 0.5 sec
Running org.apache.hadoop.hbase.util.TestEnvironmentEdgeManager
Tests run: 2, Failures: 0, Errors: 0, Skipped: 0, Time elapsed: 0.172 sec
Running org.apache.hadoop.hbase.util.TestDefaultEnvironmentEdge
Tests run: 1, Failures: 0, Errors: 0, Skipped: 0, Time elapsed: 0.018 sec
Running org.apache.hadoop.hbase.util.TestFSUtils
Tests run: 1, Failures: 0, Errors: 0, Skipped: 0, Time elapsed: 7.28 sec
Running org.apache.hadoop.hbase.master.TestMasterTransitions
Tests run: 3, Failures: 0, Errors: 0, Skipped: 3, Time elapsed: 40.959 sec
Running org.apache.hadoop.hbase.regionserver.TestScanWildcardColumnTracker
Tests run: 2, Failures: 0, Errors: 0, Skipped: 0, Time elapsed: 0.122 sec
Running org.apache.hadoop.hbase.regionserver.TestKeyValueSkipListSet
Tests run: 4, Failures: 0, Errors: 0, Skipped: 0, Time elapsed: 0.021 sec
Running org.apache.hadoop.hbase.filter.TestPageFilter
Tests run: 2, Failures: 0, Errors: 0, Skipped: 0, Time elapsed: 0.016 sec
Running org.apache.hadoop.hbase.io.hfile.TestSeekTo
Tests run: 3, Failures: 0, Errors: 0, Skipped: 0, Time elapsed: 0.253 sec
Running org.apache.hadoop.hbase.filter.TestColumnPaginationFilter
Tests run: 1, Failures: 0, Errors: 0, Skipped: 0, Time elapsed: 0.016 sec
Running org.apache.hadoop.hbase.rest.TestStatusResource
Tests run: 1, Failures: 0, Errors: 0, Skipped: 0, Time elapsed: 29.232 sec
Running org.apache.hadoop.hbase.client.TestFromClientSide
Tests run: 38, Failures: 0, Errors: 0, Skipped: 3, Time elapsed: 328.348 sec
Running org.apache.hadoop.hbase.replication.TestReplication
Tests run: 5, Failures: 0, Errors: 0, Skipped: 5, Time elapsed: 0.032 sec
Running org.apache.hadoop.hbase.regionserver.TestCompaction
Tests run: 3, Failures: 0, Errors: 0, Skipped: 0, Time elapsed: 112.237 sec
Running org.apache.hadoop.hbase.filter.TestSingleColumnValueFilter
Tests run: 2, Failures: 0, Errors: 0, Skipped: 0, Time elapsed: 0.036 sec
Running org.apache.hadoop.hbase.mapreduce.TestTimeRangeMapRed
Tests run: 1, Failures: 0, Errors: 0, Skipped: 0, Time elapsed: 34.278 sec
Running org.apache.hadoop.hbase.mapreduce.TestSimpleTotalOrderPartitioner
Tests run: 1, Failures: 0, Errors: 0, Skipped: 0, Time elapsed: 0.151 sec
Running org.apache.hadoop.hbase.mapreduce.TestHFileOutputFormat
Tests run: 5, Failures: 0, Errors: 1, Skipped: 0, Time elapsed: 171.401 sec <<< FAILURE!
Running org.apache.hadoop.hbase.regionserver.TestFSErrorsExposed
Tests run: 3, Failures: 0, Errors: 0, Skipped: 0, Time elapsed: 48.991 sec
Running org.apache.hadoop.hbase.regionserver.TestScanDeleteTracker
Tests run: 6, Failures: 0, Errors: 0, Skipped: 0, Time elapsed: 0.217 sec
Running org.apache.hadoop.hbase.client.TestMetaScanner
Tests run: 1, Failures: 0, Errors: 0, Skipped: 0, Time elapsed: 31.888 sec
Running org.apache.hadoop.hbase.metrics.TestMetricsMBeanBase
Tests run: 2, Failures: 0, Errors: 0, Skipped: 0, Time elapsed: 0.031 sec
Running org.apache.hadoop.hbase.TestRegionRebalancing
Tests run: 1, Failures: 0, Errors: 0, Skipped: 0, Time elapsed: 98.42 sec
Running org.apache.hadoop.hbase.filter.TestSingleColumnValueExcludeFilter
Tests run: 1, Failures: 0, Errors: 0, Skipped: 0, Time elapsed: 0.016 sec
Running org.apache.hadoop.hbase.filter.TestInclusiveStopFilter
Tests run: 2, Failures: 0, Errors: 0, Skipped: 0, Time elapsed: 0.017 sec
Running org.apache.hadoop.hbase.rest.TestTableResource
Tests run: 1, Failures: 0, Errors: 0, Skipped: 0, Time elapsed: 57.033 sec
Running org.apache.hadoop.hbase.TestHBaseTestingUtility
Tests run: 4, Failures: 0, Errors: 0, Skipped: 0, Time elapsed: 23.4 sec
Running org.apache.hadoop.hbase.mapreduce.TestLoadIncrementalHFiles
Tests run: 3, Failures: 0, Errors: 0, Skipped: 0, Time elapsed: 45.925 sec
Running org.apache.hadoop.hbase.rest.TestSchemaResource
Tests run: 1, Failures: 1, Errors: 0, Skipped: 0, Time elapsed: 389.97 sec <<< FAILURE!
Running org.apache.hadoop.hbase.regionserver.wal.TestWALReplay
Tests run: 4, Failures: 0, Errors: 0, Skipped: 0, Time elapsed: 48.286 sec
Running org.apache.hadoop.hbase.regionserver.TestKeyValueScanFixture
Tests run: 1, Failures: 0, Errors: 0, Skipped: 0, Time elapsed: 0.016 sec
Running org.apache.hadoop.hbase.rest.model.TestTableListModel
Tests run: 3, Failures: 0, Errors: 0, Skipped: 0, Time elapsed: 0.137 sec
Running org.apache.hadoop.hbase.rest.model.TestColumnSchemaModel
Tests run: 2, Failures: 0, Errors: 0, Skipped: 0, Time elapsed: 0.032 sec
Running org.apache.hadoop.hbase.regionserver.TestStoreFile
Tests run: 6, Failures: 0, Errors: 0, Skipped: 0, Time elapsed: 51.219 sec
Running org.apache.hadoop.hbase.zookeeper.TestZooKeeperNodeTracker
Tests run: 1, Failures: 0, Errors: 0, Skipped: 0, Time elapsed: 0.583 sec
Running org.apache.hadoop.hbase.rest.model.TestScannerModel
Tests run: 3, Failures: 0, Errors: 0, Skipped: 0, Time elapsed: 0.138 sec
Running org.apache.hadoop.hbase.regionserver.wal.TestHLogMethods
Tests run: 1, Failures: 0, Errors: 0, Skipped: 0, Time elapsed: 0.22 sec
Running org.apache.hadoop.hbase.rest.TestVersionResource
Tests run: 1, Failures: 0, Errors: 0, Skipped: 0, Time elapsed: 22.897 sec
Running org.apache.hadoop.hbase.filter.TestFilter
Tests run: 15, Failures: 0, Errors: 0, Skipped: 0, Time elapsed: 2.969 sec
Running org.apache.hadoop.hbase.regionserver.TestWideScanner
Tests run: 1, Failures: 0, Errors: 0, Skipped: 0, Time elapsed: 44.812 sec
Running org.apache.hadoop.hbase.regionserver.TestSplitTransaction
Tests run: 5, Failures: 0, Errors: 0, Skipped: 0, Time elapsed: 4.748 sec
Running org.apache.hadoop.hbase.util.TestMergeTable
Tests run: 1, Failures: 0, Errors: 0, Skipped: 0, Time elapsed: 115.239 sec
Running org.apache.hadoop.hbase.regionserver.TestReadWriteConsistencyControl
Tests run: 1, Failures: 0, Errors: 0, Skipped: 0, Time elapsed: 10.021 sec
Running org.apache.hadoop.hbase.regionserver.TestGetClosestAtOrBefore
Tests run: 3, Failures: 0, Errors: 0, Skipped: 0, Time elapsed: 24.362 sec
Running org.apache.hadoop.hbase.rest.model.TestVersionModel
Tests run: 3, Failures: 0, Errors: 0, Skipped: 0, Time elapsed: 0.138 sec
Running org.apache.hadoop.hbase.rest.model.TestCellSetModel
Tests run: 3, Failures: 0, Errors: 0, Skipped: 0, Time elapsed: 0.145 sec
Running org.apache.hadoop.hbase.rest.client.TestRemoteTable
Tests run: 5, Failures: 0, Errors: 4, Skipped: 0, Time elapsed: 317.439 sec <<< FAILURE!
Running org.apache.hadoop.hbase.rest.model.TestStorageClusterStatusModel
Tests run: 3, Failures: 0, Errors: 0, Skipped: 0, Time elapsed: 0.144 sec
Running org.apache.hadoop.hbase.avro.TestAvroServer
Tests run: 3, Failures: 0, Errors: 0, Skipped: 0, Time elapsed: 51.554 sec
Running org.apache.hadoop.hbase.TestFullLogReconstruction
Tests run: 1, Failures: 0, Errors: 0, Skipped: 0, Time elapsed: 121.006 sec
Running org.apache.hadoop.hbase.TestSerialization
Tests run: 19, Failures: 0, Errors: 0, Skipped: 0, Time elapsed: 0.07 sec
Running org.apache.hadoop.hbase.regionserver.TestKeyValueHeap
Tests run: 3, Failures: 0, Errors: 0, Skipped: 0, Time elapsed: 0.195 sec
Running org.apache.hadoop.hbase.regionserver.TestStoreScanner
Tests run: 14, Failures: 0, Errors: 0, Skipped: 0, Time elapsed: 0.035 sec
Running org.apache.hadoop.hbase.TestHMsg
Tests run: 2, Failures: 0, Errors: 0, Skipped: 0, Time elapsed: 0.023 sec
Running org.apache.hadoop.hbase.io.hfile.TestReseekTo
Tests run: 1, Failures: 0, Errors: 0, Skipped: 0, Time elapsed: 0.289 sec
Running org.apache.hadoop.hbase.util.TestIncrementingEnvironmentEdge
Tests run: 1, Failures: 0, Errors: 0, Skipped: 0, Time elapsed: 0.017 sec
Running org.apache.hadoop.hbase.util.TestKeying
Tests run: 1, Failures: 0, Errors: 0, Skipped: 0, Time elapsed: 0.018 sec
Running org.apache.hadoop.hbase.regionserver.TestScanner
Tests run: 6, Failures: 0, Errors: 0, Skipped: 0, Time elapsed: 70.169 sec
Running org.apache.hadoop.hbase.regionserver.TestHRegionInfo
Tests run: 2, Failures: 0, Errors: 0, Skipped: 0, Time elapsed: 0.018 sec
Running org.apache.hadoop.hbase.master.TestRestartCluster
Tests run: 2, Failures: 0, Errors: 0, Skipped: 0, Time elapsed: 85.553 sec
Running org.apache.hadoop.hbase.client.TestShell
Tests run: 1, Failures: 0, Errors: 0, Skipped: 0, Time elapsed: 240.298 sec
Running org.apache.hadoop.hbase.rest.model.TestTableInfoModel
Tests run: 3, Failures: 0, Errors: 0, Skipped: 0, Time elapsed: 0.14 sec
Running org.apache.hadoop.hbase.regionserver.TestMinorCompactingStoreScanner
Tests run: 2, Failures: 0, Errors: 0, Skipped: 0, Time elapsed: 0.019 sec
Running org.apache.hadoop.hbase.TestInfoServers
Tests run: 1, Failures: 0, Errors: 0, Skipped: 0, Time elapsed: 55.436 sec
Running org.apache.hadoop.hbase.master.TestLogsCleaner
Tests run: 1, Failures: 0, Errors: 0, Skipped: 1, Time elapsed: 0.143 sec
Running org.apache.hadoop.hbase.regionserver.TestMasterAddressManager
Tests run: 1, Failures: 0, Errors: 0, Skipped: 0, Time elapsed: 0.462 sec
Running org.apache.hadoop.hbase.regionserver.TestQueryMatcher
Tests run: 4, Failures: 0, Errors: 0, Skipped: 0, Time elapsed: 0.181 sec
Running org.apache.hadoop.hbase.client.TestAdmin
killed.
[INFO] ------------------------------------------------------------------------
[ERROR] BUILD ERROR
[INFO] ------------------------------------------------------------------------
[INFO] Error while executing forked tests.; nested exception is org.apache.maven.surefire.booter.shade.org.codehaus.plexus.util.cli.CommandLineException:
Error while executing external command, process killed.

Process timeout out after 3600 seconds
[INFO] ------------------------------------------------------------------------
[INFO] For more information, run Maven with the -e switch
[INFO] ------------------------------------------------------------------------
[INFO] Total time: 116 minutes 49 seconds
[INFO] Finished at: Tue Oct 05 01:12:44 UTC 2010
[INFO] Final Memory: 54M/581M
[INFO] ------------------------------------------------------------------------
[locks-and-latches] Releasing all the locks
[locks-and-latches] All the locks released
Archiving artifacts
Recording test results


Mime
View raw message