hbase-dev mailing list archives

Site index · List index
Message view « Date » · « Thread »
Top « Date » · « Thread »
From Apache Hudson Server <hud...@hudson.apache.org>
Subject Build failed in Hudson: HBase-TRUNK #1481
Date Sat, 25 Sep 2010 08:55:45 GMT
See <https://hudson.apache.org/hudson/job/HBase-TRUNK/1481/changes>

Changes:

[stack] HBASE-3037 When new master joins running cluster does "Received report from unknown
server -- telling it to STOP_REGIONSERVER..."

M src/main/java/org/apache/hadoop/hbase/master/ServerManager.java
 On regionServerReport, if we get a report from an 'unknown' regionserver,
 we used to tell it stop itself.  Now, if 'unknown' server AND
 this master did not start the cluster, its joining the cluster, then
 treat the report as a regionServerStart and register the incoming
 server rather than tell it shutdown.
M src/main/java/org/apache/hadoop/hbase/master/HMaster.java
 Pass the freshClusterStartup flag to ServerManager.
 Add more executors for opening and closing.  On cluster startup a
 master shouldn't be bottleneck clearning the server opens.
 Expose the run-balancer method so can make it available in
 ServeAdmin.
M src/main/java/org/apache/hadoop/hbase/master/AssignmentManager.java
 Minor formatting and javadoc
M src/main/java/org/apache/hadoop/hbase/ipc/HBaseRPCProtocolVersion.java
 Upped rpc version number because of new balancer addition (and because
 we didn't do it when we put in new master).
M src/main/java/org/apache/hadoop/hbase/ipc/HMasterInterface.java
 Added balance method.
M src/main/resources/hbase-default.xml
 Change how ofter we check in from every 3 seconds to every 5 seconds.

------------------------------------------
[...truncated 837 lines...]
A         src/examples/mapreduce/org/apache/hadoop/hbase/mapreduce/IndexBuilder.java
A         src/examples/mapreduce/index-builder-setup.rb
A         src/examples/README.txt
A         bin
AU        bin/hbase-daemons.sh
A         bin/rename_table.rb
AU        bin/hbase
A         bin/copy_table.rb
A         bin/check_meta.rb
AU        bin/start-hbase.sh
A         bin/hirb.rb
A         bin/set_meta_block_caching.rb
A         bin/loadtable.rb
AU        bin/hbase-daemon.sh
A         bin/hbase-config.sh
A         bin/local-regionservers.sh
AU        bin/zookeepers.sh
A         bin/local-master-backup.sh
A         bin/add_table.rb
A         bin/rolling-restart.sh
AU        bin/regionservers.sh
AU        bin/master-backup.sh
A         bin/replication
A         bin/replication/copy_tables_desc.rb
A         bin/replication/add_peer.rb
AU        bin/stop-hbase.sh
A         pom.xml
A         README.txt
 U        .
At revision 1001152
[locks-and-latches] Checking to see if we really have the locks
[locks-and-latches] Have all the locks, build can start
[trunk] $ /home/hudson/tools/maven/apache-maven-2.2.1/bin/mvn clean -Dmaven.test.redirectTestOutputToFile=true
deploy
[INFO] Scanning for projects...
[INFO] ------------------------------------------------------------------------
[INFO] Building HBase
[INFO]    task-segment: [clean, deploy]
[INFO] ------------------------------------------------------------------------
[INFO] [clean:clean {execution: default-clean}]
[WARNING] POM for 'commons-httpclient:commons-httpclient:pom:3.0.1:compile' is invalid.

Its dependencies (if any) will NOT be available to the current build.
[INFO] [antrun:run {execution: generate}]
[INFO] Executing tasks
    [mkdir] Created dir: <https://hudson.apache.org/hudson/job/HBase-TRUNK/ws/trunk/target/hbase-webapps>
     [copy] Copying 4 files to <https://hudson.apache.org/hudson/job/HBase-TRUNK/ws/trunk/target/hbase-webapps>
    [mkdir] Created dir: <https://hudson.apache.org/hudson/job/HBase-TRUNK/ws/trunk/target/hbase-webapps/master/WEB-INF>
    [mkdir] Created dir: <https://hudson.apache.org/hudson/job/HBase-TRUNK/ws/trunk/target/hbase-webapps/regionserver/WEB-INF>
[INFO] Executed tasks
[INFO] [build-helper:add-source {execution: add-jspc-source}]
[INFO] Source directory: <https://hudson.apache.org/hudson/job/HBase-TRUNK/ws/trunk/target/jspc>
added.
[INFO] [build-helper:add-source {execution: add-package-info}]
[INFO] Source directory: <https://hudson.apache.org/hudson/job/HBase-TRUNK/ws/trunk/target/generated-sources>
added.
[INFO] [resources:resources {execution: default-resources}]
[INFO] Using 'UTF-8' encoding to copy filtered resources.
[INFO] Copying 1 resource
[INFO] Copying 6 resources
[INFO] [compiler:compile {execution: default-compile}]
[INFO] Compiling 421 source files to <https://hudson.apache.org/hudson/job/HBase-TRUNK/ws/trunk/target/classes>
[INFO] [resources:testResources {execution: default-testResources}]
[INFO] Using 'UTF-8' encoding to copy filtered resources.
[INFO] Copying 4 resources
[INFO] [compiler:testCompile {execution: default-testCompile}]
[INFO] Compiling 168 source files to <https://hudson.apache.org/hudson/job/HBase-TRUNK/ws/trunk/target/test-classes>
[INFO] [surefire:test {execution: default-test}]
[INFO] Surefire report directory: <https://hudson.apache.org/hudson/job/HBase-TRUNK/ws/trunk/target/surefire-reports>

-------------------------------------------------------
 T E S T S
-------------------------------------------------------
Running org.apache.hadoop.hbase.regionserver.TestColumnSeeking
Tests run: 2, Failures: 0, Errors: 0, Skipped: 0, Time elapsed: 13.771 sec
Running org.apache.hadoop.hbase.client.TestMultipleTimestamps
Tests run: 8, Failures: 0, Errors: 0, Skipped: 0, Time elapsed: 104.393 sec
Running org.apache.hadoop.hbase.TestZooKeeper
Tests run: 4, Failures: 0, Errors: 0, Skipped: 0, Time elapsed: 68.847 sec
Running org.apache.hadoop.hbase.regionserver.wal.TestLogRolling
Tests run: 2, Failures: 0, Errors: 0, Skipped: 0, Time elapsed: 109.003 sec
Running org.apache.hadoop.hbase.io.hfile.TestCachedBlockQueue
Tests run: 2, Failures: 0, Errors: 0, Skipped: 0, Time elapsed: 0.106 sec
Running org.apache.hadoop.hbase.filter.TestPrefixFilter
Tests run: 3, Failures: 0, Errors: 0, Skipped: 0, Time elapsed: 0.109 sec
Running org.apache.hadoop.hbase.util.TestMergeMeta
Tests run: 1, Failures: 0, Errors: 0, Skipped: 0, Time elapsed: 64.84 sec
Running org.apache.hadoop.hbase.io.TestImmutableBytesWritable
Tests run: 3, Failures: 0, Errors: 0, Skipped: 0, Time elapsed: 0.111 sec
Running org.apache.hadoop.hbase.io.TestHeapSize
Tests run: 2, Failures: 1, Errors: 0, Skipped: 0, Time elapsed: 0.127 sec <<< FAILURE!
Running org.apache.hadoop.hbase.rest.model.TestRowModel
Tests run: 2, Failures: 0, Errors: 0, Skipped: 0, Time elapsed: 0.378 sec
Running org.apache.hadoop.hbase.io.hfile.TestHFileSeek
Tests run: 1, Failures: 0, Errors: 0, Skipped: 0, Time elapsed: 5.14 sec
Running org.apache.hadoop.hbase.regionserver.TestStore
Tests run: 8, Failures: 0, Errors: 0, Skipped: 0, Time elapsed: 1.395 sec
Running org.apache.hadoop.hbase.zookeeper.TestHQuorumPeer
Tests run: 3, Failures: 0, Errors: 0, Skipped: 0, Time elapsed: 0.611 sec
Running org.apache.hadoop.hbase.rest.TestScannersWithFilters
Tests run: 1, Failures: 1, Errors: 0, Skipped: 0, Time elapsed: 63.834 sec <<< FAILURE!
Running org.apache.hadoop.hbase.io.hfile.TestHFilePerformance
Tests run: 1, Failures: 0, Errors: 0, Skipped: 0, Time elapsed: 5.929 sec
Running org.apache.hadoop.hbase.io.TestHbaseObjectWritable
Tests run: 2, Failures: 0, Errors: 0, Skipped: 0, Time elapsed: 0.178 sec
Running org.apache.hadoop.hbase.regionserver.wal.TestHLogSplit
Tests run: 15, Failures: 0, Errors: 0, Skipped: 0, Time elapsed: 49.307 sec
Running org.apache.hadoop.hbase.thrift.TestThriftServer
Tests run: 1, Failures: 0, Errors: 0, Skipped: 0, Time elapsed: 57.541 sec
Running org.apache.hadoop.hbase.filter.TestColumnPrefixFilter
Tests run: 1, Failures: 0, Errors: 0, Skipped: 0, Time elapsed: 1.481 sec
Running org.apache.hadoop.hbase.master.TestZKBasedOpenCloseRegion
Tests run: 2, Failures: 0, Errors: 0, Skipped: 0, Time elapsed: 34.887 sec
Running org.apache.hadoop.hbase.TestCompare
Tests run: 1, Failures: 0, Errors: 0, Skipped: 0, Time elapsed: 0.134 sec
Running org.apache.hadoop.hbase.regionserver.TestExplicitColumnTracker
Tests run: 4, Failures: 0, Errors: 0, Skipped: 0, Time elapsed: 0.846 sec
Running org.apache.hadoop.hbase.util.TestEnvironmentEdgeManager
Tests run: 2, Failures: 0, Errors: 0, Skipped: 0, Time elapsed: 0.224 sec
Running org.apache.hadoop.hbase.util.TestDefaultEnvironmentEdge
Tests run: 1, Failures: 0, Errors: 0, Skipped: 0, Time elapsed: 0.065 sec
Running org.apache.hadoop.hbase.util.TestFSUtils
Tests run: 1, Failures: 0, Errors: 0, Skipped: 0, Time elapsed: 11.348 sec
Running org.apache.hadoop.hbase.master.TestMasterTransitions
Tests run: 3, Failures: 0, Errors: 0, Skipped: 3, Time elapsed: 50.333 sec
Running org.apache.hadoop.hbase.regionserver.TestScanWildcardColumnTracker
Tests run: 2, Failures: 0, Errors: 0, Skipped: 0, Time elapsed: 0.376 sec
Running org.apache.hadoop.hbase.regionserver.TestKeyValueSkipListSet
Tests run: 4, Failures: 0, Errors: 0, Skipped: 0, Time elapsed: 0.121 sec
Running org.apache.hadoop.hbase.filter.TestPageFilter
Tests run: 2, Failures: 0, Errors: 0, Skipped: 0, Time elapsed: 0.039 sec
Running org.apache.hadoop.hbase.io.hfile.TestSeekTo
Tests run: 3, Failures: 0, Errors: 0, Skipped: 0, Time elapsed: 0.469 sec
Running org.apache.hadoop.hbase.filter.TestColumnPaginationFilter
Tests run: 1, Failures: 0, Errors: 0, Skipped: 0, Time elapsed: 0.114 sec
Running org.apache.hadoop.hbase.rest.TestStatusResource
Tests run: 1, Failures: 1, Errors: 0, Skipped: 0, Time elapsed: 38.346 sec <<< FAILURE!
Running org.apache.hadoop.hbase.client.TestFromClientSide
Tests run: 38, Failures: 0, Errors: 0, Skipped: 3, Time elapsed: 325.424 sec
Running org.apache.hadoop.hbase.replication.TestReplication
Tests run: 5, Failures: 0, Errors: 0, Skipped: 5, Time elapsed: 0.222 sec
Running org.apache.hadoop.hbase.regionserver.TestCompaction
Tests run: 2, Failures: 0, Errors: 0, Skipped: 0, Time elapsed: 75.587 sec
Running org.apache.hadoop.hbase.filter.TestSingleColumnValueFilter
Tests run: 2, Failures: 0, Errors: 0, Skipped: 0, Time elapsed: 0.148 sec
Running org.apache.hadoop.hbase.mapreduce.TestTimeRangeMapRed
Tests run: 1, Failures: 0, Errors: 0, Skipped: 0, Time elapsed: 30.023 sec
Running org.apache.hadoop.hbase.mapreduce.TestSimpleTotalOrderPartitioner
Tests run: 1, Failures: 0, Errors: 0, Skipped: 0, Time elapsed: 0.326 sec
Running org.apache.hadoop.hbase.mapreduce.TestHFileOutputFormat
Tests run: 5, Failures: 0, Errors: 0, Skipped: 0, Time elapsed: 157.421 sec
Running org.apache.hadoop.hbase.regionserver.TestFSErrorsExposed
Tests run: 3, Failures: 0, Errors: 0, Skipped: 0, Time elapsed: 44.414 sec
Running org.apache.hadoop.hbase.regionserver.TestScanDeleteTracker
Tests run: 6, Failures: 0, Errors: 0, Skipped: 0, Time elapsed: 0.493 sec
Running org.apache.hadoop.hbase.client.TestMetaScanner
Tests run: 1, Failures: 0, Errors: 0, Skipped: 0, Time elapsed: 29.798 sec
Running org.apache.hadoop.hbase.metrics.TestMetricsMBeanBase
Tests run: 2, Failures: 0, Errors: 0, Skipped: 0, Time elapsed: 0.123 sec
Running org.apache.hadoop.hbase.TestRegionRebalancing
Tests run: 1, Failures: 0, Errors: 0, Skipped: 0, Time elapsed: 84.837 sec
Running org.apache.hadoop.hbase.filter.TestSingleColumnValueExcludeFilter
Tests run: 1, Failures: 0, Errors: 0, Skipped: 0, Time elapsed: 0.115 sec
Running org.apache.hadoop.hbase.filter.TestInclusiveStopFilter
Tests run: 2, Failures: 0, Errors: 0, Skipped: 0, Time elapsed: 0.108 sec
Running org.apache.hadoop.hbase.rest.TestTableResource
Tests run: 1, Failures: 1, Errors: 0, Skipped: 0, Time elapsed: 76 sec <<< FAILURE!
Running org.apache.hadoop.hbase.TestHBaseTestingUtility
Tests run: 4, Failures: 0, Errors: 0, Skipped: 0, Time elapsed: 21.89 sec
Running org.apache.hadoop.hbase.mapreduce.TestLoadIncrementalHFiles
Tests run: 3, Failures: 0, Errors: 0, Skipped: 0, Time elapsed: 48.668 sec
Running org.apache.hadoop.hbase.rest.TestSchemaResource
Tests run: 1, Failures: 1, Errors: 0, Skipped: 0, Time elapsed: 37.171 sec <<< FAILURE!
Running org.apache.hadoop.hbase.regionserver.wal.TestWALReplay
Tests run: 4, Failures: 0, Errors: 0, Skipped: 0, Time elapsed: 29.482 sec
Running org.apache.hadoop.hbase.regionserver.TestKeyValueScanFixture
Tests run: 1, Failures: 0, Errors: 0, Skipped: 0, Time elapsed: 0.114 sec
Running org.apache.hadoop.hbase.rest.model.TestTableListModel
Tests run: 3, Failures: 0, Errors: 0, Skipped: 0, Time elapsed: 0.481 sec
Running org.apache.hadoop.hbase.rest.model.TestColumnSchemaModel
Tests run: 2, Failures: 0, Errors: 0, Skipped: 0, Time elapsed: 0.292 sec
Running org.apache.hadoop.hbase.regionserver.TestStoreFile
Tests run: 6, Failures: 0, Errors: 0, Skipped: 0, Time elapsed: 32.755 sec
Running org.apache.hadoop.hbase.zookeeper.TestZooKeeperNodeTracker
Tests run: 1, Failures: 0, Errors: 0, Skipped: 0, Time elapsed: 0.754 sec
Running org.apache.hadoop.hbase.rest.model.TestScannerModel
Tests run: 3, Failures: 0, Errors: 0, Skipped: 0, Time elapsed: 0.513 sec
Running org.apache.hadoop.hbase.regionserver.wal.TestHLogMethods
Tests run: 1, Failures: 0, Errors: 0, Skipped: 0, Time elapsed: 0.524 sec
Running org.apache.hadoop.hbase.rest.TestVersionResource
Tests run: 1, Failures: 1, Errors: 0, Skipped: 0, Time elapsed: 46.229 sec <<< FAILURE!
Running org.apache.hadoop.hbase.filter.TestFilter
Tests run: 15, Failures: 0, Errors: 0, Skipped: 0, Time elapsed: 3.217 sec
Running org.apache.hadoop.hbase.regionserver.TestWideScanner
Tests run: 1, Failures: 0, Errors: 0, Skipped: 0, Time elapsed: 19.68 sec
Running org.apache.hadoop.hbase.regionserver.TestSplitTransaction
Tests run: 5, Failures: 0, Errors: 0, Skipped: 0, Time elapsed: 4.953 sec
Running org.apache.hadoop.hbase.util.TestMergeTable
Tests run: 1, Failures: 0, Errors: 0, Skipped: 0, Time elapsed: 94.536 sec
Running org.apache.hadoop.hbase.regionserver.TestReadWriteConsistencyControl
Tests run: 1, Failures: 0, Errors: 0, Skipped: 0, Time elapsed: 10.044 sec
Running org.apache.hadoop.hbase.regionserver.TestGetClosestAtOrBefore
Tests run: 3, Failures: 0, Errors: 0, Skipped: 0, Time elapsed: 10.397 sec
Running org.apache.hadoop.hbase.rest.model.TestVersionModel
Tests run: 3, Failures: 0, Errors: 0, Skipped: 0, Time elapsed: 0.47 sec
Running org.apache.hadoop.hbase.rest.model.TestCellSetModel
Tests run: 3, Failures: 0, Errors: 0, Skipped: 0, Time elapsed: 0.49 sec
Running org.apache.hadoop.hbase.rest.client.TestRemoteTable
Tests run: 5, Failures: 0, Errors: 5, Skipped: 0, Time elapsed: 276.992 sec <<< FAILURE!
Running org.apache.hadoop.hbase.rest.model.TestStorageClusterStatusModel
Tests run: 3, Failures: 0, Errors: 0, Skipped: 0, Time elapsed: 0.534 sec
Running org.apache.hadoop.hbase.avro.TestAvroServer
Tests run: 3, Failures: 0, Errors: 0, Skipped: 0, Time elapsed: 54.764 sec
Running org.apache.hadoop.hbase.TestFullLogReconstruction
Tests run: 1, Failures: 0, Errors: 1, Skipped: 0, Time elapsed: 57.659 sec <<< FAILURE!
Running org.apache.hadoop.hbase.TestSerialization
Tests run: 19, Failures: 0, Errors: 0, Skipped: 0, Time elapsed: 0.249 sec
Running org.apache.hadoop.hbase.regionserver.TestKeyValueHeap
Tests run: 3, Failures: 0, Errors: 0, Skipped: 0, Time elapsed: 0.411 sec
Running org.apache.hadoop.hbase.regionserver.TestStoreScanner
Tests run: 14, Failures: 0, Errors: 0, Skipped: 0, Time elapsed: 0.139 sec
Running org.apache.hadoop.hbase.TestHMsg
Tests run: 2, Failures: 0, Errors: 0, Skipped: 0, Time elapsed: 0.142 sec
Running org.apache.hadoop.hbase.io.hfile.TestReseekTo
Tests run: 1, Failures: 0, Errors: 0, Skipped: 0, Time elapsed: 0.501 sec
Running org.apache.hadoop.hbase.util.TestIncrementingEnvironmentEdge
Tests run: 1, Failures: 0, Errors: 0, Skipped: 0, Time elapsed: 0.064 sec
Running org.apache.hadoop.hbase.util.TestKeying
Tests run: 1, Failures: 0, Errors: 0, Skipped: 0, Time elapsed: 0.039 sec
Running org.apache.hadoop.hbase.regionserver.TestScanner
Tests run: 6, Failures: 0, Errors: 0, Skipped: 0, Time elapsed: 70.738 sec
Running org.apache.hadoop.hbase.regionserver.TestHRegionInfo
Tests run: 2, Failures: 0, Errors: 0, Skipped: 0, Time elapsed: 0.159 sec
Running org.apache.hadoop.hbase.master.TestRestartCluster
killed.
[INFO] ------------------------------------------------------------------------
[ERROR] BUILD ERROR
[INFO] ------------------------------------------------------------------------
[INFO] Error while executing forked tests.; nested exception is org.apache.maven.surefire.booter.shade.org.codehaus.plexus.util.cli.CommandLineTimeOutException:
Error while executing external command, process killed.

Process timeout out after 3600 seconds
[INFO] ------------------------------------------------------------------------
[INFO] For more information, run Maven with the -e switch
[INFO] ------------------------------------------------------------------------
[INFO] Total time: 100 minutes 4 seconds
[INFO] Finished at: Sat Sep 25 08:55:38 UTC 2010
[INFO] Final Memory: 50M/547M
[INFO] ------------------------------------------------------------------------
[locks-and-latches] Releasing all the locks
[locks-and-latches] All the locks released
Archiving artifacts
Recording test results


Mime
View raw message