hbase-dev mailing list archives

Site index · List index
Message view « Date » · « Thread »
Top « Date » · « Thread »
From Apache Hudson Server <hud...@hudson.apache.org>
Subject Build failed in Hudson: HBase-TRUNK #1471
Date Tue, 21 Sep 2010 09:13:44 GMT
See <https://hudson.apache.org/hudson/job/HBase-TRUNK/1471/changes>

Changes:

[stack] HBASE-3018 Bulk assignment on startup runs serially through the cluster servers assigning
in bulk to one at a time

M src/main/java/org/apache/hadoop/hbase/master/AssignmentManager.java
  Removed reentrant lock that spanned moving region into
  regionsintransition and the getting of lock on state object.  It
  was a bad idea.  I found it actually deadlocked.  It shouldn't be needed.
  The call to assign will fail if the state instance is not of the right
  'state' type.
  Run a thread per server parcelling out region assignments so we assign
  across the cluster concurrently rather than in series as we were doing.

------------------------------------------
[...truncated 835 lines...]
A         src/examples/mapreduce/org/apache/hadoop/hbase/mapreduce/IndexBuilder.java
A         src/examples/mapreduce/index-builder-setup.rb
A         src/examples/README.txt
A         bin
AU        bin/hbase-daemons.sh
A         bin/rename_table.rb
AU        bin/hbase
A         bin/copy_table.rb
A         bin/check_meta.rb
AU        bin/start-hbase.sh
A         bin/hirb.rb
A         bin/set_meta_block_caching.rb
A         bin/loadtable.rb
AU        bin/hbase-daemon.sh
A         bin/hbase-config.sh
A         bin/local-regionservers.sh
AU        bin/zookeepers.sh
A         bin/local-master-backup.sh
A         bin/add_table.rb
A         bin/rolling-restart.sh
AU        bin/regionservers.sh
AU        bin/master-backup.sh
A         bin/replication
A         bin/replication/copy_tables_desc.rb
A         bin/replication/add_peer.rb
AU        bin/stop-hbase.sh
A         pom.xml
A         README.txt
 U        .
At revision 999247
[locks-and-latches] Checking to see if we really have the locks
[locks-and-latches] Have all the locks, build can start
[trunk] $ /home/hudson/tools/maven/apache-maven-2.2.1/bin/mvn clean -Dmaven.test.redirectTestOutputToFile=true
deploy
[INFO] Scanning for projects...
[INFO] ------------------------------------------------------------------------
[INFO] Building HBase
[INFO]    task-segment: [clean, deploy]
[INFO] ------------------------------------------------------------------------
[INFO] [clean:clean {execution: default-clean}]
[WARNING] POM for 'commons-httpclient:commons-httpclient:pom:3.0.1:compile' is invalid.

Its dependencies (if any) will NOT be available to the current build.
[INFO] [antrun:run {execution: generate}]
[INFO] Executing tasks
    [mkdir] Created dir: <https://hudson.apache.org/hudson/job/HBase-TRUNK/ws/trunk/target/hbase-webapps>
     [copy] Copying 4 files to <https://hudson.apache.org/hudson/job/HBase-TRUNK/ws/trunk/target/hbase-webapps>
    [mkdir] Created dir: <https://hudson.apache.org/hudson/job/HBase-TRUNK/ws/trunk/target/hbase-webapps/master/WEB-INF>
    [mkdir] Created dir: <https://hudson.apache.org/hudson/job/HBase-TRUNK/ws/trunk/target/hbase-webapps/regionserver/WEB-INF>
[INFO] Executed tasks
[INFO] [build-helper:add-source {execution: add-jspc-source}]
[INFO] Source directory: <https://hudson.apache.org/hudson/job/HBase-TRUNK/ws/trunk/target/jspc>
added.
[INFO] [build-helper:add-source {execution: add-package-info}]
[INFO] Source directory: <https://hudson.apache.org/hudson/job/HBase-TRUNK/ws/trunk/target/generated-sources>
added.
[INFO] [resources:resources {execution: default-resources}]
[INFO] Using 'UTF-8' encoding to copy filtered resources.
[INFO] Copying 1 resource
[INFO] Copying 6 resources
[INFO] [compiler:compile {execution: default-compile}]
[INFO] Compiling 420 source files to <https://hudson.apache.org/hudson/job/HBase-TRUNK/ws/trunk/target/classes>
[INFO] [resources:testResources {execution: default-testResources}]
[INFO] Using 'UTF-8' encoding to copy filtered resources.
[INFO] Copying 4 resources
[INFO] [compiler:testCompile {execution: default-testCompile}]
[INFO] Compiling 167 source files to <https://hudson.apache.org/hudson/job/HBase-TRUNK/ws/trunk/target/test-classes>
[INFO] [surefire:test {execution: default-test}]
[INFO] Surefire report directory: <https://hudson.apache.org/hudson/job/HBase-TRUNK/ws/trunk/target/surefire-reports>

-------------------------------------------------------
 T E S T S
-------------------------------------------------------
Running org.apache.hadoop.hbase.regionserver.TestColumnSeeking
Tests run: 2, Failures: 0, Errors: 0, Skipped: 0, Time elapsed: 13.892 sec
Running org.apache.hadoop.hbase.client.TestMultipleTimestamps
Tests run: 8, Failures: 0, Errors: 0, Skipped: 0, Time elapsed: 102.154 sec
Running org.apache.hadoop.hbase.TestZooKeeper
Tests run: 4, Failures: 1, Errors: 1, Skipped: 0, Time elapsed: 153.283 sec <<< FAILURE!
Running org.apache.hadoop.hbase.regionserver.wal.TestLogRolling
Tests run: 2, Failures: 0, Errors: 0, Skipped: 0, Time elapsed: 99.849 sec
Running org.apache.hadoop.hbase.io.hfile.TestCachedBlockQueue
Tests run: 2, Failures: 0, Errors: 0, Skipped: 0, Time elapsed: 0.105 sec
Running org.apache.hadoop.hbase.filter.TestPrefixFilter
Tests run: 3, Failures: 0, Errors: 0, Skipped: 0, Time elapsed: 0.109 sec
Running org.apache.hadoop.hbase.util.TestMergeMeta
Tests run: 1, Failures: 0, Errors: 0, Skipped: 0, Time elapsed: 64.104 sec
Running org.apache.hadoop.hbase.io.TestImmutableBytesWritable
Tests run: 3, Failures: 0, Errors: 0, Skipped: 0, Time elapsed: 0.111 sec
Running org.apache.hadoop.hbase.io.TestHeapSize
Tests run: 2, Failures: 1, Errors: 0, Skipped: 0, Time elapsed: 0.128 sec <<< FAILURE!
Running org.apache.hadoop.hbase.rest.model.TestRowModel
Tests run: 2, Failures: 0, Errors: 0, Skipped: 0, Time elapsed: 0.381 sec
Running org.apache.hadoop.hbase.io.hfile.TestHFileSeek
Tests run: 1, Failures: 0, Errors: 0, Skipped: 0, Time elapsed: 5.076 sec
Running org.apache.hadoop.hbase.regionserver.TestStore
Tests run: 8, Failures: 0, Errors: 0, Skipped: 0, Time elapsed: 1.183 sec
Running org.apache.hadoop.hbase.zookeeper.TestHQuorumPeer
Tests run: 3, Failures: 0, Errors: 0, Skipped: 0, Time elapsed: 0.646 sec
Running org.apache.hadoop.hbase.rest.TestScannersWithFilters
Tests run: 1, Failures: 1, Errors: 0, Skipped: 0, Time elapsed: 139.371 sec <<< FAILURE!
Running org.apache.hadoop.hbase.io.hfile.TestHFilePerformance
Tests run: 1, Failures: 0, Errors: 0, Skipped: 0, Time elapsed: 5.904 sec
Running org.apache.hadoop.hbase.io.TestHbaseObjectWritable
Tests run: 2, Failures: 0, Errors: 0, Skipped: 0, Time elapsed: 0.174 sec
Running org.apache.hadoop.hbase.regionserver.wal.TestHLogSplit
Tests run: 14, Failures: 0, Errors: 0, Skipped: 0, Time elapsed: 56.564 sec
Running org.apache.hadoop.hbase.thrift.TestThriftServer
Tests run: 1, Failures: 0, Errors: 0, Skipped: 0, Time elapsed: 64.277 sec
Running org.apache.hadoop.hbase.filter.TestColumnPrefixFilter
Tests run: 1, Failures: 0, Errors: 0, Skipped: 0, Time elapsed: 1.514 sec
Running org.apache.hadoop.hbase.master.TestZKBasedOpenCloseRegion
Tests run: 2, Failures: 0, Errors: 0, Skipped: 0, Time elapsed: 35.027 sec
Running org.apache.hadoop.hbase.TestCompare
Tests run: 1, Failures: 0, Errors: 0, Skipped: 0, Time elapsed: 0.134 sec
Running org.apache.hadoop.hbase.regionserver.TestExplicitColumnTracker
Tests run: 4, Failures: 0, Errors: 0, Skipped: 0, Time elapsed: 0.833 sec
Running org.apache.hadoop.hbase.util.TestEnvironmentEdgeManager
Tests run: 2, Failures: 0, Errors: 0, Skipped: 0, Time elapsed: 0.225 sec
Running org.apache.hadoop.hbase.util.TestDefaultEnvironmentEdge
Tests run: 1, Failures: 0, Errors: 0, Skipped: 0, Time elapsed: 0.065 sec
Running org.apache.hadoop.hbase.util.TestFSUtils
Tests run: 1, Failures: 0, Errors: 0, Skipped: 0, Time elapsed: 14.901 sec
Running org.apache.hadoop.hbase.master.TestMasterTransitions
Tests run: 3, Failures: 0, Errors: 0, Skipped: 3, Time elapsed: 61.793 sec
Running org.apache.hadoop.hbase.regionserver.TestScanWildcardColumnTracker
Tests run: 2, Failures: 0, Errors: 0, Skipped: 0, Time elapsed: 0.354 sec
Running org.apache.hadoop.hbase.regionserver.TestKeyValueSkipListSet
Tests run: 4, Failures: 0, Errors: 0, Skipped: 0, Time elapsed: 0.12 sec
Running org.apache.hadoop.hbase.filter.TestPageFilter
Tests run: 2, Failures: 0, Errors: 0, Skipped: 0, Time elapsed: 0.04 sec
Running org.apache.hadoop.hbase.io.hfile.TestSeekTo
Tests run: 3, Failures: 0, Errors: 0, Skipped: 0, Time elapsed: 0.468 sec
Running org.apache.hadoop.hbase.filter.TestColumnPaginationFilter
Tests run: 1, Failures: 0, Errors: 0, Skipped: 0, Time elapsed: 0.114 sec
Running org.apache.hadoop.hbase.rest.TestStatusResource
Tests run: 1, Failures: 1, Errors: 0, Skipped: 0, Time elapsed: 32.907 sec <<< FAILURE!
Running org.apache.hadoop.hbase.client.TestFromClientSide
Tests run: 38, Failures: 0, Errors: 0, Skipped: 3, Time elapsed: 322.342 sec
Running org.apache.hadoop.hbase.replication.TestReplication
Tests run: 5, Failures: 0, Errors: 0, Skipped: 5, Time elapsed: 0.215 sec
Running org.apache.hadoop.hbase.regionserver.TestCompaction
Tests run: 2, Failures: 0, Errors: 0, Skipped: 0, Time elapsed: 82.634 sec
Running org.apache.hadoop.hbase.filter.TestSingleColumnValueFilter
Tests run: 2, Failures: 0, Errors: 0, Skipped: 0, Time elapsed: 0.147 sec
Running org.apache.hadoop.hbase.mapreduce.TestTimeRangeMapRed
Tests run: 1, Failures: 0, Errors: 0, Skipped: 0, Time elapsed: 29.786 sec
Running org.apache.hadoop.hbase.mapreduce.TestSimpleTotalOrderPartitioner
Tests run: 1, Failures: 0, Errors: 0, Skipped: 0, Time elapsed: 0.311 sec
Running org.apache.hadoop.hbase.mapreduce.TestHFileOutputFormat
Tests run: 5, Failures: 0, Errors: 0, Skipped: 0, Time elapsed: 180.306 sec
Running org.apache.hadoop.hbase.regionserver.TestFSErrorsExposed
Tests run: 3, Failures: 0, Errors: 0, Skipped: 0, Time elapsed: 54.178 sec
Running org.apache.hadoop.hbase.regionserver.TestScanDeleteTracker
Tests run: 6, Failures: 0, Errors: 0, Skipped: 0, Time elapsed: 0.635 sec
Running org.apache.hadoop.hbase.client.TestMetaScanner
Tests run: 1, Failures: 0, Errors: 0, Skipped: 0, Time elapsed: 30.54 sec
Running org.apache.hadoop.hbase.metrics.TestMetricsMBeanBase
Tests run: 2, Failures: 0, Errors: 0, Skipped: 0, Time elapsed: 0.123 sec
Running org.apache.hadoop.hbase.TestRegionRebalancing
Tests run: 1, Failures: 0, Errors: 0, Skipped: 0, Time elapsed: 86.867 sec
Running org.apache.hadoop.hbase.filter.TestSingleColumnValueExcludeFilter
Tests run: 1, Failures: 0, Errors: 0, Skipped: 0, Time elapsed: 0.115 sec
Running org.apache.hadoop.hbase.filter.TestInclusiveStopFilter
Tests run: 2, Failures: 0, Errors: 0, Skipped: 0, Time elapsed: 0.107 sec
Running org.apache.hadoop.hbase.rest.TestTableResource
Tests run: 1, Failures: 1, Errors: 0, Skipped: 0, Time elapsed: 276.036 sec <<< FAILURE!
Running org.apache.hadoop.hbase.TestHBaseTestingUtility
Tests run: 4, Failures: 0, Errors: 0, Skipped: 0, Time elapsed: 21.339 sec
Running org.apache.hadoop.hbase.mapreduce.TestLoadIncrementalHFiles
Tests run: 3, Failures: 0, Errors: 0, Skipped: 0, Time elapsed: 41.209 sec
Running org.apache.hadoop.hbase.rest.TestSchemaResource
Tests run: 1, Failures: 1, Errors: 0, Skipped: 0, Time elapsed: 30.264 sec <<< FAILURE!
Running org.apache.hadoop.hbase.regionserver.wal.TestWALReplay
Tests run: 4, Failures: 0, Errors: 0, Skipped: 0, Time elapsed: 25.849 sec
Running org.apache.hadoop.hbase.regionserver.TestKeyValueScanFixture
Tests run: 1, Failures: 0, Errors: 0, Skipped: 0, Time elapsed: 0.113 sec
Running org.apache.hadoop.hbase.rest.model.TestTableListModel
Tests run: 3, Failures: 0, Errors: 0, Skipped: 0, Time elapsed: 0.479 sec
Running org.apache.hadoop.hbase.rest.model.TestColumnSchemaModel
Tests run: 2, Failures: 0, Errors: 0, Skipped: 0, Time elapsed: 0.3 sec
Running org.apache.hadoop.hbase.regionserver.TestStoreFile
Tests run: 6, Failures: 0, Errors: 0, Skipped: 0, Time elapsed: 36.084 sec
Running org.apache.hadoop.hbase.zookeeper.TestZooKeeperNodeTracker
Tests run: 1, Failures: 0, Errors: 0, Skipped: 0, Time elapsed: 0.756 sec
Running org.apache.hadoop.hbase.rest.model.TestScannerModel
Tests run: 3, Failures: 0, Errors: 0, Skipped: 0, Time elapsed: 0.496 sec
Running org.apache.hadoop.hbase.regionserver.wal.TestHLogMethods
Tests run: 1, Failures: 0, Errors: 0, Skipped: 0, Time elapsed: 0.528 sec
Running org.apache.hadoop.hbase.rest.TestVersionResource
Tests run: 1, Failures: 0, Errors: 0, Skipped: 0, Time elapsed: 22.444 sec
Running org.apache.hadoop.hbase.filter.TestFilter
Tests run: 15, Failures: 0, Errors: 0, Skipped: 0, Time elapsed: 3.053 sec
Running org.apache.hadoop.hbase.regionserver.TestWideScanner
Tests run: 1, Failures: 0, Errors: 0, Skipped: 0, Time elapsed: 12.568 sec
Running org.apache.hadoop.hbase.regionserver.TestSplitTransaction
Tests run: 5, Failures: 0, Errors: 0, Skipped: 0, Time elapsed: 4.458 sec
Running org.apache.hadoop.hbase.util.TestMergeTable
Tests run: 1, Failures: 0, Errors: 0, Skipped: 0, Time elapsed: 95.024 sec
Running org.apache.hadoop.hbase.regionserver.TestReadWriteConsistencyControl
Tests run: 1, Failures: 0, Errors: 0, Skipped: 0, Time elapsed: 10.043 sec
Running org.apache.hadoop.hbase.regionserver.TestGetClosestAtOrBefore
Tests run: 3, Failures: 0, Errors: 0, Skipped: 0, Time elapsed: 11.201 sec
Running org.apache.hadoop.hbase.rest.model.TestVersionModel
Tests run: 3, Failures: 0, Errors: 0, Skipped: 0, Time elapsed: 0.47 sec
Running org.apache.hadoop.hbase.rest.model.TestCellSetModel
Tests run: 3, Failures: 0, Errors: 0, Skipped: 0, Time elapsed: 0.568 sec
Running org.apache.hadoop.hbase.rest.client.TestRemoteTable
Tests run: 5, Failures: 0, Errors: 5, Skipped: 0, Time elapsed: 658.566 sec <<< FAILURE!
Running org.apache.hadoop.hbase.rest.model.TestStorageClusterStatusModel
Tests run: 3, Failures: 0, Errors: 0, Skipped: 0, Time elapsed: 0.54 sec
Running org.apache.hadoop.hbase.avro.TestAvroServer
Tests run: 3, Failures: 0, Errors: 3, Skipped: 0, Time elapsed: 264.998 sec <<< FAILURE!
Running org.apache.hadoop.hbase.TestFullLogReconstruction
Tests run: 1, Failures: 0, Errors: 1, Skipped: 0, Time elapsed: 130.704 sec <<< FAILURE!
Running org.apache.hadoop.hbase.TestSerialization
Tests run: 19, Failures: 0, Errors: 0, Skipped: 0, Time elapsed: 0.243 sec
Running org.apache.hadoop.hbase.regionserver.TestKeyValueHeap
Tests run: 3, Failures: 0, Errors: 0, Skipped: 0, Time elapsed: 0.523 sec
Running org.apache.hadoop.hbase.regionserver.TestStoreScanner
Tests run: 14, Failures: 0, Errors: 0, Skipped: 0, Time elapsed: 0.136 sec
Running org.apache.hadoop.hbase.TestHMsg
Tests run: 2, Failures: 0, Errors: 0, Skipped: 0, Time elapsed: 0.143 sec
Running org.apache.hadoop.hbase.io.hfile.TestReseekTo
Tests run: 1, Failures: 0, Errors: 0, Skipped: 0, Time elapsed: 0.552 sec
Running org.apache.hadoop.hbase.util.TestIncrementingEnvironmentEdge
Tests run: 1, Failures: 0, Errors: 0, Skipped: 0, Time elapsed: 0.064 sec
Running org.apache.hadoop.hbase.util.TestKeying
Tests run: 1, Failures: 0, Errors: 0, Skipped: 0, Time elapsed: 0.039 sec
Running org.apache.hadoop.hbase.regionserver.TestScanner
Tests run: 6, Failures: 0, Errors: 0, Skipped: 0, Time elapsed: 71.749 sec
Running org.apache.hadoop.hbase.regionserver.TestHRegionInfo
Tests run: 2, Failures: 0, Errors: 0, Skipped: 0, Time elapsed: 0.161 sec
Running org.apache.hadoop.hbase.master.TestRestartCluster
killed.
[INFO] ------------------------------------------------------------------------
[ERROR] BUILD ERROR
[INFO] ------------------------------------------------------------------------
[INFO] Error while executing forked tests.; nested exception is org.apache.maven.surefire.booter.shade.org.codehaus.plexus.util.cli.CommandLineTimeOutException:
Error while executing external command, process killed.

Process timeout out after 3600 seconds
[INFO] ------------------------------------------------------------------------
[INFO] For more information, run Maven with the -e switch
[INFO] ------------------------------------------------------------------------
[INFO] Total time: 117 minutes 14 seconds
[INFO] Finished at: Tue Sep 21 09:13:35 UTC 2010
[INFO] Final Memory: 46M/211M
[INFO] ------------------------------------------------------------------------
[locks-and-latches] Releasing all the locks
[locks-and-latches] All the locks released
Archiving artifacts
Recording test results


Mime
View raw message