hbase-dev mailing list archives

Site index · List index
Message view « Date » · « Thread »
Top « Date » · « Thread »
From Stack <st...@duboce.net>
Subject Re: Build failed in Hudson: HBase-TRUNK #1390
Date Tue, 20 Jul 2010 04:32:03 GMT
Ryan:

The bulk of these tests fail for me locally too since the changes to
ICV and purge of Get code went in:

>>><<< org.apache.hadoop.hbase.regionserver.TestStore.testIncrementColumnValue_ICVDuringFlush

All of the TestQueryMatcher tests.

Could you take a look?

I'm looking into TestLoadIncrementalHFiles.  That looks like it could
have been my commit.
Thanks,
St.Ack





On Mon, Jul 19, 2010 at 5:36 PM, Apache Hudson Server
<hudson@hudson.zones.apache.org> wrote:
> See <http://hudson.zones.apache.org/hudson/job/HBase-TRUNK/1390/changes>
>
> Changes:
>
> [stack] HBASE-1511 Pseudo distributed mode in LocalHBaseCluster
>
> [stack] HBASE-2727 Splits writing one file only is untenable; need dir of recovered edits
ordered by sequenceid (Forgot to add a test)
>
> ------------------------------------------
> [...truncated 926 lines...]
> Tests run: 1, Failures: 0, Errors: 0, Skipped: 0, Time elapsed: 0.132 sec
> Running org.apache.hadoop.hbase.util.TestEnvironmentEdgeManager
> Tests run: 2, Failures: 0, Errors: 0, Skipped: 0, Time elapsed: 0.327 sec
> Running org.apache.hadoop.hbase.regionserver.TestExplicitColumnTracker
> Tests run: 4, Failures: 0, Errors: 0, Skipped: 0, Time elapsed: 0.923 sec
> Running org.apache.hadoop.hbase.master.TestServerManager
> Tests run: 1, Failures: 0, Errors: 0, Skipped: 0, Time elapsed: 0.133 sec
> Running org.apache.hadoop.hbase.util.TestDefaultEnvironmentEdge
> Tests run: 1, Failures: 0, Errors: 0, Skipped: 0, Time elapsed: 0.064 sec
> Running org.apache.hadoop.hbase.master.TestMasterTransitions
> Tests run: 3, Failures: 0, Errors: 0, Skipped: 0, Time elapsed: 96.505 sec
> Running org.apache.hadoop.hbase.regionserver.TestScanWildcardColumnTracker
> Tests run: 2, Failures: 0, Errors: 0, Skipped: 0, Time elapsed: 0.385 sec
> Running org.apache.hadoop.hbase.regionserver.TestKeyValueSkipListSet
> Tests run: 4, Failures: 0, Errors: 0, Skipped: 0, Time elapsed: 0.119 sec
> Running org.apache.hadoop.hbase.io.hfile.TestSeekTo
> Tests run: 3, Failures: 0, Errors: 0, Skipped: 0, Time elapsed: 0.607 sec
> Running org.apache.hadoop.hbase.filter.TestPageFilter
> Tests run: 2, Failures: 0, Errors: 0, Skipped: 0, Time elapsed: 0.039 sec
> Running org.apache.hadoop.hbase.TestMergeMeta
> Tests run: 1, Failures: 0, Errors: 0, Skipped: 0, Time elapsed: 94.851 sec
> Running org.apache.hadoop.hbase.filter.TestColumnPaginationFilter
> Tests run: 1, Failures: 0, Errors: 0, Skipped: 0, Time elapsed: 0.112 sec
> Running org.apache.hadoop.hbase.rest.TestStatusResource
> Tests run: 1, Failures: 0, Errors: 0, Skipped: 0, Time elapsed: 16.01 sec
> Running org.apache.hadoop.hbase.client.TestFromClientSide
> Tests run: 35, Failures: 0, Errors: 0, Skipped: 4, Time elapsed: 293.594 sec
> Running org.apache.hadoop.hbase.replication.TestReplication
> Tests run: 5, Failures: 1, Errors: 0, Skipped: 0, Time elapsed: 272.111 sec <<<
FAILURE!
> Running org.apache.hadoop.hbase.regionserver.TestCompaction
> Tests run: 2, Failures: 0, Errors: 0, Skipped: 0, Time elapsed: 87.041 sec
> Running org.apache.hadoop.hbase.TestMultiParallelPut
> Tests run: 2, Failures: 0, Errors: 0, Skipped: 0, Time elapsed: 102.347 sec
> Running org.apache.hadoop.hbase.master.TestRegionManager
> Tests run: 1, Failures: 0, Errors: 0, Skipped: 0, Time elapsed: 15.519 sec
> Running org.apache.hadoop.hbase.filter.TestSingleColumnValueFilter
> Tests run: 2, Failures: 0, Errors: 0, Skipped: 0, Time elapsed: 0.145 sec
> Running org.apache.hadoop.hbase.mapreduce.TestTimeRangeMapRed
> Tests run: 1, Failures: 0, Errors: 0, Skipped: 0, Time elapsed: 43.718 sec
> Running org.apache.hadoop.hbase.mapreduce.TestSimpleTotalOrderPartitioner
> Tests run: 1, Failures: 0, Errors: 0, Skipped: 0, Time elapsed: 0.385 sec
> Running org.apache.hadoop.hbase.mapreduce.TestHFileOutputFormat
> Tests run: 5, Failures: 0, Errors: 0, Skipped: 0, Time elapsed: 237.289 sec
> Running org.apache.hadoop.hbase.regionserver.TestFSErrorsExposed
> Tests run: 3, Failures: 0, Errors: 0, Skipped: 0, Time elapsed: 77.776 sec
> Running org.apache.hadoop.hbase.regionserver.TestScanDeleteTracker
> Tests run: 6, Failures: 0, Errors: 0, Skipped: 0, Time elapsed: 0.574 sec
> Running org.apache.hadoop.hbase.client.TestMetaScanner
> Tests run: 1, Failures: 0, Errors: 0, Skipped: 0, Time elapsed: 25.494 sec
> Running org.apache.hadoop.hbase.metrics.TestMetricsMBeanBase
> Tests run: 2, Failures: 0, Errors: 0, Skipped: 0, Time elapsed: 0.122 sec
> Running org.apache.hadoop.hbase.TestRegionRebalancing
> Tests run: 1, Failures: 0, Errors: 0, Skipped: 0, Time elapsed: 70.139 sec
> Running org.apache.hadoop.hbase.master.TestROOTAssignment
> Tests run: 1, Failures: 0, Errors: 0, Skipped: 0, Time elapsed: 36.845 sec
> Running org.apache.hadoop.hbase.filter.TestSingleColumnValueExcludeFilter
> Tests run: 1, Failures: 0, Errors: 0, Skipped: 0, Time elapsed: 0.114 sec
> Running org.apache.hadoop.hbase.filter.TestInclusiveStopFilter
> Tests run: 2, Failures: 0, Errors: 0, Skipped: 0, Time elapsed: 0.107 sec
> Running org.apache.hadoop.hbase.rest.TestTableResource
> Tests run: 1, Failures: 0, Errors: 0, Skipped: 0, Time elapsed: 49.057 sec
> Running org.apache.hadoop.hbase.mapreduce.TestLoadIncrementalHFiles
> Tests run: 3, Failures: 2, Errors: 0, Skipped: 0, Time elapsed: 62.161 sec <<<
FAILURE!
> Running org.apache.hadoop.hbase.rest.TestSchemaResource
> Tests run: 1, Failures: 0, Errors: 0, Skipped: 0, Time elapsed: 39.792 sec
> Running org.apache.hadoop.hbase.regionserver.wal.TestWALReplay
> Tests run: 4, Failures: 0, Errors: 0, Skipped: 0, Time elapsed: 28.409 sec
> Running org.apache.hadoop.hbase.regionserver.TestKeyValueScanFixture
> Tests run: 1, Failures: 0, Errors: 0, Skipped: 0, Time elapsed: 0.113 sec
> Running org.apache.hadoop.hbase.rest.model.TestTableListModel
> Tests run: 3, Failures: 0, Errors: 0, Skipped: 0, Time elapsed: 0.486 sec
> Running org.apache.hadoop.hbase.rest.model.TestColumnSchemaModel
> Tests run: 2, Failures: 0, Errors: 0, Skipped: 0, Time elapsed: 0.297 sec
> Running org.apache.hadoop.hbase.regionserver.TestStoreFile
> Tests run: 6, Failures: 0, Errors: 0, Skipped: 0, Time elapsed: 43.294 sec
> Running org.apache.hadoop.hbase.master.TestZKBasedReopenRegion
> Tests run: 1, Failures: 0, Errors: 0, Skipped: 0, Time elapsed: 45.623 sec
> Running org.apache.hadoop.hbase.rest.model.TestScannerModel
> Tests run: 3, Failures: 0, Errors: 0, Skipped: 0, Time elapsed: 0.502 sec
> Running org.apache.hadoop.hbase.regionserver.wal.TestHLogMethods
> Tests run: 1, Failures: 0, Errors: 0, Skipped: 0, Time elapsed: 0.419 sec
> Running org.apache.hadoop.hbase.rest.TestVersionResource
> Tests run: 1, Failures: 0, Errors: 0, Skipped: 0, Time elapsed: 27.899 sec
> Running org.apache.hadoop.hbase.filter.TestFilter
> Tests run: 15, Failures: 0, Errors: 0, Skipped: 0, Time elapsed: 3.196 sec
> Running org.apache.hadoop.hbase.regionserver.TestWideScanner
> Tests run: 1, Failures: 0, Errors: 0, Skipped: 0, Time elapsed: 15.837 sec
> Running org.apache.hadoop.hbase.TestMergeTable
> Tests run: 1, Failures: 0, Errors: 0, Skipped: 0, Time elapsed: 80.239 sec
> Running org.apache.hadoop.hbase.replication.regionserver.TestReplicationSink
> Tests run: 5, Failures: 0, Errors: 0, Skipped: 0, Time elapsed: 32.243 sec
> Running org.apache.hadoop.hbase.regionserver.TestReadWriteConsistencyControl
> Tests run: 1, Failures: 0, Errors: 0, Skipped: 0, Time elapsed: 10.043 sec
> Running org.apache.hadoop.hbase.regionserver.TestGetClosestAtOrBefore
> Tests run: 3, Failures: 0, Errors: 0, Skipped: 0, Time elapsed: 12.062 sec
> Running org.apache.hadoop.hbase.rest.model.TestVersionModel
> Tests run: 3, Failures: 0, Errors: 0, Skipped: 0, Time elapsed: 0.467 sec
> Running org.apache.hadoop.hbase.rest.model.TestCellSetModel
> Tests run: 3, Failures: 0, Errors: 0, Skipped: 0, Time elapsed: 0.528 sec
> Running org.apache.hadoop.hbase.rest.client.TestRemoteTable
> Tests run: 5, Failures: 0, Errors: 0, Skipped: 0, Time elapsed: 181.736 sec
> Running org.apache.hadoop.hbase.rest.model.TestStorageClusterStatusModel
> Tests run: 3, Failures: 0, Errors: 0, Skipped: 0, Time elapsed: 0.559 sec
> Running org.apache.hadoop.hbase.avro.TestAvroServer
> Tests run: 3, Failures: 0, Errors: 0, Skipped: 0, Time elapsed: 70.318 sec
> Running org.apache.hadoop.hbase.TestFullLogReconstruction
> Tests run: 1, Failures: 0, Errors: 0, Skipped: 0, Time elapsed: 78.361 sec
> Running org.apache.hadoop.hbase.TestSerialization
> Tests run: 18, Failures: 0, Errors: 0, Skipped: 0, Time elapsed: 0.914 sec
> Running org.apache.hadoop.hbase.regionserver.TestKeyValueHeap
> Tests run: 3, Failures: 0, Errors: 0, Skipped: 0, Time elapsed: 0.459 sec
> Running org.apache.hadoop.hbase.regionserver.TestStoreScanner
> Tests run: 14, Failures: 0, Errors: 0, Skipped: 0, Time elapsed: 0.135 sec
> Running org.apache.hadoop.hbase.TestHMsg
> Tests run: 2, Failures: 0, Errors: 0, Skipped: 0, Time elapsed: 0.14 sec
> Running org.apache.hadoop.hbase.util.TestIncrementingEnvironmentEdge
> Tests run: 1, Failures: 0, Errors: 0, Skipped: 0, Time elapsed: 0.063 sec
> Running org.apache.hadoop.hbase.util.TestKeying
> Tests run: 1, Failures: 0, Errors: 0, Skipped: 0, Time elapsed: 0.038 sec
> Running org.apache.hadoop.hbase.regionserver.TestScanner
> Tests run: 6, Failures: 0, Errors: 0, Skipped: 0, Time elapsed: 65.193 sec
> Running org.apache.hadoop.hbase.regionserver.TestHRegionInfo
> Tests run: 2, Failures: 0, Errors: 0, Skipped: 0, Time elapsed: 0.156 sec
> Running org.apache.hadoop.hbase.master.TestRestartCluster
> Tests run: 1, Failures: 0, Errors: 0, Skipped: 0, Time elapsed: 20.472 sec
> Running org.apache.hadoop.hbase.client.TestShell
> Tests run: 1, Failures: 0, Errors: 0, Skipped: 0, Time elapsed: 46.159 sec
> Running org.apache.hadoop.hbase.rest.model.TestTableInfoModel
> Tests run: 3, Failures: 0, Errors: 0, Skipped: 0, Time elapsed: 0.497 sec
> Running org.apache.hadoop.hbase.regionserver.TestMinorCompactingStoreScanner
> Tests run: 2, Failures: 0, Errors: 0, Skipped: 0, Time elapsed: 0.115 sec
> Running org.apache.hadoop.hbase.TestInfoServers
> Tests run: 1, Failures: 0, Errors: 0, Skipped: 0, Time elapsed: 13.96 sec
> Running org.apache.hadoop.hbase.master.TestOldLogsCleaner
> Tests run: 1, Failures: 0, Errors: 0, Skipped: 0, Time elapsed: 0.828 sec
> Running org.apache.hadoop.hbase.regionserver.TestQueryMatcher
> Tests run: 4, Failures: 4, Errors: 0, Skipped: 0, Time elapsed: 0.487 sec <<<
FAILURE!
> Running org.apache.hadoop.hbase.client.TestAdmin
> Tests run: 15, Failures: 0, Errors: 0, Skipped: 0, Time elapsed: 236.364 sec
> Running org.apache.hadoop.hbase.TestMultiClusters
> Tests run: 1, Failures: 0, Errors: 0, Skipped: 0, Time elapsed: 29.124 sec
> Running org.apache.hadoop.hbase.util.TestMergeTool
> Tests run: 1, Failures: 0, Errors: 0, Skipped: 0, Time elapsed: 13.89 sec
> Running org.apache.hadoop.hbase.TestAcidGuarantees
> Tests run: 3, Failures: 0, Errors: 0, Skipped: 2, Time elapsed: 39.805 sec
> Running org.apache.hadoop.hbase.TestEmptyMetaInfo
> Tests run: 1, Failures: 0, Errors: 0, Skipped: 0, Time elapsed: 33.9 sec
> Running org.apache.hadoop.hbase.master.TestKillingServersFromMaster
> Tests run: 3, Failures: 0, Errors: 0, Skipped: 0, Time elapsed: 18.64 sec
> Running org.apache.hadoop.hbase.util.TestBase64
> Tests run: 1, Failures: 0, Errors: 0, Skipped: 0, Time elapsed: 0.104 sec
> Running org.apache.hadoop.hbase.regionserver.TestMemStore
> Tests run: 20, Failures: 0, Errors: 0, Skipped: 0, Time elapsed: 0.55 sec
> Running org.apache.hadoop.hbase.master.TestMasterWithDisabling
> Tests run: 1, Failures: 0, Errors: 0, Skipped: 0, Time elapsed: 95.514 sec
> Running org.apache.hadoop.hbase.rest.TestScannerResource
> Tests run: 1, Failures: 0, Errors: 0, Skipped: 0, Time elapsed: 48.297 sec
> Running org.apache.hadoop.hbase.io.hfile.TestLruBlockCache
> Tests run: 7, Failures: 0, Errors: 0, Skipped: 0, Time elapsed: 1.151 sec
> Running org.apache.hadoop.hbase.master.TestRegionServerOperationQueue
> Tests run: 1, Failures: 0, Errors: 0, Skipped: 0, Time elapsed: 10.184 sec
> Running org.apache.hadoop.hbase.mapreduce.TestTableMapReduce
> Tests run: 2, Failures: 0, Errors: 0, Skipped: 0, Time elapsed: 102.477 sec
> Running org.apache.hadoop.hbase.TestKeyValue
> Tests run: 8, Failures: 0, Errors: 0, Skipped: 0, Time elapsed: 0.125 sec
> Running org.apache.hadoop.hbase.master.TestZKBasedCloseRegion
> Tests run: 1, Failures: 0, Errors: 0, Skipped: 0, Time elapsed: 33.264 sec
> Running org.apache.hadoop.hbase.master.TestMaster
> Tests run: 1, Failures: 0, Errors: 0, Skipped: 0, Time elapsed: 23.12 sec
> Running org.apache.hadoop.hbase.client.TestHTablePool
> Tests run: 5, Failures: 0, Errors: 0, Skipped: 0, Time elapsed: 27.147 sec
> Running org.apache.hadoop.hbase.master.TestMinimumServerCount
> Tests run: 1, Failures: 0, Errors: 0, Skipped: 0, Time elapsed: 53.291 sec
> Running org.apache.hadoop.hbase.rest.model.TestTableSchemaModel
> Tests run: 3, Failures: 0, Errors: 0, Skipped: 0, Time elapsed: 0.516 sec
> Running org.apache.hadoop.hbase.util.TestByteBloomFilter
> Tests run: 4, Failures: 0, Errors: 0, Skipped: 0, Time elapsed: 0.958 sec
> Running org.apache.hadoop.hbase.filter.TestFilterList
> Tests run: 4, Failures: 0, Errors: 0, Skipped: 0, Time elapsed: 0.152 sec
> Running org.apache.hadoop.hbase.mapreduce.TestTableInputFormatScan
> Tests run: 11, Failures: 0, Errors: 0, Skipped: 0, Time elapsed: 347.086 sec
> Running org.apache.hadoop.hbase.regionserver.TestHRegion
> Tests run: 48, Failures: 0, Errors: 0, Skipped: 0, Time elapsed: 146.25 sec
> Running org.apache.hadoop.hbase.rest.model.TestTableRegionModel
> Tests run: 2, Failures: 0, Errors: 0, Skipped: 0, Time elapsed: 0.356 sec
> Running org.apache.hadoop.hbase.client.TestTimestampsFilter
> Tests run: 2, Failures: 0, Errors: 0, Skipped: 0, Time elapsed: 52.408 sec
> Running org.apache.hadoop.hbase.util.TestRootPath
> Tests run: 1, Failures: 0, Errors: 0, Skipped: 0, Time elapsed: 0.11 sec
> Running org.apache.hadoop.hbase.client.TestScannerTimeout
> Tests run: 2, Failures: 0, Errors: 0, Skipped: 0, Time elapsed: 31.704 sec
> Running org.apache.hadoop.hbase.mapred.TestTableMapReduce
> Tests run: 1, Failures: 0, Errors: 0, Skipped: 0, Time elapsed: 79.053 sec
> Running org.apache.hadoop.hbase.replication.regionserver.TestReplicationSourceManager
> Tests run: 1, Failures: 0, Errors: 0, Skipped: 0, Time elapsed: 2.243 sec
> Running org.apache.hadoop.hbase.util.TestBytes
> Tests run: 10, Failures: 0, Errors: 0, Skipped: 0, Time elapsed: 0.115 sec
> Running org.apache.hadoop.hbase.client.TestGetRowVersions
> Tests run: 1, Failures: 0, Errors: 0, Skipped: 0, Time elapsed: 34.246 sec
> Running org.apache.hadoop.hbase.filter.TestDependentColumnFilter
> Tests run: 2, Failures: 0, Errors: 0, Skipped: 0, Time elapsed: 0.86 sec
> Running org.apache.hadoop.hbase.rest.model.TestCellModel
> Tests run: 3, Failures: 0, Errors: 0, Skipped: 0, Time elapsed: 0.473 sec
> Running org.apache.hadoop.hbase.replication.TestReplicationSource
> Tests run: 1, Failures: 0, Errors: 0, Skipped: 0, Time elapsed: 18.161 sec
> Running org.apache.hadoop.hbase.rest.TestRowResource
> Tests run: 1, Failures: 0, Errors: 0, Skipped: 0, Time elapsed: 40.924 sec
> Running org.apache.hadoop.hbase.io.hfile.TestHFile
> Tests run: 7, Failures: 0, Errors: 0, Skipped: 0, Time elapsed: 0.853 sec
> Running org.apache.hadoop.hbase.regionserver.wal.TestLogActionsListener
> Tests run: 1, Failures: 0, Errors: 0, Skipped: 0, Time elapsed: 0.926 sec
> Running org.apache.hadoop.hbase.mapreduce.TestImportTsv
> Tests run: 1, Failures: 0, Errors: 0, Skipped: 0, Time elapsed: 0.183 sec
> Running org.apache.hadoop.hbase.rest.client.TestRemoteAdmin
> Tests run: 2, Failures: 0, Errors: 0, Skipped: 0, Time elapsed: 60.891 sec
> Running org.apache.hadoop.hbase.regionserver.wal.TestHLog
> Tests run: 6, Failures: 0, Errors: 0, Skipped: 0, Time elapsed: 102.015 sec
> Running org.apache.hadoop.hbase.client.TestTimestamp
> Tests run: 1, Failures: 0, Errors: 0, Skipped: 0, Time elapsed: 19.004 sec
> Running org.apache.hadoop.hbase.TestScanMultipleVersions
> Tests run: 1, Failures: 0, Errors: 0, Skipped: 0, Time elapsed: 14.359 sec
> Running org.apache.hadoop.hbase.rest.model.TestStorageClusterVersionModel
> Tests run: 2, Failures: 0, Errors: 0, Skipped: 0, Time elapsed: 0.302 sec
> Running org.apache.hadoop.hbase.client.TestHCM
> Tests run: 1, Failures: 0, Errors: 0, Skipped: 0, Time elapsed: 20.145 sec
>
> Results :
>
> Failed tests:
>
> Tests run: 477, Failures: 8, Errors: 0, Skipped: 6
>
> [INFO] ------------------------------------------------------------------------
> [ERROR] BUILD FAILURE
> [INFO] ------------------------------------------------------------------------
> [INFO] There are test failures.
>
> Please refer to <http://hudson.zones.apache.org/hudson/job/HBase-TRUNK/ws/trunk/target/surefire-reports>
for the individual test results.
> [INFO] ------------------------------------------------------------------------
> [INFO] For more information, run Maven with the -e switch
> [INFO] ------------------------------------------------------------------------
> [INFO] Total time: 79 minutes 39 seconds
> [INFO] Finished at: Tue Jul 20 00:36:44 UTC 2010
> [INFO] Final Memory: 36M/188M
> [INFO] ------------------------------------------------------------------------
> [locks-and-latches] Releasing all the locks
> [locks-and-latches] All the locks released
> Archiving artifacts
> Recording test results
>
>

Mime
View raw message