hbase-dev mailing list archives

Site index · List index
Message view « Date » · « Thread »
Top « Date » · « Thread »
From Ryan Rawson <ryano...@gmail.com>
Subject Re: Build failed in Hudson: HBase-TRUNK #1374
Date Thu, 08 Jul 2010 04:55:27 GMT
multiple failures in weird places, none of which happened when i ran
mvn test before commit.

why is hudson so borked?

On Wed, Jul 7, 2010 at 9:43 PM, Apache Hudson Server
<hudson@hudson.zones.apache.org> wrote:
> See <http://hudson.zones.apache.org/hudson/job/HBase-TRUNK/1374/changes>
>
> Changes:
>
> [rawson] HBASE-2797  Another NPE in ReadWriteConsistencyControl
>
> ------------------------------------------
> [...truncated 895 lines...]
> Tests run: 2, Failures: 0, Errors: 0, Skipped: 0, Time elapsed: 0.365 sec
> Running org.apache.hadoop.hbase.regionserver.TestExplicitColumnTracker
> Tests run: 4, Failures: 0, Errors: 0, Skipped: 0, Time elapsed: 0.982 sec
> Running org.apache.hadoop.hbase.master.TestServerManager
> Tests run: 1, Failures: 0, Errors: 0, Skipped: 0, Time elapsed: 0.144 sec
> Running org.apache.hadoop.hbase.util.TestDefaultEnvironmentEdge
> Tests run: 1, Failures: 0, Errors: 0, Skipped: 0, Time elapsed: 0.071 sec
> Running org.apache.hadoop.hbase.master.TestMasterTransitions
> Tests run: 3, Failures: 0, Errors: 0, Skipped: 0, Time elapsed: 89.829 sec
> Running org.apache.hadoop.hbase.regionserver.TestScanWildcardColumnTracker
> Tests run: 2, Failures: 0, Errors: 0, Skipped: 0, Time elapsed: 0.453 sec
> Running org.apache.hadoop.hbase.regionserver.TestKeyValueSkipListSet
> Tests run: 4, Failures: 0, Errors: 0, Skipped: 0, Time elapsed: 0.131 sec
> Running org.apache.hadoop.hbase.io.hfile.TestSeekTo
> Tests run: 3, Failures: 0, Errors: 0, Skipped: 0, Time elapsed: 0.579 sec
> Running org.apache.hadoop.hbase.filter.TestPageFilter
> Tests run: 2, Failures: 0, Errors: 0, Skipped: 0, Time elapsed: 0.041 sec
> Running org.apache.hadoop.hbase.TestMergeMeta
> Tests run: 1, Failures: 0, Errors: 1, Skipped: 0, Time elapsed: 97.243 sec <<<
FAILURE!
> Running org.apache.hadoop.hbase.filter.TestColumnPaginationFilter
> Tests run: 1, Failures: 0, Errors: 0, Skipped: 0, Time elapsed: 0.114 sec
> Running org.apache.hadoop.hbase.rest.TestStatusResource
> Tests run: 1, Failures: 0, Errors: 0, Skipped: 0, Time elapsed: 16.579 sec
> Running org.apache.hadoop.hbase.client.TestFromClientSide
> Tests run: 35, Failures: 0, Errors: 0, Skipped: 4, Time elapsed: 267.53 sec
> Running org.apache.hadoop.hbase.replication.TestReplication
> Tests run: 5, Failures: 0, Errors: 1, Skipped: 0, Time elapsed: 166.742 sec <<<
FAILURE!
> Running org.apache.hadoop.hbase.regionserver.TestCompaction
> Tests run: 2, Failures: 0, Errors: 0, Skipped: 0, Time elapsed: 122.446 sec
> Running org.apache.hadoop.hbase.TestMultiParallelPut
> Tests run: 2, Failures: 0, Errors: 0, Skipped: 0, Time elapsed: 104.292 sec
> Running org.apache.hadoop.hbase.master.TestRegionManager
> Tests run: 1, Failures: 0, Errors: 0, Skipped: 0, Time elapsed: 40.706 sec
> Running org.apache.hadoop.hbase.filter.TestSingleColumnValueFilter
> Tests run: 2, Failures: 0, Errors: 0, Skipped: 0, Time elapsed: 0.154 sec
> Running org.apache.hadoop.hbase.mapreduce.TestTimeRangeMapRed
> Tests run: 1, Failures: 0, Errors: 0, Skipped: 0, Time elapsed: 59.419 sec
> Running org.apache.hadoop.hbase.mapreduce.TestSimpleTotalOrderPartitioner
> Tests run: 1, Failures: 0, Errors: 0, Skipped: 0, Time elapsed: 0.373 sec
> Running org.apache.hadoop.hbase.regionserver.TestGetDeleteTracker
> Tests run: 7, Failures: 0, Errors: 0, Skipped: 0, Time elapsed: 0.763 sec
> Running org.apache.hadoop.hbase.mapreduce.TestHFileOutputFormat
> Tests run: 5, Failures: 0, Errors: 0, Skipped: 0, Time elapsed: 196.366 sec
> Running org.apache.hadoop.hbase.regionserver.TestFSErrorsExposed
> Tests run: 3, Failures: 0, Errors: 0, Skipped: 0, Time elapsed: 710.911 sec
> Running org.apache.hadoop.hbase.regionserver.TestScanDeleteTracker
> Tests run: 6, Failures: 0, Errors: 0, Skipped: 0, Time elapsed: 0.758 sec
> Running org.apache.hadoop.hbase.client.TestMetaScanner
> Tests run: 1, Failures: 0, Errors: 0, Skipped: 0, Time elapsed: 25.57 sec
> Running org.apache.hadoop.hbase.metrics.TestMetricsMBeanBase
> Tests run: 2, Failures: 0, Errors: 0, Skipped: 0, Time elapsed: 0.128 sec
> Running org.apache.hadoop.hbase.TestRegionRebalancing
> Tests run: 1, Failures: 0, Errors: 0, Skipped: 0, Time elapsed: 104.855 sec
> Running org.apache.hadoop.hbase.master.TestROOTAssignment
> Tests run: 1, Failures: 0, Errors: 0, Skipped: 0, Time elapsed: 39.625 sec
> Running org.apache.hadoop.hbase.filter.TestSingleColumnValueExcludeFilter
> Tests run: 1, Failures: 0, Errors: 0, Skipped: 0, Time elapsed: 0.122 sec
> Running org.apache.hadoop.hbase.filter.TestInclusiveStopFilter
> Tests run: 2, Failures: 0, Errors: 0, Skipped: 0, Time elapsed: 0.115 sec
> Running org.apache.hadoop.hbase.rest.TestTableResource
> Tests run: 1, Failures: 0, Errors: 0, Skipped: 0, Time elapsed: 52.757 sec
> Running org.apache.hadoop.hbase.mapreduce.TestLoadIncrementalHFiles
> Tests run: 3, Failures: 0, Errors: 0, Skipped: 0, Time elapsed: 59.962 sec
> Running org.apache.hadoop.hbase.rest.TestSchemaResource
> Tests run: 1, Failures: 0, Errors: 0, Skipped: 0, Time elapsed: 38.272 sec
> Running org.apache.hadoop.hbase.regionserver.wal.TestWALReplay
> Tests run: 3, Failures: 0, Errors: 0, Skipped: 0, Time elapsed: 25.563 sec
> Running org.apache.hadoop.hbase.regionserver.TestKeyValueScanFixture
> Tests run: 1, Failures: 0, Errors: 0, Skipped: 0, Time elapsed: 0.133 sec
> Running org.apache.hadoop.hbase.rest.model.TestTableListModel
> Tests run: 3, Failures: 0, Errors: 0, Skipped: 0, Time elapsed: 0.517 sec
> Running org.apache.hadoop.hbase.rest.model.TestColumnSchemaModel
> Tests run: 2, Failures: 0, Errors: 0, Skipped: 0, Time elapsed: 0.322 sec
> Running org.apache.hadoop.hbase.regionserver.TestWildcardColumnTracker
> Tests run: 6, Failures: 0, Errors: 0, Skipped: 0, Time elapsed: 0.952 sec
> Running org.apache.hadoop.hbase.regionserver.TestStoreFile
> Tests run: 5, Failures: 0, Errors: 0, Skipped: 0, Time elapsed: 49.771 sec
> Running org.apache.hadoop.hbase.master.TestZKBasedReopenRegion
> Tests run: 1, Failures: 0, Errors: 0, Skipped: 0, Time elapsed: 33.714 sec
> Running org.apache.hadoop.hbase.rest.model.TestScannerModel
> Tests run: 3, Failures: 0, Errors: 0, Skipped: 0, Time elapsed: 0.61 sec
> Running org.apache.hadoop.hbase.rest.TestVersionResource
> Tests run: 1, Failures: 0, Errors: 0, Skipped: 0, Time elapsed: 16.653 sec
> Running org.apache.hadoop.hbase.filter.TestFilter
> Tests run: 15, Failures: 0, Errors: 0, Skipped: 0, Time elapsed: 3.495 sec
> Running org.apache.hadoop.hbase.regionserver.TestWideScanner
> Tests run: 1, Failures: 0, Errors: 0, Skipped: 0, Time elapsed: 33.84 sec
> Running org.apache.hadoop.hbase.TestMergeTable
> Tests run: 1, Failures: 0, Errors: 0, Skipped: 0, Time elapsed: 102.942 sec
> Running org.apache.hadoop.hbase.replication.regionserver.TestReplicationSink
> Tests run: 5, Failures: 0, Errors: 0, Skipped: 0, Time elapsed: 32.254 sec
> Running org.apache.hadoop.hbase.regionserver.TestReadWriteConsistencyControl
> Tests run: 1, Failures: 0, Errors: 0, Skipped: 0, Time elapsed: 10.053 sec
> Running org.apache.hadoop.hbase.regionserver.TestGetClosestAtOrBefore
> Tests run: 3, Failures: 0, Errors: 0, Skipped: 0, Time elapsed: 39.913 sec
> Running org.apache.hadoop.hbase.rest.model.TestVersionModel
> Tests run: 3, Failures: 0, Errors: 0, Skipped: 0, Time elapsed: 0.497 sec
> Running org.apache.hadoop.hbase.rest.model.TestCellSetModel
> Tests run: 3, Failures: 0, Errors: 0, Skipped: 0, Time elapsed: 0.549 sec
> Running org.apache.hadoop.hbase.rest.client.TestRemoteTable
> Tests run: 5, Failures: 0, Errors: 0, Skipped: 0, Time elapsed: 181.957 sec
> Running org.apache.hadoop.hbase.rest.model.TestStorageClusterStatusModel
> Tests run: 3, Failures: 0, Errors: 0, Skipped: 0, Time elapsed: 0.56 sec
> Running org.apache.hadoop.hbase.avro.TestAvroServer
> Tests run: 3, Failures: 0, Errors: 0, Skipped: 0, Time elapsed: 60.015 sec
> Running org.apache.hadoop.hbase.TestFullLogReconstruction
> Tests run: 1, Failures: 0, Errors: 0, Skipped: 0, Time elapsed: 69.476 sec
> Running org.apache.hadoop.hbase.TestSerialization
> Tests run: 18, Failures: 0, Errors: 0, Skipped: 0, Time elapsed: 1.01 sec
> Running org.apache.hadoop.hbase.regionserver.TestKeyValueHeap
> Tests run: 3, Failures: 0, Errors: 0, Skipped: 0, Time elapsed: 0.498 sec
> Running org.apache.hadoop.hbase.regionserver.TestStoreScanner
> Tests run: 14, Failures: 0, Errors: 0, Skipped: 0, Time elapsed: 0.144 sec
> Running org.apache.hadoop.hbase.TestHMsg
> Tests run: 2, Failures: 0, Errors: 0, Skipped: 0, Time elapsed: 0.184 sec
> Running org.apache.hadoop.hbase.util.TestIncrementingEnvironmentEdge
> Tests run: 1, Failures: 0, Errors: 0, Skipped: 0, Time elapsed: 0.068 sec
> Running org.apache.hadoop.hbase.util.TestKeying
> Tests run: 1, Failures: 0, Errors: 0, Skipped: 0, Time elapsed: 0.048 sec
> Running org.apache.hadoop.hbase.regionserver.TestScanner
> Tests run: 6, Failures: 0, Errors: 0, Skipped: 0, Time elapsed: 73.353 sec
> Running org.apache.hadoop.hbase.regionserver.TestHRegionInfo
> Tests run: 2, Failures: 0, Errors: 0, Skipped: 0, Time elapsed: 0.166 sec
> Running org.apache.hadoop.hbase.master.TestRestartCluster
> Tests run: 1, Failures: 0, Errors: 0, Skipped: 0, Time elapsed: 20.94 sec
> Running org.apache.hadoop.hbase.client.TestShell
> Tests run: 1, Failures: 0, Errors: 0, Skipped: 0, Time elapsed: 61.7 sec
> Running org.apache.hadoop.hbase.rest.model.TestTableInfoModel
> Tests run: 3, Failures: 0, Errors: 0, Skipped: 0, Time elapsed: 0.625 sec
> Running org.apache.hadoop.hbase.regionserver.TestMinorCompactingStoreScanner
> Tests run: 2, Failures: 0, Errors: 0, Skipped: 0, Time elapsed: 0.123 sec
> Running org.apache.hadoop.hbase.TestInfoServers
> Tests run: 1, Failures: 0, Errors: 0, Skipped: 0, Time elapsed: 13.96 sec
> Running org.apache.hadoop.hbase.master.TestOldLogsCleaner
> Tests run: 1, Failures: 0, Errors: 0, Skipped: 0, Time elapsed: 1.03 sec
> Running org.apache.hadoop.hbase.regionserver.TestQueryMatcher
> Tests run: 4, Failures: 0, Errors: 0, Skipped: 0, Time elapsed: 0.711 sec
> Running org.apache.hadoop.hbase.client.TestAdmin
> Tests run: 15, Failures: 0, Errors: 0, Skipped: 0, Time elapsed: 271.884 sec
> Running org.apache.hadoop.hbase.TestMultiClusters
> Tests run: 1, Failures: 0, Errors: 0, Skipped: 0, Time elapsed: 65.863 sec
> Running org.apache.hadoop.hbase.util.TestMergeTool
> Tests run: 1, Failures: 1, Errors: 0, Skipped: 0, Time elapsed: 9.096 sec <<<
FAILURE!
> Running org.apache.hadoop.hbase.TestAcidGuarantees
> Tests run: 3, Failures: 0, Errors: 0, Skipped: 2, Time elapsed: 65.512 sec
> Running org.apache.hadoop.hbase.TestEmptyMetaInfo
> Tests run: 1, Failures: 0, Errors: 0, Skipped: 0, Time elapsed: 24.013 sec
> Running org.apache.hadoop.hbase.master.TestKillingServersFromMaster
> Tests run: 3, Failures: 0, Errors: 0, Skipped: 0, Time elapsed: 19.223 sec
> Running org.apache.hadoop.hbase.util.TestBase64
> Tests run: 1, Failures: 0, Errors: 0, Skipped: 0, Time elapsed: 0.12 sec
> Running org.apache.hadoop.hbase.regionserver.TestMemStore
> Tests run: 22, Failures: 0, Errors: 0, Skipped: 0, Time elapsed: 0.673 sec
> Running org.apache.hadoop.hbase.master.TestMasterWithDisabling
> Tests run: 1, Failures: 0, Errors: 0, Skipped: 0, Time elapsed: 63.44 sec
> Running org.apache.hadoop.hbase.rest.TestScannerResource
> Tests run: 1, Failures: 0, Errors: 0, Skipped: 0, Time elapsed: 53.879 sec
> Running org.apache.hadoop.hbase.io.hfile.TestLruBlockCache
> Tests run: 7, Failures: 0, Errors: 0, Skipped: 0, Time elapsed: 1.195 sec
> Running org.apache.hadoop.hbase.regionserver.TestDeleteCompare
> Tests run: 4, Failures: 0, Errors: 0, Skipped: 0, Time elapsed: 0.125 sec
> Running org.apache.hadoop.hbase.master.TestRegionServerOperationQueue
> Tests run: 1, Failures: 0, Errors: 0, Skipped: 0, Time elapsed: 10.198 sec
> Running org.apache.hadoop.hbase.mapreduce.TestTableMapReduce
> Tests run: 2, Failures: 0, Errors: 0, Skipped: 0, Time elapsed: 104.857 sec
> Running org.apache.hadoop.hbase.TestKeyValue
> Tests run: 8, Failures: 0, Errors: 0, Skipped: 0, Time elapsed: 0.132 sec
> Running org.apache.hadoop.hbase.master.TestZKBasedCloseRegion
> Tests run: 1, Failures: 0, Errors: 0, Skipped: 0, Time elapsed: 32.185 sec
> Running org.apache.hadoop.hbase.master.TestMaster
> Tests run: 1, Failures: 0, Errors: 0, Skipped: 0, Time elapsed: 22.387 sec
> Running org.apache.hadoop.hbase.client.TestHTablePool
> Tests run: 5, Failures: 0, Errors: 0, Skipped: 0, Time elapsed: 37.896 sec
> Running org.apache.hadoop.hbase.master.TestMinimumServerCount
> Tests run: 1, Failures: 0, Errors: 0, Skipped: 0, Time elapsed: 47.724 sec
> Running org.apache.hadoop.hbase.rest.model.TestTableSchemaModel
> Tests run: 3, Failures: 0, Errors: 0, Skipped: 0, Time elapsed: 0.607 sec
> Running org.apache.hadoop.hbase.filter.TestFilterList
> Tests run: 4, Failures: 0, Errors: 0, Skipped: 0, Time elapsed: 0.154 sec
> Running org.apache.hadoop.hbase.mapreduce.TestTableInputFormatScan
> Tests run: 11, Failures: 0, Errors: 0, Skipped: 0, Time elapsed: 376.685 sec
> Running org.apache.hadoop.hbase.regionserver.TestHRegion
> Tests run: 48, Failures: 0, Errors: 0, Skipped: 0, Time elapsed: 134.265 sec
> Running org.apache.hadoop.hbase.rest.model.TestTableRegionModel
> Tests run: 2, Failures: 0, Errors: 0, Skipped: 0, Time elapsed: 0.431 sec
> Running org.apache.hadoop.hbase.util.TestRootPath
> Tests run: 1, Failures: 0, Errors: 0, Skipped: 0, Time elapsed: 0.118 sec
> Running org.apache.hadoop.hbase.client.TestScannerTimeout
> Tests run: 2, Failures: 0, Errors: 0, Skipped: 0, Time elapsed: 65.218 sec
> Running org.apache.hadoop.hbase.mapred.TestTableMapReduce
> Tests run: 1, Failures: 0, Errors: 0, Skipped: 0, Time elapsed: 88.778 sec
> Running org.apache.hadoop.hbase.replication.regionserver.TestReplicationSourceManager
> Tests run: 1, Failures: 0, Errors: 0, Skipped: 0, Time elapsed: 2.479 sec
> Running org.apache.hadoop.hbase.util.TestBytes
> Tests run: 10, Failures: 0, Errors: 0, Skipped: 0, Time elapsed: 0.123 sec
> Running org.apache.hadoop.hbase.client.TestGetRowVersions
> Tests run: 1, Failures: 0, Errors: 0, Skipped: 0, Time elapsed: 51.418 sec
> Running org.apache.hadoop.hbase.filter.TestDependentColumnFilter
> Tests run: 2, Failures: 0, Errors: 0, Skipped: 0, Time elapsed: 0.79 sec
> Running org.apache.hadoop.hbase.rest.model.TestCellModel
> Tests run: 3, Failures: 0, Errors: 0, Skipped: 0, Time elapsed: 0.516 sec
> Running org.apache.hadoop.hbase.replication.TestReplicationSource
> Tests run: 1, Failures: 0, Errors: 0, Skipped: 0, Time elapsed: 26.864 sec
> Running org.apache.hadoop.hbase.rest.TestRowResource
> Tests run: 1, Failures: 0, Errors: 0, Skipped: 0, Time elapsed: 77.166 sec
> Running org.apache.hadoop.hbase.io.hfile.TestHFile
> Tests run: 7, Failures: 0, Errors: 0, Skipped: 0, Time elapsed: 0.952 sec
> Running org.apache.hadoop.hbase.regionserver.wal.TestLogActionsListener
> Tests run: 1, Failures: 0, Errors: 0, Skipped: 0, Time elapsed: 0.918 sec
> Running org.apache.hadoop.hbase.mapreduce.TestImportTsv
> Tests run: 1, Failures: 0, Errors: 0, Skipped: 0, Time elapsed: 0.2 sec
> Running org.apache.hadoop.hbase.rest.client.TestRemoteAdmin
> Tests run: 2, Failures: 0, Errors: 0, Skipped: 0, Time elapsed: 60.419 sec
> Running org.apache.hadoop.hbase.regionserver.wal.TestHLog
> Tests run: 6, Failures: 0, Errors: 0, Skipped: 0, Time elapsed: 104.92 sec
> Running org.apache.hadoop.hbase.client.TestTimestamp
> Tests run: 1, Failures: 0, Errors: 0, Skipped: 0, Time elapsed: 21.273 sec
> Running org.apache.hadoop.hbase.TestScanMultipleVersions
> Tests run: 1, Failures: 0, Errors: 0, Skipped: 0, Time elapsed: 15.189 sec
> Running org.apache.hadoop.hbase.rest.model.TestStorageClusterVersionModel
> Tests run: 2, Failures: 0, Errors: 0, Skipped: 0, Time elapsed: 0.338 sec
> Running org.apache.hadoop.hbase.client.TestHCM
> Tests run: 1, Failures: 0, Errors: 0, Skipped: 0, Time elapsed: 26.694 sec
>
> Results :
>
> Failed tests:
>
> Tests in error:
>
> Tests run: 478, Failures: 1, Errors: 2, Skipped: 6
>
> [INFO] ------------------------------------------------------------------------
> [ERROR] BUILD FAILURE
> [INFO] ------------------------------------------------------------------------
> [INFO] There are test failures.
>
> Please refer to <http://hudson.zones.apache.org/hudson/job/HBase-TRUNK/ws/trunk/target/surefire-reports>
for the individual test results.
> [INFO] ------------------------------------------------------------------------
> [INFO] For more information, run Maven with the -e switch
> [INFO] ------------------------------------------------------------------------
> [INFO] Total time: 90 minutes 58 seconds
> [INFO] Finished at: Thu Jul 08 04:43:33 UTC 2010
> [INFO] Final Memory: 38M/210M
> [INFO] ------------------------------------------------------------------------
> [locks-and-latches] Releasing all the locks
> [locks-and-latches] All the locks released
> Archiving artifacts
> Recording test results
>
>

Mime
View raw message