hbase-dev mailing list archives

Site index · List index
Message view « Date » · « Thread »
Top « Date » · « Thread »
From Apache Hudson Server <hud...@hudson.zones.apache.org>
Subject Build failed in Hudson: HBase-TRUNK #1385
Date Fri, 16 Jul 2010 02:05:52 GMT
See <http://hudson.zones.apache.org/hudson/job/HBase-TRUNK/1385/changes>

Changes:

[rawson] HBASE-2803  Remove remaining Get code from Store.java,etc

------------------------------------------
[...truncated 906 lines...]
Tests run: 4, Failures: 0, Errors: 0, Skipped: 0, Time elapsed: 0.903 sec
Running org.apache.hadoop.hbase.master.TestServerManager
Tests run: 1, Failures: 0, Errors: 0, Skipped: 0, Time elapsed: 0.135 sec
Running org.apache.hadoop.hbase.util.TestDefaultEnvironmentEdge
Tests run: 1, Failures: 0, Errors: 0, Skipped: 0, Time elapsed: 0.066 sec
Running org.apache.hadoop.hbase.master.TestMasterTransitions
Tests run: 3, Failures: 0, Errors: 0, Skipped: 0, Time elapsed: 86.752 sec
Running org.apache.hadoop.hbase.regionserver.TestScanWildcardColumnTracker
Tests run: 2, Failures: 0, Errors: 0, Skipped: 0, Time elapsed: 0.508 sec
Running org.apache.hadoop.hbase.regionserver.TestKeyValueSkipListSet
Tests run: 4, Failures: 0, Errors: 0, Skipped: 0, Time elapsed: 0.127 sec
Running org.apache.hadoop.hbase.io.hfile.TestSeekTo
Tests run: 3, Failures: 0, Errors: 0, Skipped: 0, Time elapsed: 0.576 sec
Running org.apache.hadoop.hbase.filter.TestPageFilter
Tests run: 2, Failures: 0, Errors: 0, Skipped: 0, Time elapsed: 0.041 sec
Running org.apache.hadoop.hbase.TestMergeMeta
Tests run: 1, Failures: 0, Errors: 0, Skipped: 0, Time elapsed: 74.045 sec
Running org.apache.hadoop.hbase.filter.TestColumnPaginationFilter
Tests run: 1, Failures: 0, Errors: 0, Skipped: 0, Time elapsed: 0.115 sec
Running org.apache.hadoop.hbase.rest.TestStatusResource
Tests run: 1, Failures: 0, Errors: 0, Skipped: 0, Time elapsed: 15.731 sec
Running org.apache.hadoop.hbase.client.TestFromClientSide
Tests run: 35, Failures: 0, Errors: 0, Skipped: 4, Time elapsed: 254.344 sec
Running org.apache.hadoop.hbase.replication.TestReplication
Tests run: 5, Failures: 0, Errors: 0, Skipped: 0, Time elapsed: 249.685 sec
Running org.apache.hadoop.hbase.regionserver.TestCompaction
Tests run: 2, Failures: 0, Errors: 0, Skipped: 0, Time elapsed: 81.849 sec
Running org.apache.hadoop.hbase.TestMultiParallelPut
Tests run: 2, Failures: 0, Errors: 0, Skipped: 0, Time elapsed: 96.09 sec
Running org.apache.hadoop.hbase.master.TestRegionManager
Tests run: 1, Failures: 0, Errors: 0, Skipped: 0, Time elapsed: 40.89 sec
Running org.apache.hadoop.hbase.filter.TestSingleColumnValueFilter
Tests run: 2, Failures: 0, Errors: 0, Skipped: 0, Time elapsed: 0.146 sec
Running org.apache.hadoop.hbase.mapreduce.TestTimeRangeMapRed
Tests run: 1, Failures: 0, Errors: 0, Skipped: 0, Time elapsed: 57.715 sec
Running org.apache.hadoop.hbase.mapreduce.TestSimpleTotalOrderPartitioner
Tests run: 1, Failures: 0, Errors: 0, Skipped: 0, Time elapsed: 0.418 sec
Running org.apache.hadoop.hbase.regionserver.TestGetDeleteTracker
Tests run: 7, Failures: 0, Errors: 0, Skipped: 0, Time elapsed: 0.618 sec
Running org.apache.hadoop.hbase.mapreduce.TestHFileOutputFormat
Tests run: 5, Failures: 0, Errors: 0, Skipped: 0, Time elapsed: 199.222 sec
Running org.apache.hadoop.hbase.regionserver.TestFSErrorsExposed
Tests run: 3, Failures: 0, Errors: 0, Skipped: 0, Time elapsed: 709.573 sec
Running org.apache.hadoop.hbase.regionserver.TestScanDeleteTracker
Tests run: 6, Failures: 0, Errors: 0, Skipped: 0, Time elapsed: 0.557 sec
Running org.apache.hadoop.hbase.client.TestMetaScanner
Tests run: 1, Failures: 0, Errors: 0, Skipped: 0, Time elapsed: 35.499 sec
Running org.apache.hadoop.hbase.metrics.TestMetricsMBeanBase
Tests run: 2, Failures: 0, Errors: 0, Skipped: 0, Time elapsed: 0.124 sec
Running org.apache.hadoop.hbase.TestRegionRebalancing
Tests run: 1, Failures: 0, Errors: 0, Skipped: 0, Time elapsed: 96.495 sec
Running org.apache.hadoop.hbase.master.TestROOTAssignment
Tests run: 1, Failures: 0, Errors: 0, Skipped: 0, Time elapsed: 34.915 sec
Running org.apache.hadoop.hbase.filter.TestSingleColumnValueExcludeFilter
Tests run: 1, Failures: 0, Errors: 0, Skipped: 0, Time elapsed: 0.115 sec
Running org.apache.hadoop.hbase.filter.TestInclusiveStopFilter
Tests run: 2, Failures: 0, Errors: 0, Skipped: 0, Time elapsed: 0.108 sec
Running org.apache.hadoop.hbase.rest.TestTableResource
Tests run: 1, Failures: 0, Errors: 0, Skipped: 0, Time elapsed: 47.16 sec
Running org.apache.hadoop.hbase.mapreduce.TestLoadIncrementalHFiles
Tests run: 3, Failures: 2, Errors: 0, Skipped: 0, Time elapsed: 63.317 sec <<< FAILURE!
Running org.apache.hadoop.hbase.rest.TestSchemaResource
Tests run: 1, Failures: 0, Errors: 0, Skipped: 0, Time elapsed: 34.839 sec
Running org.apache.hadoop.hbase.regionserver.wal.TestWALReplay
Tests run: 3, Failures: 0, Errors: 0, Skipped: 0, Time elapsed: 21.927 sec
Running org.apache.hadoop.hbase.regionserver.TestKeyValueScanFixture
Tests run: 1, Failures: 0, Errors: 0, Skipped: 0, Time elapsed: 0.114 sec
Running org.apache.hadoop.hbase.rest.model.TestTableListModel
Tests run: 3, Failures: 0, Errors: 0, Skipped: 0, Time elapsed: 0.481 sec
Running org.apache.hadoop.hbase.rest.model.TestColumnSchemaModel
Tests run: 2, Failures: 0, Errors: 0, Skipped: 0, Time elapsed: 0.306 sec
Running org.apache.hadoop.hbase.regionserver.TestWildcardColumnTracker
Tests run: 6, Failures: 0, Errors: 0, Skipped: 0, Time elapsed: 0.754 sec
Running org.apache.hadoop.hbase.regionserver.TestStoreFile
Tests run: 6, Failures: 0, Errors: 0, Skipped: 0, Time elapsed: 67.646 sec
Running org.apache.hadoop.hbase.master.TestZKBasedReopenRegion
Tests run: 1, Failures: 0, Errors: 0, Skipped: 0, Time elapsed: 56.182 sec
Running org.apache.hadoop.hbase.rest.model.TestScannerModel
Tests run: 3, Failures: 0, Errors: 0, Skipped: 0, Time elapsed: 0.503 sec
Running org.apache.hadoop.hbase.rest.TestVersionResource
Tests run: 1, Failures: 0, Errors: 0, Skipped: 0, Time elapsed: 15.833 sec
Running org.apache.hadoop.hbase.filter.TestFilter
Tests run: 15, Failures: 0, Errors: 0, Skipped: 0, Time elapsed: 3.251 sec
Running org.apache.hadoop.hbase.regionserver.TestWideScanner
Tests run: 1, Failures: 0, Errors: 0, Skipped: 0, Time elapsed: 29.27 sec
Running org.apache.hadoop.hbase.TestMergeTable
Tests run: 1, Failures: 0, Errors: 0, Skipped: 0, Time elapsed: 144.649 sec
Running org.apache.hadoop.hbase.replication.regionserver.TestReplicationSink
Tests run: 5, Failures: 0, Errors: 0, Skipped: 0, Time elapsed: 30.893 sec
Running org.apache.hadoop.hbase.regionserver.TestReadWriteConsistencyControl
Tests run: 1, Failures: 0, Errors: 0, Skipped: 0, Time elapsed: 10.043 sec
Running org.apache.hadoop.hbase.regionserver.TestGetClosestAtOrBefore
Tests run: 3, Failures: 0, Errors: 0, Skipped: 0, Time elapsed: 28.686 sec
Running org.apache.hadoop.hbase.rest.model.TestVersionModel
Tests run: 3, Failures: 0, Errors: 0, Skipped: 0, Time elapsed: 0.498 sec
Running org.apache.hadoop.hbase.rest.model.TestCellSetModel
Tests run: 3, Failures: 0, Errors: 0, Skipped: 0, Time elapsed: 0.511 sec
Running org.apache.hadoop.hbase.rest.client.TestRemoteTable
Tests run: 5, Failures: 0, Errors: 0, Skipped: 0, Time elapsed: 162.026 sec
Running org.apache.hadoop.hbase.rest.model.TestStorageClusterStatusModel
Tests run: 3, Failures: 0, Errors: 0, Skipped: 0, Time elapsed: 0.542 sec
Running org.apache.hadoop.hbase.avro.TestAvroServer
Tests run: 3, Failures: 0, Errors: 0, Skipped: 0, Time elapsed: 59.206 sec
Running org.apache.hadoop.hbase.TestFullLogReconstruction
Tests run: 1, Failures: 0, Errors: 0, Skipped: 0, Time elapsed: 112.626 sec
Running org.apache.hadoop.hbase.TestSerialization
Tests run: 18, Failures: 0, Errors: 0, Skipped: 0, Time elapsed: 0.925 sec
Running org.apache.hadoop.hbase.regionserver.TestKeyValueHeap
Tests run: 3, Failures: 0, Errors: 0, Skipped: 0, Time elapsed: 0.507 sec
Running org.apache.hadoop.hbase.regionserver.TestStoreScanner
Tests run: 14, Failures: 0, Errors: 0, Skipped: 0, Time elapsed: 0.136 sec
Running org.apache.hadoop.hbase.TestHMsg
Tests run: 2, Failures: 0, Errors: 0, Skipped: 0, Time elapsed: 0.142 sec
Running org.apache.hadoop.hbase.util.TestIncrementingEnvironmentEdge
Tests run: 1, Failures: 0, Errors: 0, Skipped: 0, Time elapsed: 0.065 sec
Running org.apache.hadoop.hbase.util.TestKeying
Tests run: 1, Failures: 0, Errors: 0, Skipped: 0, Time elapsed: 0.039 sec
Running org.apache.hadoop.hbase.regionserver.TestScanner
Tests run: 6, Failures: 0, Errors: 0, Skipped: 0, Time elapsed: 64.914 sec
Running org.apache.hadoop.hbase.regionserver.TestHRegionInfo
Tests run: 2, Failures: 0, Errors: 0, Skipped: 0, Time elapsed: 0.159 sec
Running org.apache.hadoop.hbase.master.TestRestartCluster
Tests run: 1, Failures: 0, Errors: 0, Skipped: 0, Time elapsed: 49.712 sec
Running org.apache.hadoop.hbase.client.TestShell
Tests run: 1, Failures: 0, Errors: 0, Skipped: 0, Time elapsed: 47.5 sec
Running org.apache.hadoop.hbase.rest.model.TestTableInfoModel
Tests run: 3, Failures: 0, Errors: 0, Skipped: 0, Time elapsed: 0.5 sec
Running org.apache.hadoop.hbase.regionserver.TestMinorCompactingStoreScanner
Tests run: 2, Failures: 0, Errors: 0, Skipped: 0, Time elapsed: 0.117 sec
Running org.apache.hadoop.hbase.TestInfoServers
Tests run: 1, Failures: 0, Errors: 0, Skipped: 0, Time elapsed: 13.116 sec
Running org.apache.hadoop.hbase.master.TestOldLogsCleaner
Tests run: 1, Failures: 0, Errors: 0, Skipped: 0, Time elapsed: 1.012 sec
Running org.apache.hadoop.hbase.regionserver.TestQueryMatcher
Tests run: 4, Failures: 0, Errors: 0, Skipped: 0, Time elapsed: 0.496 sec
Running org.apache.hadoop.hbase.client.TestAdmin
Tests run: 15, Failures: 0, Errors: 1, Skipped: 0, Time elapsed: 231.836 sec <<<
FAILURE!
Running org.apache.hadoop.hbase.TestMultiClusters
Tests run: 1, Failures: 0, Errors: 0, Skipped: 0, Time elapsed: 28.457 sec
Running org.apache.hadoop.hbase.util.TestMergeTool
Tests run: 1, Failures: 0, Errors: 0, Skipped: 0, Time elapsed: 38.441 sec
Running org.apache.hadoop.hbase.TestAcidGuarantees
Tests run: 3, Failures: 0, Errors: 1, Skipped: 2, Time elapsed: 60.103 sec <<< FAILURE!
Running org.apache.hadoop.hbase.TestEmptyMetaInfo
Tests run: 1, Failures: 0, Errors: 0, Skipped: 0, Time elapsed: 57.322 sec
Running org.apache.hadoop.hbase.master.TestKillingServersFromMaster
Tests run: 3, Failures: 0, Errors: 0, Skipped: 0, Time elapsed: 19.226 sec
Running org.apache.hadoop.hbase.util.TestBase64
Tests run: 1, Failures: 0, Errors: 0, Skipped: 0, Time elapsed: 0.106 sec
Running org.apache.hadoop.hbase.regionserver.TestMemStore
Tests run: 20, Failures: 0, Errors: 0, Skipped: 0, Time elapsed: 0.582 sec
Running org.apache.hadoop.hbase.master.TestMasterWithDisabling
Tests run: 1, Failures: 0, Errors: 0, Skipped: 0, Time elapsed: 22.221 sec
Running org.apache.hadoop.hbase.rest.TestScannerResource
Tests run: 1, Failures: 0, Errors: 0, Skipped: 0, Time elapsed: 48.756 sec
Running org.apache.hadoop.hbase.io.hfile.TestLruBlockCache
Tests run: 7, Failures: 0, Errors: 0, Skipped: 0, Time elapsed: 1.154 sec
Running org.apache.hadoop.hbase.regionserver.TestDeleteCompare
Tests run: 4, Failures: 0, Errors: 0, Skipped: 0, Time elapsed: 0.116 sec
Running org.apache.hadoop.hbase.master.TestRegionServerOperationQueue
Tests run: 1, Failures: 0, Errors: 0, Skipped: 0, Time elapsed: 10.186 sec
Running org.apache.hadoop.hbase.mapreduce.TestTableMapReduce
Tests run: 2, Failures: 0, Errors: 0, Skipped: 0, Time elapsed: 95.379 sec
Running org.apache.hadoop.hbase.TestKeyValue
Tests run: 8, Failures: 0, Errors: 0, Skipped: 0, Time elapsed: 0.125 sec
Running org.apache.hadoop.hbase.master.TestZKBasedCloseRegion
Tests run: 1, Failures: 0, Errors: 0, Skipped: 0, Time elapsed: 30.961 sec
Running org.apache.hadoop.hbase.master.TestMaster
Tests run: 1, Failures: 0, Errors: 0, Skipped: 0, Time elapsed: 44.81 sec
Running org.apache.hadoop.hbase.client.TestHTablePool
Tests run: 5, Failures: 0, Errors: 0, Skipped: 0, Time elapsed: 34.35 sec
Running org.apache.hadoop.hbase.master.TestMinimumServerCount
Tests run: 1, Failures: 0, Errors: 0, Skipped: 0, Time elapsed: 46.658 sec
Running org.apache.hadoop.hbase.rest.model.TestTableSchemaModel
Tests run: 3, Failures: 0, Errors: 0, Skipped: 0, Time elapsed: 0.556 sec
Running org.apache.hadoop.hbase.filter.TestFilterList
Tests run: 4, Failures: 0, Errors: 0, Skipped: 0, Time elapsed: 0.154 sec
Running org.apache.hadoop.hbase.mapreduce.TestTableInputFormatScan
Tests run: 11, Failures: 0, Errors: 0, Skipped: 0, Time elapsed: 351.758 sec
Running org.apache.hadoop.hbase.regionserver.TestHRegion
Tests run: 48, Failures: 0, Errors: 0, Skipped: 0, Time elapsed: 179.026 sec
Running org.apache.hadoop.hbase.rest.model.TestTableRegionModel
Tests run: 2, Failures: 0, Errors: 0, Skipped: 0, Time elapsed: 0.365 sec
Running org.apache.hadoop.hbase.client.TestTimestampsFilter
Tests run: 2, Failures: 0, Errors: 0, Skipped: 0, Time elapsed: 40.6 sec
Running org.apache.hadoop.hbase.util.TestRootPath
Tests run: 1, Failures: 0, Errors: 0, Skipped: 0, Time elapsed: 0.111 sec
Running org.apache.hadoop.hbase.client.TestScannerTimeout
Tests run: 2, Failures: 0, Errors: 0, Skipped: 0, Time elapsed: 27.714 sec
Running org.apache.hadoop.hbase.mapred.TestTableMapReduce
Tests run: 1, Failures: 0, Errors: 0, Skipped: 0, Time elapsed: 83.327 sec
Running org.apache.hadoop.hbase.replication.regionserver.TestReplicationSourceManager
Tests run: 1, Failures: 0, Errors: 0, Skipped: 0, Time elapsed: 2.235 sec
Running org.apache.hadoop.hbase.util.TestBytes
Tests run: 10, Failures: 0, Errors: 0, Skipped: 0, Time elapsed: 0.116 sec
Running org.apache.hadoop.hbase.client.TestGetRowVersions
Tests run: 1, Failures: 0, Errors: 0, Skipped: 0, Time elapsed: 57.591 sec
Running org.apache.hadoop.hbase.filter.TestDependentColumnFilter
Tests run: 2, Failures: 0, Errors: 0, Skipped: 0, Time elapsed: 0.704 sec
Running org.apache.hadoop.hbase.rest.model.TestCellModel
Tests run: 3, Failures: 0, Errors: 0, Skipped: 0, Time elapsed: 0.475 sec
Running org.apache.hadoop.hbase.replication.TestReplicationSource
Tests run: 1, Failures: 0, Errors: 0, Skipped: 0, Time elapsed: 23.841 sec
Running org.apache.hadoop.hbase.rest.TestRowResource
Tests run: 1, Failures: 0, Errors: 0, Skipped: 0, Time elapsed: 90.153 sec
Running org.apache.hadoop.hbase.io.hfile.TestHFile
Tests run: 7, Failures: 0, Errors: 0, Skipped: 0, Time elapsed: 0.874 sec
Running org.apache.hadoop.hbase.regionserver.wal.TestLogActionsListener
Tests run: 1, Failures: 0, Errors: 0, Skipped: 0, Time elapsed: 1.12 sec
Running org.apache.hadoop.hbase.mapreduce.TestImportTsv
Tests run: 1, Failures: 0, Errors: 0, Skipped: 0, Time elapsed: 0.16 sec
Running org.apache.hadoop.hbase.rest.client.TestRemoteAdmin
Tests run: 2, Failures: 0, Errors: 0, Skipped: 0, Time elapsed: 63.645 sec
Running org.apache.hadoop.hbase.regionserver.wal.TestHLog
Tests run: 6, Failures: 0, Errors: 0, Skipped: 0, Time elapsed: 116.385 sec
Running org.apache.hadoop.hbase.client.TestTimestamp
Tests run: 1, Failures: 0, Errors: 0, Skipped: 0, Time elapsed: 20.704 sec
Running org.apache.hadoop.hbase.TestScanMultipleVersions
Tests run: 1, Failures: 0, Errors: 0, Skipped: 0, Time elapsed: 25.613 sec
Running org.apache.hadoop.hbase.rest.model.TestStorageClusterVersionModel
Tests run: 2, Failures: 0, Errors: 0, Skipped: 0, Time elapsed: 0.348 sec
Running org.apache.hadoop.hbase.client.TestHCM
Tests run: 1, Failures: 0, Errors: 0, Skipped: 0, Time elapsed: 25.315 sec

Results :

Failed tests: 

Tests in error: 

Tests run: 488, Failures: 2, Errors: 2, Skipped: 6

[INFO] ------------------------------------------------------------------------
[ERROR] BUILD FAILURE
[INFO] ------------------------------------------------------------------------
[INFO] There are test failures.

Please refer to <http://hudson.zones.apache.org/hudson/job/HBase-TRUNK/ws/trunk/target/surefire-reports>
for the individual test results.
[INFO] ------------------------------------------------------------------------
[INFO] For more information, run Maven with the -e switch
[INFO] ------------------------------------------------------------------------
[INFO] Total time: 92 minutes 43 seconds
[INFO] Finished at: Fri Jul 16 02:06:01 UTC 2010
[INFO] Final Memory: 38M/187M
[INFO] ------------------------------------------------------------------------
[locks-and-latches] Releasing all the locks
[locks-and-latches] All the locks released
Archiving artifacts
Recording test results


Mime
View raw message