hbase-dev mailing list archives

Site index · List index
Message view « Date » · « Thread »
Top « Date » · « Thread »
From Apache Hudson Server <hud...@hudson.zones.apache.org>
Subject Build failed in Hudson: HBase-TRUNK #1294
Date Fri, 04 Jun 2010 19:03:16 GMT
See <http://hudson.zones.apache.org/hudson/job/HBase-TRUNK/1294/changes>

Changes:

[todd] HBASE-2661. Add test case for row atomicity guarantee

------------------------------------------
[...truncated 683 lines...]
A         src/docs/src/documentation/content/xdocs/index.xml
A         src/docs/src/documentation/content/xdocs/tabs.xml
A         src/docs/src/documentation/content/xdocs/bulk-loads.xml
A         src/docs/src/documentation/resources
A         src/docs/src/documentation/resources/images
AU        src/docs/src/documentation/resources/images/architecture.gif
AU        src/docs/src/documentation/resources/images/hadoop-logo.jpg
AU        src/docs/src/documentation/resources/images/hbase_logo_med.gif
AU        src/docs/src/documentation/resources/images/favicon.ico
AU        src/docs/src/documentation/resources/images/hbase_small.gif
A         src/docs/src/documentation/README.txt
A         src/docs/src/documentation/classes
A         src/docs/src/documentation/classes/CatalogManager.properties
AU        src/saveVersion.sh
A         src/examples
A         src/examples/thrift
A         src/examples/thrift/DemoClient.java
A         src/examples/thrift/DemoClient.cpp
A         src/examples/thrift/DemoClient.rb
A         src/examples/thrift/DemoClient.php
AU        src/examples/thrift/DemoClient.py
A         src/examples/thrift/README.txt
A         src/examples/thrift/Makefile
A         src/examples/mapreduce
A         src/examples/mapreduce/org
A         src/examples/mapreduce/org/apache
A         src/examples/mapreduce/org/apache/hadoop
A         src/examples/mapreduce/org/apache/hadoop/hbase
A         src/examples/mapreduce/org/apache/hadoop/hbase/mapreduce
A         src/examples/mapreduce/org/apache/hadoop/hbase/mapreduce/SampleUploader.java
A         src/examples/mapreduce/org/apache/hadoop/hbase/mapreduce/IndexBuilder.java
A         src/examples/mapreduce/index-builder-setup.rb
A         src/examples/README.txt
A         bin
AU        bin/hbase-daemons.sh
AU        bin/zookeepers.sh
A         bin/rename_table.rb
A         bin/add_table.rb
AU        bin/hbase
A         bin/copy_table.rb
A         bin/check_meta.rb
A         bin/hirb.rb
AU        bin/regionservers.sh
AU        bin/start-hbase.sh
A         bin/loadtable.rb
A         bin/set_meta_block_caching.rb
AU        bin/hbase-daemon.sh
A         bin/hbase-config.sh
AU        bin/stop-hbase.sh
A         docs
A         docs/index.pdf
A         docs/linkmap.pdf
A         docs/skin
A         docs/skin/getMenu.js
A         docs/skin/menu.js
A         docs/skin/prototype.js
A         docs/skin/translations
A         docs/skin/note.txt
A         docs/skin/print.css
A         docs/skin/scripts
A         docs/skin/CommonMessages_de.xml
A         docs/skin/profile.css
A         docs/skin/css
A         docs/skin/getBlank.js
A         docs/skin/breadcrumbs.js
A         docs/skin/images
AU        docs/skin/images/page.gif
AU        docs/skin/images/rc-t-l-5-1header-2tab-selected-3tab-selected.png
AU        docs/skin/images/label.gif
AU        docs/skin/images/rc-t-l-5-1header-2searchbox-3searchbox.png
AU        docs/skin/images/warning.png
AU        docs/skin/images/rc-t-r-5-1header-2tab-selected-3tab-selected.png
AU        docs/skin/images/rc-t-l-5-1header-2tab-unselected-3tab-unselected.png
AU        docs/skin/images/chapter.gif
AU        docs/skin/images/poddoc.png
AU        docs/skin/images/success.png
AU        docs/skin/images/rc-t-r-5-1header-2searchbox-3searchbox.png
AU        docs/skin/images/rc-t-r-5-1header-2tab-unselected-3tab-unselected.png
AU        docs/skin/images/update.jpg
AU        docs/skin/images/vcss.png
AU        docs/skin/images/pdfdoc.gif
AU        docs/skin/images/fix.jpg
AU        docs/skin/images/built-with-forrest-button.png
AU        docs/skin/images/add.jpg
AU        docs/skin/images/rc-b-l-15-1body-2menu-3menu.png
AU        docs/skin/images/valid-html401.png
AU        docs/skin/images/remove.jpg
AU        docs/skin/images/rc-b-r-15-1body-2menu-3menu.png
AU        docs/skin/images/external-link.gif
AU        docs/skin/images/spacer.gif
AU        docs/skin/images/hack.jpg
AU        docs/skin/images/current.gif
AU        docs/skin/images/printer.gif
AU        docs/skin/images/txtdoc.png
AU        docs/skin/images/xmldoc.gif
AU        docs/skin/images/rss.png
AU        docs/skin/images/rc-t-r-15-1body-2menu-3menu.png
AU        docs/skin/images/header_white_line.gif
AU        docs/skin/images/rc-b-r-5-1header-2tab-selected-3tab-selected.png
A         docs/skin/images/README.txt
AU        docs/skin/images/chapter_open.gif
AU        docs/skin/images/error.png
AU        docs/skin/images/forrest-credit-logo.png
AU        docs/skin/images/info.png
AU        docs/skin/images/instruction_arrow.png
A         docs/skin/CommonMessages_es.xml
A         docs/skin/CommonMessages_fr.xml
A         docs/skin/breadcrumbs-optimized.js
A         docs/skin/screen.css
A         docs/skin/basic.css
A         docs/skin/CommonMessages_en_US.xml
A         docs/skin/fontsize.js
A         docs/images
AU        docs/images/built-with-forrest-button.png
AU        docs/images/hadoop-logo.jpg
AU        docs/images/hbase_logo_med.gif
AU        docs/images/favicon.ico
AU        docs/images/hbase_small.gif
AU        docs/images/instruction_arrow.png
A         docs/metrics.html
A         docs/index.html
A         docs/broken-links.xml
A         docs/linkmap.html
A         docs/metrics.pdf
A         pom.xml
A         README.txt
 U        .
At revision 951516
[locks-and-latches] Checking to see if we really have the locks
[locks-and-latches] Have all the locks, build can start
[trunk] $ /home/hudson/tools/maven/apache-maven-2.2.1/bin/mvn clean -Dmaven.test.redirectTestOutputToFile=true
install deploy javadoc:javadoc
[INFO] Scanning for projects...
[INFO] Searching repository for plugin with prefix: 'javadoc'.
[INFO] ------------------------------------------------------------------------
[INFO] Building HBase
[INFO]    task-segment: [clean, install, deploy, javadoc:javadoc]
[INFO] ------------------------------------------------------------------------
[INFO] [clean:clean {execution: default-clean}]
[INFO] [antrun:run {execution: JSPC}]
[INFO] Executing tasks
SLF4J: Failed to load class "org.slf4j.impl.StaticLoggerBinder".
SLF4J: See http://www.slf4j.org/codes.html#StaticLoggerBinder for further details.
2010-06-04 18:16:51.783:INFO::Logging to STDERR via org.mortbay.log.StdErrLog
[INFO] Executed tasks
[INFO] [antrun:run {execution: package-info}]
[INFO] Executing tasks
[INFO] Executed tasks
[INFO] [build-helper:add-source {execution: add-jspc-source}]
[INFO] Source directory: <http://hudson.zones.apache.org/hudson/job/HBase-TRUNK/ws/trunk/target/jspc>
added.
[INFO] [build-helper:add-source {execution: add-package-info}]
[INFO] Source directory: <http://hudson.zones.apache.org/hudson/job/HBase-TRUNK/ws/trunk/target/generated-sources>
added.
[INFO] [resources:resources {execution: default-resources}]
[INFO] Using 'UTF-8' encoding to copy filtered resources.
[INFO] Copying 20 resources
[INFO] skip non existing resourceDirectory <http://hudson.zones.apache.org/hudson/job/HBase-TRUNK/ws/trunk/src/main/hbase-webapps>
[INFO] [compiler:compile {execution: default-compile}]
[INFO] Compiling 347 source files to <http://hudson.zones.apache.org/hudson/job/HBase-TRUNK/ws/trunk/target/classes>
[INFO] [resources:testResources {execution: default-testResources}]
[INFO] Using 'UTF-8' encoding to copy filtered resources.
[INFO] Copying 4 resources
[INFO] [compiler:testCompile {execution: default-testCompile}]
[INFO] Compiling 142 source files to <http://hudson.zones.apache.org/hudson/job/HBase-TRUNK/ws/trunk/target/test-classes>
[INFO] [surefire:test {execution: default-test}]
[INFO] Surefire report directory: <http://hudson.zones.apache.org/hudson/job/HBase-TRUNK/ws/trunk/target/surefire-reports>

-------------------------------------------------------
 T E S T S
-------------------------------------------------------
Running org.apache.hadoop.hbase.TestZooKeeper
Tests run: 5, Failures: 0, Errors: 0, Skipped: 0, Time elapsed: 95.299 sec
Running org.apache.hadoop.hbase.regionserver.wal.TestLogRolling
Tests run: 2, Failures: 0, Errors: 0, Skipped: 0, Time elapsed: 126.004 sec
Running org.apache.hadoop.hbase.io.hfile.TestCachedBlockQueue
Tests run: 2, Failures: 0, Errors: 0, Skipped: 0, Time elapsed: 0.106 sec
Running org.apache.hadoop.hbase.filter.TestPrefixFilter
Tests run: 3, Failures: 0, Errors: 0, Skipped: 0, Time elapsed: 0.109 sec
Running org.apache.hadoop.hbase.io.TestHeapSize
Tests run: 2, Failures: 0, Errors: 0, Skipped: 0, Time elapsed: 0.144 sec
Running org.apache.hadoop.hbase.io.TestImmutableBytesWritable
Tests run: 2, Failures: 0, Errors: 0, Skipped: 0, Time elapsed: 0.11 sec
Running org.apache.hadoop.hbase.rest.model.TestRowModel
Tests run: 2, Failures: 0, Errors: 0, Skipped: 0, Time elapsed: 0.386 sec
Running org.apache.hadoop.hbase.io.hfile.TestHFileSeek
Tests run: 1, Failures: 0, Errors: 0, Skipped: 0, Time elapsed: 5.165 sec
Running org.apache.hadoop.hbase.regionserver.TestStore
Tests run: 5, Failures: 0, Errors: 0, Skipped: 0, Time elapsed: 1.015 sec
Running org.apache.hadoop.hbase.zookeeper.TestHQuorumPeer
Tests run: 3, Failures: 0, Errors: 0, Skipped: 0, Time elapsed: 0.536 sec
Running org.apache.hadoop.hbase.rest.TestScannersWithFilters
Tests run: 1, Failures: 0, Errors: 0, Skipped: 0, Time elapsed: 24.697 sec
Running org.apache.hadoop.hbase.io.hfile.TestHFilePerformance
Tests run: 1, Failures: 0, Errors: 0, Skipped: 0, Time elapsed: 6.137 sec
Running org.apache.hadoop.hbase.io.TestHbaseObjectWritable
Tests run: 1, Failures: 0, Errors: 0, Skipped: 0, Time elapsed: 0.21 sec
Running org.apache.hadoop.hbase.master.TestMasterWrongRS
Tests run: 1, Failures: 0, Errors: 0, Skipped: 0, Time elapsed: 38.454 sec
Running org.apache.hadoop.hbase.regionserver.wal.TestHLogSplit
Tests run: 15, Failures: 0, Errors: 0, Skipped: 0, Time elapsed: 50.397 sec
Running org.apache.hadoop.hbase.thrift.TestThriftServer
Tests run: 1, Failures: 0, Errors: 0, Skipped: 0, Time elapsed: 84.299 sec
Running org.apache.hadoop.hbase.TestCompare
Tests run: 1, Failures: 0, Errors: 0, Skipped: 0, Time elapsed: 0.132 sec
Running org.apache.hadoop.hbase.regionserver.TestExplicitColumnTracker
Tests run: 4, Failures: 0, Errors: 0, Skipped: 0, Time elapsed: 0.888 sec
Running org.apache.hadoop.hbase.master.TestServerManager
Tests run: 1, Failures: 0, Errors: 0, Skipped: 0, Time elapsed: 0.134 sec
Running org.apache.hadoop.hbase.master.TestMasterTransitions
FATAL: command execution failed
hudson.util.IOException2: Failed to join the process
	at hudson.Proc$RemoteProc.join(Proc.java:312)
	at hudson.Launcher$ProcStarter.join(Launcher.java:275)
	at hudson.tasks.Maven.perform(Maven.java:253)
	at hudson.tasks.BuildStepMonitor$1.perform(BuildStepMonitor.java:19)
	at hudson.model.AbstractBuild$AbstractRunner.perform(AbstractBuild.java:582)
	at hudson.model.Build$RunnerImpl.build(Build.java:165)
	at hudson.model.Build$RunnerImpl.doRun(Build.java:132)
	at hudson.model.AbstractBuild$AbstractRunner.run(AbstractBuild.java:416)
	at hudson.model.Run.run(Run.java:1243)
	at hudson.model.FreeStyleBuild.run(FreeStyleBuild.java:46)
	at hudson.model.ResourceController.execute(ResourceController.java:88)
	at hudson.model.Executor.run(Executor.java:122)
Caused by: java.util.concurrent.ExecutionException: hudson.remoting.RequestAbortedException:
java.io.EOFException
	at hudson.remoting.Request$1.get(Request.java:218)
	at hudson.remoting.Request$1.get(Request.java:172)
	at hudson.remoting.FutureAdapter.get(FutureAdapter.java:55)
	at hudson.Proc$RemoteProc.join(Proc.java:304)
	... 11 more
Caused by: hudson.remoting.RequestAbortedException: java.io.EOFException
	at hudson.remoting.Request.abort(Request.java:257)
	at hudson.remoting.Channel.terminate(Channel.java:598)
	at hudson.remoting.Channel$ReaderThread.run(Channel.java:876)
Caused by: java.io.EOFException
	at java.io.ObjectInputStream$BlockDataInputStream.peekByte(ObjectInputStream.java:2554)
	at java.io.ObjectInputStream.readObject0(ObjectInputStream.java:1297)
	at java.io.ObjectInputStream.readObject(ObjectInputStream.java:351)
	at hudson.remoting.Channel$ReaderThread.run(Channel.java:856)
[locks-and-latches] Releasing all the locks
[locks-and-latches] All the locks released
FATAL: channel is already closed
hudson.remoting.ChannelClosedException: channel is already closed
	at hudson.remoting.Channel.send(Channel.java:412)
	at hudson.remoting.Request.call(Request.java:105)
	at hudson.remoting.Channel.call(Channel.java:551)
	at hudson.Launcher$RemoteLauncher.kill(Launcher.java:735)
	at hudson.model.AbstractBuild$AbstractRunner.run(AbstractBuild.java:421)
	at hudson.model.Run.run(Run.java:1243)
	at hudson.model.FreeStyleBuild.run(FreeStyleBuild.java:46)
	at hudson.model.ResourceController.execute(ResourceController.java:88)
	at hudson.model.Executor.run(Executor.java:122)


Mime
View raw message