hbase-dev mailing list archives

Site index · List index
Message view « Date » · « Thread »
Top « Date » · « Thread »
From Apache Hudson Server <hud...@hudson.zones.apache.org>
Subject Build failed in Hudson: HBase-TRUNK #1286
Date Thu, 03 Jun 2010 22:16:27 GMT
See <http://hudson.zones.apache.org/hudson/job/HBase-TRUNK/1286/changes>

Changes:

[todd] HBASE-2651. Allow alternate column separators to be specified for ImportTsv

------------------------------------------
Started by an SCM change
Building remotely on vesta.apache.org (Ubuntu)
Updating https://svn.apache.org/repos/asf/hbase/trunk
U         CHANGES.txt
U         src/test/java/org/apache/hadoop/hbase/mapreduce/TestImportTsv.java
U         src/main/java/org/apache/hadoop/hbase/mapreduce/ImportTsv.java
At revision 951140
[locks-and-latches] Checking to see if we really have the locks
[locks-and-latches] Have all the locks, build can start
[trunk] $ /home/hudson/tools/maven/apache-maven-2.2.1/bin/mvn clean install deploy javadoc:javadoc
[INFO] Scanning for projects...
[INFO] Searching repository for plugin with prefix: 'javadoc'.
[INFO] ------------------------------------------------------------------------
[INFO] Building HBase
[INFO]    task-segment: [clean, install, deploy, javadoc:javadoc]
[INFO] ------------------------------------------------------------------------
[INFO] [clean:clean {execution: default-clean}]
[INFO] Deleting <http://hudson.zones.apache.org/hudson/job/HBase-TRUNK/ws/trunk/target>
[INFO] Deleting <http://hudson.zones.apache.org/hudson/job/HBase-TRUNK/ws/trunk/build>
(includes = [], excludes = [])
[INFO] [antrun:run {execution: JSPC}]
[INFO] Executing tasks
SLF4J: Failed to load class "org.slf4j.impl.StaticLoggerBinder".
SLF4J: See http://www.slf4j.org/codes.html#StaticLoggerBinder for further details.
2010-06-03 20:16:28.915:INFO::Logging to STDERR via org.mortbay.log.StdErrLog
[INFO] Executed tasks
[INFO] [antrun:run {execution: package-info}]
[INFO] Executing tasks
[INFO] Executed tasks
[INFO] [build-helper:add-source {execution: add-jspc-source}]
[INFO] Source directory: <http://hudson.zones.apache.org/hudson/job/HBase-TRUNK/ws/trunk/target/jspc>
added.
[INFO] [build-helper:add-source {execution: add-package-info}]
[INFO] Source directory: <http://hudson.zones.apache.org/hudson/job/HBase-TRUNK/ws/trunk/target/generated-sources>
added.
[INFO] [resources:resources {execution: default-resources}]
[INFO] Using 'UTF-8' encoding to copy filtered resources.
[INFO] Copying 22 resources
[INFO] skip non existing resourceDirectory <http://hudson.zones.apache.org/hudson/job/HBase-TRUNK/ws/trunk/src/main/hbase-webapps>
[INFO] [compiler:compile {execution: default-compile}]
[INFO] Compiling 347 source files to <http://hudson.zones.apache.org/hudson/job/HBase-TRUNK/ws/trunk/target/classes>
[INFO] [resources:testResources {execution: default-testResources}]
[INFO] Using 'UTF-8' encoding to copy filtered resources.
[INFO] Copying 4 resources
[INFO] [compiler:testCompile {execution: default-testCompile}]
[INFO] Compiling 140 source files to <http://hudson.zones.apache.org/hudson/job/HBase-TRUNK/ws/trunk/target/test-classes>
[INFO] [surefire:test {execution: default-test}]
[INFO] Surefire report directory: <http://hudson.zones.apache.org/hudson/job/HBase-TRUNK/ws/trunk/target/surefire-reports>

-------------------------------------------------------
 T E S T S
-------------------------------------------------------
Running org.apache.hadoop.hbase.TestZooKeeper
Tests run: 5, Failures: 0, Errors: 0, Skipped: 0, Time elapsed: 113.305 sec
Running org.apache.hadoop.hbase.regionserver.wal.TestLogRolling
Tests run: 2, Failures: 0, Errors: 0, Skipped: 0, Time elapsed: 124.878 sec
Running org.apache.hadoop.hbase.io.hfile.TestCachedBlockQueue
Tests run: 2, Failures: 0, Errors: 0, Skipped: 0, Time elapsed: 0.106 sec
Running org.apache.hadoop.hbase.filter.TestPrefixFilter
Tests run: 3, Failures: 0, Errors: 0, Skipped: 0, Time elapsed: 0.109 sec
Running org.apache.hadoop.hbase.io.TestHeapSize
Tests run: 2, Failures: 0, Errors: 0, Skipped: 0, Time elapsed: 0.144 sec
Running org.apache.hadoop.hbase.io.TestImmutableBytesWritable
Tests run: 2, Failures: 0, Errors: 0, Skipped: 0, Time elapsed: 0.11 sec
Running org.apache.hadoop.hbase.rest.model.TestRowModel
Tests run: 2, Failures: 0, Errors: 0, Skipped: 0, Time elapsed: 0.385 sec
Running org.apache.hadoop.hbase.io.hfile.TestHFileSeek
Tests run: 1, Failures: 0, Errors: 0, Skipped: 0, Time elapsed: 5.098 sec
Running org.apache.hadoop.hbase.regionserver.TestStore
Tests run: 5, Failures: 0, Errors: 0, Skipped: 0, Time elapsed: 1.118 sec
Running org.apache.hadoop.hbase.zookeeper.TestHQuorumPeer
Tests run: 3, Failures: 0, Errors: 0, Skipped: 0, Time elapsed: 0.508 sec
Running org.apache.hadoop.hbase.rest.TestScannersWithFilters
Tests run: 1, Failures: 0, Errors: 0, Skipped: 0, Time elapsed: 48.864 sec
Running org.apache.hadoop.hbase.io.hfile.TestHFilePerformance
Tests run: 1, Failures: 0, Errors: 0, Skipped: 0, Time elapsed: 6.136 sec
Running org.apache.hadoop.hbase.io.TestHbaseObjectWritable
Tests run: 1, Failures: 0, Errors: 0, Skipped: 0, Time elapsed: 0.21 sec
Running org.apache.hadoop.hbase.master.TestMasterWrongRS
Tests run: 1, Failures: 0, Errors: 0, Skipped: 0, Time elapsed: 38.405 sec
Running org.apache.hadoop.hbase.regionserver.wal.TestHLogSplit
Tests run: 15, Failures: 0, Errors: 0, Skipped: 0, Time elapsed: 66.994 sec
Running org.apache.hadoop.hbase.thrift.TestThriftServer
Tests run: 1, Failures: 0, Errors: 0, Skipped: 0, Time elapsed: 82.567 sec
Running org.apache.hadoop.hbase.TestCompare
Tests run: 1, Failures: 0, Errors: 0, Skipped: 0, Time elapsed: 0.132 sec
Running org.apache.hadoop.hbase.regionserver.TestExplicitColumnTracker
Tests run: 4, Failures: 0, Errors: 0, Skipped: 0, Time elapsed: 0.866 sec
Running org.apache.hadoop.hbase.master.TestServerManager
Tests run: 1, Failures: 0, Errors: 0, Skipped: 0, Time elapsed: 0.134 sec
Running org.apache.hadoop.hbase.master.TestMasterTransitions
Tests run: 3, Failures: 0, Errors: 0, Skipped: 0, Time elapsed: 153.118 sec
Running org.apache.hadoop.hbase.regionserver.TestScanWildcardColumnTracker
Tests run: 2, Failures: 0, Errors: 0, Skipped: 0, Time elapsed: 0.455 sec
Running org.apache.hadoop.hbase.regionserver.TestKeyValueSkipListSet
Tests run: 4, Failures: 0, Errors: 0, Skipped: 0, Time elapsed: 0.118 sec
Running org.apache.hadoop.hbase.io.hfile.TestSeekTo
Tests run: 3, Failures: 0, Errors: 0, Skipped: 0, Time elapsed: 0.525 sec
Running org.apache.hadoop.hbase.filter.TestPageFilter
Tests run: 2, Failures: 0, Errors: 0, Skipped: 0, Time elapsed: 0.039 sec
Running org.apache.hadoop.hbase.TestMergeMeta
Tests run: 1, Failures: 0, Errors: 0, Skipped: 0, Time elapsed: 68.358 sec
Running org.apache.hadoop.hbase.filter.TestColumnPaginationFilter
Tests run: 1, Failures: 0, Errors: 0, Skipped: 0, Time elapsed: 0.113 sec
Running org.apache.hadoop.hbase.rest.TestStatusResource
Tests run: 1, Failures: 0, Errors: 0, Skipped: 0, Time elapsed: 15.073 sec
Running org.apache.hadoop.hbase.client.TestFromClientSide
Tests run: 33, Failures: 0, Errors: 0, Skipped: 4, Time elapsed: 255.562 sec
Running org.apache.hadoop.hbase.regionserver.TestCompaction
Tests run: 2, Failures: 0, Errors: 0, Skipped: 0, Time elapsed: 24.382 sec
Running org.apache.hadoop.hbase.TestMultiParallelPut
Tests run: 2, Failures: 0, Errors: 0, Skipped: 0, Time elapsed: 101.397 sec
Running org.apache.hadoop.hbase.master.TestRegionManager
Tests run: 1, Failures: 0, Errors: 0, Skipped: 0, Time elapsed: 13.884 sec
Running org.apache.hadoop.hbase.filter.TestSingleColumnValueFilter
Tests run: 2, Failures: 0, Errors: 0, Skipped: 0, Time elapsed: 0.145 sec
Running org.apache.hadoop.hbase.mapreduce.TestTimeRangeMapRed
Tests run: 1, Failures: 0, Errors: 0, Skipped: 0, Time elapsed: 68.91 sec
Running org.apache.hadoop.hbase.mapreduce.TestSimpleTotalOrderPartitioner
Tests run: 1, Failures: 0, Errors: 0, Skipped: 0, Time elapsed: 0.314 sec
Running org.apache.hadoop.hbase.regionserver.TestGetDeleteTracker
Tests run: 7, Failures: 0, Errors: 0, Skipped: 0, Time elapsed: 0.608 sec
Running org.apache.hadoop.hbase.mapreduce.TestHFileOutputFormat
Tests run: 4, Failures: 2, Errors: 0, Skipped: 0, Time elapsed: 977.003 sec <<< FAILURE!
Running org.apache.hadoop.hbase.regionserver.TestFSErrorsExposed
Tests run: 3, Failures: 0, Errors: 0, Skipped: 0, Time elapsed: 249.497 sec
Running org.apache.hadoop.hbase.regionserver.TestScanDeleteTracker
Tests run: 6, Failures: 0, Errors: 0, Skipped: 0, Time elapsed: 0.547 sec
Running org.apache.hadoop.hbase.metrics.TestMetricsMBeanBase
Tests run: 2, Failures: 0, Errors: 0, Skipped: 0, Time elapsed: 0.122 sec
Running org.apache.hadoop.hbase.TestRegionRebalancing
Tests run: 1, Failures: 0, Errors: 0, Skipped: 0, Time elapsed: 53.456 sec
Running org.apache.hadoop.hbase.filter.TestSingleColumnValueExcludeFilter
Tests run: 1, Failures: 0, Errors: 0, Skipped: 0, Time elapsed: 0.114 sec
Running org.apache.hadoop.hbase.filter.TestInclusiveStopFilter
Tests run: 2, Failures: 0, Errors: 0, Skipped: 0, Time elapsed: 0.107 sec
Running org.apache.hadoop.hbase.rest.TestTableResource
Tests run: 1, Failures: 0, Errors: 0, Skipped: 0, Time elapsed: 43.102 sec
Running org.apache.hadoop.hbase.mapreduce.TestLoadIncrementalHFiles
Tests run: 3, Failures: 0, Errors: 0, Skipped: 0, Time elapsed: 66.144 sec
Running org.apache.hadoop.hbase.rest.TestSchemaResource
Tests run: 1, Failures: 0, Errors: 0, Skipped: 0, Time elapsed: 37.227 sec
Running org.apache.hadoop.hbase.regionserver.TestKeyValueScanFixture
Tests run: 1, Failures: 0, Errors: 0, Skipped: 0, Time elapsed: 0.113 sec
Running org.apache.hadoop.hbase.rest.model.TestTableListModel
Tests run: 3, Failures: 0, Errors: 0, Skipped: 0, Time elapsed: 0.486 sec
Running org.apache.hadoop.hbase.rest.model.TestColumnSchemaModel
Tests run: 2, Failures: 0, Errors: 0, Skipped: 0, Time elapsed: 0.283 sec
Running org.apache.hadoop.hbase.regionserver.TestWildcardColumnTracker
Tests run: 6, Failures: 0, Errors: 0, Skipped: 0, Time elapsed: 0.811 sec
Running org.apache.hadoop.hbase.regionserver.TestStoreFile
Tests run: 5, Failures: 0, Errors: 0, Skipped: 0, Time elapsed: 53.247 sec
Running org.apache.hadoop.hbase.rest.model.TestScannerModel
Tests run: 3, Failures: 0, Errors: 0, Skipped: 0, Time elapsed: 0.539 sec
Running org.apache.hadoop.hbase.rest.TestVersionResource
Tests run: 1, Failures: 0, Errors: 0, Skipped: 0, Time elapsed: 16.051 sec
Running org.apache.hadoop.hbase.filter.TestFilter
Tests run: 15, Failures: 0, Errors: 0, Skipped: 0, Time elapsed: 2.966 sec
Running org.apache.hadoop.hbase.regionserver.TestWideScanner
Tests run: 1, Failures: 0, Errors: 0, Skipped: 0, Time elapsed: 11.874 sec
Running org.apache.hadoop.hbase.TestMergeTable
Tests run: 1, Failures: 0, Errors: 0, Skipped: 0, Time elapsed: 110.304 sec
Running org.apache.hadoop.hbase.regionserver.TestReadWriteConsistencyControl
Tests run: 1, Failures: 0, Errors: 0, Skipped: 0, Time elapsed: 10.25 sec
Running org.apache.hadoop.hbase.regionserver.TestGetClosestAtOrBefore
Tests run: 3, Failures: 0, Errors: 0, Skipped: 0, Time elapsed: 35.374 sec
Running org.apache.hadoop.hbase.rest.model.TestVersionModel
Tests run: 3, Failures: 0, Errors: 0, Skipped: 0, Time elapsed: 0.47 sec
Running org.apache.hadoop.hbase.rest.model.TestCellSetModel
Tests run: 3, Failures: 0, Errors: 0, Skipped: 0, Time elapsed: 0.506 sec
Running org.apache.hadoop.hbase.rest.client.TestRemoteTable
Tests run: 5, Failures: 0, Errors: 0, Skipped: 0, Time elapsed: 192.217 sec
Running org.apache.hadoop.hbase.rest.model.TestStorageClusterStatusModel
Tests run: 3, Failures: 0, Errors: 0, Skipped: 0, Time elapsed: 0.568 sec
Running org.apache.hadoop.hbase.TestFullLogReconstruction
Tests run: 1, Failures: 0, Errors: 0, Skipped: 0, Time elapsed: 205.514 sec
Running org.apache.hadoop.hbase.TestSerialization
Tests run: 18, Failures: 0, Errors: 0, Skipped: 0, Time elapsed: 0.923 sec
Running org.apache.hadoop.hbase.regionserver.TestKeyValueHeap
Tests run: 3, Failures: 0, Errors: 0, Skipped: 0, Time elapsed: 0.447 sec
Running org.apache.hadoop.hbase.regionserver.TestStoreScanner
Tests run: 13, Failures: 0, Errors: 0, Skipped: 0, Time elapsed: 0.134 sec
Running org.apache.hadoop.hbase.TestHMsg
Tests run: 2, Failures: 0, Errors: 0, Skipped: 0, Time elapsed: 0.14 sec
Running org.apache.hadoop.hbase.util.TestKeying
Tests run: 1, Failures: 0, Errors: 0, Skipped: 0, Time elapsed: 0.04 sec
Running org.apache.hadoop.hbase.regionserver.TestScanner
Tests run: 6, Failures: 0, Errors: 0, Skipped: 0, Time elapsed: 33.203 sec
Running org.apache.hadoop.hbase.regionserver.TestHRegionInfo
Tests run: 2, Failures: 0, Errors: 0, Skipped: 0, Time elapsed: 0.157 sec
Running org.apache.hadoop.hbase.client.TestShell
Tests run: 1, Failures: 0, Errors: 0, Skipped: 0, Time elapsed: 30.402 sec
Running org.apache.hadoop.hbase.rest.model.TestTableInfoModel
Tests run: 3, Failures: 0, Errors: 0, Skipped: 0, Time elapsed: 0.53 sec
Running org.apache.hadoop.hbase.regionserver.TestMinorCompactingStoreScanner
Tests run: 2, Failures: 0, Errors: 0, Skipped: 0, Time elapsed: 0.116 sec
Running org.apache.hadoop.hbase.TestInfoServers
Tests run: 1, Failures: 0, Errors: 0, Skipped: 0, Time elapsed: 11.937 sec
Running org.apache.hadoop.hbase.master.TestOldLogsCleaner
Tests run: 1, Failures: 0, Errors: 0, Skipped: 0, Time elapsed: 0.831 sec
Running org.apache.hadoop.hbase.regionserver.TestQueryMatcher
Tests run: 4, Failures: 0, Errors: 0, Skipped: 0, Time elapsed: 0.503 sec
Running org.apache.hadoop.hbase.client.TestAdmin
Tests run: 15, Failures: 0, Errors: 0, Skipped: 0, Time elapsed: 192.011 sec
Running org.apache.hadoop.hbase.util.TestMergeTool
Tests run: 1, Failures: 0, Errors: 0, Skipped: 0, Time elapsed: 13.265 sec
Running org.apache.hadoop.hbase.regionserver.TestStoreReconstruction
Tests run: 1, Failures: 0, Errors: 1, Skipped: 0, Time elapsed: 5.113 sec <<< FAILURE!
Running org.apache.hadoop.hbase.TestEmptyMetaInfo
Tests run: 1, Failures: 0, Errors: 0, Skipped: 0, Time elapsed: 76.635 sec
Running org.apache.hadoop.hbase.util.TestBase64
Tests run: 1, Failures: 0, Errors: 0, Skipped: 0, Time elapsed: 0.105 sec
Running org.apache.hadoop.hbase.regionserver.TestMemStore
Tests run: 20, Failures: 0, Errors: 0, Skipped: 0, Time elapsed: 0.738 sec
Running org.apache.hadoop.hbase.master.TestMasterWithDisabling
Tests run: 1, Failures: 0, Errors: 0, Skipped: 0, Time elapsed: 72.186 sec
Running org.apache.hadoop.hbase.rest.TestScannerResource
Tests run: 1, Failures: 0, Errors: 1, Skipped: 0, Time elapsed: 38.141 sec <<< FAILURE!
Running org.apache.hadoop.hbase.io.hfile.TestLruBlockCache
Tests run: 7, Failures: 0, Errors: 0, Skipped: 0, Time elapsed: 1.153 sec
Running org.apache.hadoop.hbase.regionserver.TestDeleteCompare
Tests run: 4, Failures: 0, Errors: 0, Skipped: 0, Time elapsed: 0.116 sec
Running org.apache.hadoop.hbase.master.TestRegionServerOperationQueue
Tests run: 1, Failures: 0, Errors: 0, Skipped: 0, Time elapsed: 0.183 sec
Running org.apache.hadoop.hbase.mapreduce.TestTableMapReduce
Tests run: 2, Failures: 0, Errors: 0, Skipped: 0, Time elapsed: 99.143 sec
Running org.apache.hadoop.hbase.TestKeyValue
Tests run: 8, Failures: 0, Errors: 0, Skipped: 0, Time elapsed: 0.124 sec
Running org.apache.hadoop.hbase.master.TestMaster
Tests run: 1, Failures: 0, Errors: 0, Skipped: 0, Time elapsed: 26.166 sec
Running org.apache.hadoop.hbase.client.TestHTablePool
Tests run: 5, Failures: 0, Errors: 0, Skipped: 0, Time elapsed: 35.117 sec
Running org.apache.hadoop.hbase.master.TestMinimumServerCount
Tests run: 1, Failures: 0, Errors: 0, Skipped: 0, Time elapsed: 64.187 sec
Running org.apache.hadoop.hbase.rest.model.TestTableSchemaModel
Tests run: 3, Failures: 0, Errors: 0, Skipped: 0, Time elapsed: 0.521 sec
Running org.apache.hadoop.hbase.filter.TestFilterList
Tests run: 4, Failures: 0, Errors: 0, Skipped: 0, Time elapsed: 0.152 sec
Running org.apache.hadoop.hbase.mapreduce.TestTableInputFormatScan
Build timed out. Aborting
[locks-and-latches] Releasing all the locks
[locks-and-latches] All the locks released
Destroying 1 processes
Destroying process..
Destroyed 1 processes
Publishing Javadoc
Recording test results


Mime
View raw message