hbase-dev mailing list archives

Site index · List index
Message view « Date » · « Thread »
Top « Date » · « Thread »
From Apache Hudson Server <hud...@hudson.zones.apache.org>
Subject Build failed in Hudson: HBase-TRUNK #1249
Date Wed, 19 May 2010 22:25:37 GMT
See <http://hudson.zones.apache.org/hudson/job/HBase-TRUNK/1249/changes>

Changes:

[stack] HBASE-1200 Add bloomfilters

[stack] HBASE-2573 client.HConnectionManager logs non-printable binary bytes

------------------------------------------
[...truncated 22 lines...]
U         core/src/main/java/org/apache/hadoop/hbase/HTableDescriptor.java
U         core/src/main/java/org/apache/hadoop/hbase/KeyValue.java
U         core/src/main/java/org/apache/hadoop/hbase/mapreduce/HFileOutputFormat.java
U         core/src/main/java/org/apache/hadoop/hbase/io/hfile/HFileScanner.java
U         core/src/main/java/org/apache/hadoop/hbase/io/hfile/HFile.java
U         core/src/main/java/org/apache/hadoop/hbase/util/JenkinsHash.java
U         core/src/main/java/org/apache/hadoop/hbase/util/Hash.java
U         core/src/main/java/org/apache/hadoop/hbase/util/MurmurHash.java
U         core/src/main/java/org/apache/hadoop/hbase/client/HConnectionManager.java
U         core/src/main/ruby/hbase/admin.rb
At revision 946464
[locks-and-latches] Checking to see if we really have the locks
[locks-and-latches] Have all the locks, build can start
[trunk] $ /home/hudson/tools/maven/apache-maven-2.2.1/bin/mvn clean deploy site
[INFO] Scanning for projects...
[INFO] Reactor build order: 
[INFO]   HBase
[INFO]   HBase Core
[INFO] ------------------------------------------------------------------------
[INFO] Building HBase
[INFO]    task-segment: [clean, deploy, site]
[INFO] ------------------------------------------------------------------------
[INFO] [clean:clean {execution: default-clean}]
[INFO] Deleting <http://hudson.zones.apache.org/hudson/job/HBase-TRUNK/ws/trunk/target>
[INFO] [site:attach-descriptor {execution: default-attach-descriptor}]
[INFO] [install:install {execution: default-install}]
[INFO] Installing <http://hudson.zones.apache.org/hudson/job/HBase-TRUNK/ws/trunk/pom.xml>
to /home/hudson/.m2/repository/org/apache/hbase/hbase/0.21.0-SNAPSHOT/hbase-0.21.0-SNAPSHOT.pom
[INFO] [deploy:deploy {execution: default-deploy}]
[INFO] Retrieving previous build number from apache.snapshots.https
Uploading: https://repository.apache.org/content/repositories/snapshots/org/apache/hbase/hbase/0.21.0-SNAPSHOT/hbase-0.21.0-20100519.222524-42.pom
4/16K
8/16K
12/16K
16/16K
16/16K
16K uploaded  (hbase-0.21.0-20100519.222524-42.pom)
[INFO] Retrieving previous metadata from apache.snapshots.https
[INFO] Uploading repository metadata for: 'snapshot org.apache.hbase:hbase:0.21.0-SNAPSHOT'
[INFO] Retrieving previous metadata from apache.snapshots.https
[INFO] Uploading repository metadata for: 'artifact org.apache.hbase:hbase'
[INFO] Setting property: classpath.resource.loader.class => 'org.codehaus.plexus.velocity.ContextClassLoaderResourceLoader'.
[INFO] Setting property: velocimacro.messages.on => 'false'.
[INFO] Setting property: resource.loader => 'classpath'.
[INFO] Setting property: resource.manager.logwhenfound => 'false'.
[INFO] ************************************************************** 
[INFO] Starting Jakarta Velocity v1.4
[INFO] RuntimeInstance initializing.
[INFO] Default Properties File: org/apache/velocity/runtime/defaults/velocity.properties
[INFO] Default ResourceManager initializing. (class org.apache.velocity.runtime.resource.ResourceManagerImpl)
[INFO] Resource Loader Instantiated: org.codehaus.plexus.velocity.ContextClassLoaderResourceLoader
[INFO] ClasspathResourceLoader : initialization starting.
[INFO] ClasspathResourceLoader : initialization complete.
[INFO] ResourceCache : initialized. (class org.apache.velocity.runtime.resource.ResourceCacheImpl)
[INFO] Default ResourceManager initialization complete.
[INFO] Loaded System Directive: org.apache.velocity.runtime.directive.Literal
[INFO] Loaded System Directive: org.apache.velocity.runtime.directive.Macro
[INFO] Loaded System Directive: org.apache.velocity.runtime.directive.Parse
[INFO] Loaded System Directive: org.apache.velocity.runtime.directive.Include
[INFO] Loaded System Directive: org.apache.velocity.runtime.directive.Foreach
[INFO] Created: 20 parsers.
[INFO] Velocimacro : initialization starting.
[INFO] Velocimacro : adding VMs from VM library template : VM_global_library.vm
[ERROR] ResourceManager : unable to find resource 'VM_global_library.vm' in any resource loader.
[INFO] Velocimacro : error using  VM library template VM_global_library.vm : org.apache.velocity.exception.ResourceNotFoundException:
Unable to find resource 'VM_global_library.vm'
[INFO] Velocimacro :  VM library template macro registration complete.
[INFO] Velocimacro : allowInline = true : VMs can be defined inline in templates
[INFO] Velocimacro : allowInlineToOverride = false : VMs defined inline may NOT replace previous
VM definitions
[INFO] Velocimacro : allowInlineLocal = false : VMs defined inline will be  global in scope
if allowed.
[INFO] Velocimacro : initialization complete.
[INFO] Velocity successfully started.
[INFO] Setting property: classpath.resource.loader.class => 'org.codehaus.plexus.velocity.ContextClassLoaderResourceLoader'.
[INFO] Setting property: velocimacro.messages.on => 'false'.
[INFO] Setting property: resource.loader => 'classpath'.
[INFO] Setting property: resource.manager.logwhenfound => 'false'.
[INFO] ************************************************************** 
[INFO] Starting Jakarta Velocity v1.4
[INFO] RuntimeInstance initializing.
[INFO] Default Properties File: org/apache/velocity/runtime/defaults/velocity.properties
[INFO] Default ResourceManager initializing. (class org.apache.velocity.runtime.resource.ResourceManagerImpl)
[INFO] Resource Loader Instantiated: org.codehaus.plexus.velocity.ContextClassLoaderResourceLoader
[INFO] ClasspathResourceLoader : initialization starting.
[INFO] ClasspathResourceLoader : initialization complete.
[INFO] ResourceCache : initialized. (class org.apache.velocity.runtime.resource.ResourceCacheImpl)
[INFO] Default ResourceManager initialization complete.
[INFO] Loaded System Directive: org.apache.velocity.runtime.directive.Literal
[INFO] Loaded System Directive: org.apache.velocity.runtime.directive.Macro
[INFO] Loaded System Directive: org.apache.velocity.runtime.directive.Parse
[INFO] Loaded System Directive: org.apache.velocity.runtime.directive.Include
[INFO] Loaded System Directive: org.apache.velocity.runtime.directive.Foreach
[INFO] Created: 20 parsers.
[INFO] Velocimacro : initialization starting.
[INFO] Velocimacro : adding VMs from VM library template : VM_global_library.vm
[ERROR] ResourceManager : unable to find resource 'VM_global_library.vm' in any resource loader.
[INFO] Velocimacro : error using  VM library template VM_global_library.vm : org.apache.velocity.exception.ResourceNotFoundException:
Unable to find resource 'VM_global_library.vm'
[INFO] Velocimacro :  VM library template macro registration complete.
[INFO] Velocimacro : allowInline = true : VMs can be defined inline in templates
[INFO] Velocimacro : allowInlineToOverride = false : VMs defined inline may NOT replace previous
VM definitions
[INFO] Velocimacro : allowInlineLocal = false : VMs defined inline will be  global in scope
if allowed.
[INFO] Velocimacro : initialization complete.
[INFO] Velocity successfully started.
[INFO] Setting property: classpath.resource.loader.class => 'org.codehaus.plexus.velocity.ContextClassLoaderResourceLoader'.
[INFO] Setting property: velocimacro.messages.on => 'false'.
[INFO] Setting property: resource.loader => 'classpath'.
[INFO] Setting property: resource.manager.logwhenfound => 'false'.
[INFO] Preparing javadoc:javadoc
[INFO] No goals needed for project - skipping
[INFO] Preparing javadoc:aggregate
[INFO] ------------------------------------------------------------------------
[INFO] Building HBase
[INFO] ------------------------------------------------------------------------
[INFO] No goals needed for project - skipping
[INFO] ------------------------------------------------------------------------
[INFO] Building HBase Core
[INFO] ------------------------------------------------------------------------
[INFO] [antrun:run {execution: JSPC}]
[INFO] Executing tasks
SLF4J: Failed to load class "org.slf4j.impl.StaticLoggerBinder".
SLF4J: See http://www.slf4j.org/codes.html#StaticLoggerBinder for further details.
2010-05-19 22:25:34.413::INFO:  Logging to STDERR via org.mortbay.log.StdErrLog
[INFO] Executed tasks
[INFO] [antrun:run {execution: package-info}]
[INFO] Executing tasks
[INFO] Executed tasks
[INFO] [build-helper:add-source {execution: add-jspc-source}]
[INFO] Source directory: <http://hudson.zones.apache.org/hudson/job/HBase-TRUNK/ws/trunk/core/target/jspc>
added.
[INFO] [build-helper:add-source {execution: add-package-info}]
[INFO] Source directory: <http://hudson.zones.apache.org/hudson/job/HBase-TRUNK/ws/trunk/core/target/generated-sources>
added.
[INFO] Preparing javadoc:test-javadoc
[INFO] No goals needed for project - skipping
[INFO] Preparing javadoc:test-aggregate
[INFO] ------------------------------------------------------------------------
[INFO] Building HBase
[INFO] ------------------------------------------------------------------------
[INFO] No goals needed for project - skipping
[INFO] ------------------------------------------------------------------------
[INFO] Building HBase Core
[INFO] ------------------------------------------------------------------------
[INFO] [antrun:run {execution: JSPC}]
[INFO] Executing tasks
SLF4J: Failed to load class "org.slf4j.impl.StaticLoggerBinder".
SLF4J: See http://www.slf4j.org/codes.html#StaticLoggerBinder for further details.
2010-05-19 22:25:34.810::INFO:  Logging to STDERR via org.mortbay.log.StdErrLog
[INFO] Executed tasks
[INFO] [antrun:run {execution: package-info}]
[INFO] Executing tasks
[INFO] Executed tasks
[INFO] [build-helper:add-source {execution: add-jspc-source}]
[INFO] Source directory: <http://hudson.zones.apache.org/hudson/job/HBase-TRUNK/ws/trunk/core/target/jspc>
added.
[INFO] [build-helper:add-source {execution: add-package-info}]
[INFO] Source directory: <http://hudson.zones.apache.org/hudson/job/HBase-TRUNK/ws/trunk/core/target/generated-sources>
added.
[INFO] [resources:resources {execution: default-resources}]
[INFO] Using 'UTF-8' encoding to copy filtered resources.
[INFO] Copying 29 resources
[INFO] skip non existing resourceDirectory <http://hudson.zones.apache.org/hudson/job/HBase-TRUNK/ws/trunk/core/src/main/webapps>
[INFO] [compiler:compile {execution: default-compile}]
[INFO] Compiling 23 source files to <http://hudson.zones.apache.org/hudson/job/HBase-TRUNK/ws/trunk/core/target/classes>
[INFO] -------------------------------------------------------------
[ERROR] COMPILATION ERROR : 
[INFO] -------------------------------------------------------------
[ERROR] <http://hudson.zones.apache.org/hudson/job/HBase-TRUNK/ws/trunk/core/src/main/java/org/apache/hadoop/hbase/regionserver/StoreFile.java>:[32,33]
cannot find symbol
symbol  : class HalfStoreFileReader
location: package org.apache.hadoop.hbase.io

[ERROR] <http://hudson.zones.apache.org/hudson/job/HBase-TRUNK/ws/trunk/core/src/main/java/org/apache/hadoop/hbase/regionserver/StoreFile.java>:[39,35]
cannot find symbol
symbol  : class BloomFilter
location: package org.apache.hadoop.hbase.util

[ERROR] <http://hudson.zones.apache.org/hudson/job/HBase-TRUNK/ws/trunk/core/src/main/java/org/apache/hadoop/hbase/regionserver/StoreFile.java>:[40,35]
cannot find symbol
symbol  : class ByteBloomFilter
location: package org.apache.hadoop.hbase.util

[ERROR] <http://hudson.zones.apache.org/hudson/job/HBase-TRUNK/ws/trunk/core/src/main/java/org/apache/hadoop/hbase/regionserver/StoreFile.java>:[543,14]
cannot find symbol
symbol  : class BloomFilter
location: class org.apache.hadoop.hbase.regionserver.StoreFile.Reader

[ERROR] <http://hudson.zones.apache.org/hudson/job/HBase-TRUNK/ws/trunk/core/src/main/java/org/apache/hadoop/hbase/regionserver/StoreFile.java>:[601,4]
cannot find symbol
symbol  : class BloomFilter
location: class org.apache.hadoop.hbase.regionserver.StoreFile.Reader

[ERROR] <http://hudson.zones.apache.org/hudson/job/HBase-TRUNK/ws/trunk/core/src/main/java/org/apache/hadoop/hbase/regionserver/StoreFile.java>:[675,18]
cannot find symbol
symbol  : class BloomFilter
location: class org.apache.hadoop.hbase.regionserver.StoreFile.Writer

[ERROR] <http://hudson.zones.apache.org/hudson/job/HBase-TRUNK/ws/trunk/core/src/main/java/org/apache/hadoop/hbase/regionserver/StoreFile.java>:[293,24]
cannot find symbol
symbol  : class HalfStoreFileReader
location: class org.apache.hadoop.hbase.regionserver.StoreFile

[ERROR] <http://hudson.zones.apache.org/hudson/job/HBase-TRUNK/ws/trunk/core/src/main/java/org/apache/hadoop/hbase/regionserver/StoreFile.java>:[588,33]
cannot find symbol
symbol  : class ByteBloomFilter
location: class org.apache.hadoop.hbase.regionserver.StoreFile.Reader

[ERROR] <http://hudson.zones.apache.org/hudson/job/HBase-TRUNK/ws/trunk/core/src/main/java/org/apache/hadoop/hbase/regionserver/StoreFile.java>:[705,31]
cannot find symbol
symbol  : class ByteBloomFilter
location: class org.apache.hadoop.hbase.regionserver.StoreFile.Writer

[INFO] 9 errors 
[INFO] -------------------------------------------------------------
[INFO] ------------------------------------------------------------------------
[ERROR] BUILD FAILURE
[INFO] ------------------------------------------------------------------------
[INFO] Compilation failure

<http://hudson.zones.apache.org/hudson/job/HBase-TRUNK/ws/trunk/core/src/main/java/org/apache/hadoop/hbase/regionserver/StoreFile.java>:[32,33]
cannot find symbol
symbol  : class HalfStoreFileReader
location: package org.apache.hadoop.hbase.io

<http://hudson.zones.apache.org/hudson/job/HBase-TRUNK/ws/trunk/core/src/main/java/org/apache/hadoop/hbase/regionserver/StoreFile.java>:[39,35]
cannot find symbol
symbol  : class BloomFilter
location: package org.apache.hadoop.hbase.util

<http://hudson.zones.apache.org/hudson/job/HBase-TRUNK/ws/trunk/core/src/main/java/org/apache/hadoop/hbase/regionserver/StoreFile.java>:[40,35]
cannot find symbol
symbol  : class ByteBloomFilter
location: package org.apache.hadoop.hbase.util

<http://hudson.zones.apache.org/hudson/job/HBase-TRUNK/ws/trunk/core/src/main/java/org/apache/hadoop/hbase/regionserver/StoreFile.java>:[543,14]
cannot find symbol
symbol  : class BloomFilter
location: class org.apache.hadoop.hbase.regionserver.StoreFile.Reader

<http://hudson.zones.apache.org/hudson/job/HBase-TRUNK/ws/trunk/core/src/main/java/org/apache/hadoop/hbase/regionserver/StoreFile.java>:[601,4]
cannot find symbol
symbol  : class BloomFilter
location: class org.apache.hadoop.hbase.regionserver.StoreFile.Reader

<http://hudson.zones.apache.org/hudson/job/HBase-TRUNK/ws/trunk/core/src/main/java/org/apache/hadoop/hbase/regionserver/StoreFile.java>:[675,18]
cannot find symbol
symbol  : class BloomFilter
location: class org.apache.hadoop.hbase.regionserver.StoreFile.Writer

<http://hudson.zones.apache.org/hudson/job/HBase-TRUNK/ws/trunk/core/src/main/java/org/apache/hadoop/hbase/regionserver/StoreFile.java>:[293,24]
cannot find symbol
symbol  : class HalfStoreFileReader
location: class org.apache.hadoop.hbase.regionserver.StoreFile

<http://hudson.zones.apache.org/hudson/job/HBase-TRUNK/ws/trunk/core/src/main/java/org/apache/hadoop/hbase/regionserver/StoreFile.java>:[588,33]
cannot find symbol
symbol  : class ByteBloomFilter
location: class org.apache.hadoop.hbase.regionserver.StoreFile.Reader

<http://hudson.zones.apache.org/hudson/job/HBase-TRUNK/ws/trunk/core/src/main/java/org/apache/hadoop/hbase/regionserver/StoreFile.java>:[705,31]
cannot find symbol
symbol  : class ByteBloomFilter
location: class org.apache.hadoop.hbase.regionserver.StoreFile.Writer


[INFO] ------------------------------------------------------------------------
[INFO] For more information, run Maven with the -e switch
[INFO] ------------------------------------------------------------------------
[INFO] Total time: 15 seconds
[INFO] Finished at: Wed May 19 22:25:36 UTC 2010
[INFO] Final Memory: 67M/111M
[INFO] ------------------------------------------------------------------------
[locks-and-latches] Releasing all the locks
[locks-and-latches] All the locks released
Recording test results


Mime
View raw message