hbase-dev mailing list archives

Site index · List index
Message view « Date » · « Thread »
Top « Date » · « Thread »
From Apache Hudson Server <hud...@hudson.zones.apache.org>
Subject Build failed in Hudson: hbase-020-branch #70
Date Sat, 01 May 2010 00:21:55 GMT
See <http://hudson.zones.apache.org/hudson/job/hbase-020-branch/70/changes>

Changes:

[stack] More fixing broke build, build broken by hbase-2414 commit

[jdcryans] Fixed 2497's CHANGES.txt

------------------------------------------
[...truncated 150 lines...]

compile:

check-contrib:

init:
     [echo] contrib: stargate

init-contrib:

compile-jar:

compile-war:

compile:
     [echo] contrib: stargate

clover.setup:

clover.info:
     [echo] 
     [echo]       Clover not found. Code coverage reports disabled.
     [echo]     

clover:

check-contrib:

init:
     [echo] contrib: transactional

init-contrib:

compile:
     [echo] contrib: transactional

compile:

compile-core-test:
    [javac] Compiling 119 source files to <http://hudson.zones.apache.org/hudson/job/hbase-020-branch/ws/trunk/build/test>
    [javac] Note: Some input files use or override a deprecated API.
    [javac] Note: Recompile with -Xlint:deprecation for details.
    [javac] Note: Some input files use unchecked or unsafe operations.
    [javac] Note: Recompile with -Xlint:unchecked for details.
      [jar] Building jar: <http://hudson.zones.apache.org/hudson/job/hbase-020-branch/ws/trunk/build/hbase-0.20.4-dev-test.jar>

test-core:
    [mkdir] Created dir: <http://hudson.zones.apache.org/hudson/job/hbase-020-branch/ws/trunk/build/test/logs>
    [junit] Running org.apache.hadoop.hbase.TestClassMigration
    [junit] Tests run: 1, Failures: 0, Errors: 0, Time elapsed: 0.138 sec
    [junit] Running org.apache.hadoop.hbase.TestCompare
    [junit] Tests run: 3, Failures: 0, Errors: 0, Time elapsed: 0.073 sec
    [junit] Running org.apache.hadoop.hbase.TestEmptyMetaInfo
    [junit] Tests run: 1, Failures: 0, Errors: 0, Time elapsed: 24.98 sec
    [junit] Running org.apache.hadoop.hbase.TestFullLogReconstruction
    [junit] Tests run: 1, Failures: 0, Errors: 0, Time elapsed: 207.197 sec
    [junit] Running org.apache.hadoop.hbase.TestHBaseCluster
    [junit] Tests run: 1, Failures: 0, Errors: 0, Time elapsed: 43.169 sec
    [junit] Running org.apache.hadoop.hbase.TestHMsg
    [junit] Tests run: 2, Failures: 0, Errors: 0, Time elapsed: 0.069 sec
    [junit] Running org.apache.hadoop.hbase.TestHStoreKey
    [junit] Tests run: 7, Failures: 0, Errors: 0, Time elapsed: 0.056 sec
    [junit] Running org.apache.hadoop.hbase.TestInfoServers
    [junit] Tests run: 1, Failures: 0, Errors: 0, Time elapsed: 48.061 sec
    [junit] Running org.apache.hadoop.hbase.TestKeyValue
    [junit] Tests run: 8, Failures: 0, Errors: 0, Time elapsed: 0.058 sec
    [junit] Running org.apache.hadoop.hbase.TestMasterAdmin
    [junit] Tests run: 1, Failures: 0, Errors: 0, Time elapsed: 39.78 sec
    [junit] Running org.apache.hadoop.hbase.TestMergeMeta
    [junit] Tests run: 1, Failures: 0, Errors: 0, Time elapsed: 69.27 sec
    [junit] Running org.apache.hadoop.hbase.TestMergeTable
    [junit] Tests run: 1, Failures: 0, Errors: 0, Time elapsed: 45.698 sec
    [junit] Running org.apache.hadoop.hbase.TestMultiParallelPut
    [junit] Tests run: 1, Failures: 1, Errors: 0, Time elapsed: 24.607 sec
    [junit] Test org.apache.hadoop.hbase.TestMultiParallelPut FAILED
    [junit] Running org.apache.hadoop.hbase.TestRegionRebalancing
    [junit] Tests run: 1, Failures: 0, Errors: 0, Time elapsed: 39.254 sec
    [junit] Running org.apache.hadoop.hbase.TestScanMultipleVersions
    [junit] Tests run: 1, Failures: 0, Errors: 0, Time elapsed: 15.067 sec
    [junit] Running org.apache.hadoop.hbase.TestSerialization
    [junit] Tests run: 20, Failures: 0, Errors: 0, Time elapsed: 0.336 sec
    [junit] Running org.apache.hadoop.hbase.TestTable
    [junit] Tests run: 4, Failures: 0, Errors: 0, Time elapsed: 151.966 sec
    [junit] Running org.apache.hadoop.hbase.TestZooKeeper
    [junit] Tests run: 6, Failures: 0, Errors: 0, Time elapsed: 476.18 sec
    [junit] Running org.apache.hadoop.hbase.client.TestBatchUpdate
    [junit] Tests run: 4, Failures: 0, Errors: 0, Time elapsed: 76.417 sec
    [junit] Running org.apache.hadoop.hbase.client.TestClient
    [junit] Tests run: 11, Failures: 0, Errors: 0, Time elapsed: 286.826 sec
    [junit] Running org.apache.hadoop.hbase.client.TestForceSplit
    [junit] Tests run: 1, Failures: 0, Errors: 0, Time elapsed: 40.247 sec
    [junit] Running org.apache.hadoop.hbase.client.TestGet
    [junit] Tests run: 2, Failures: 0, Errors: 0, Time elapsed: 45.624 sec
    [junit] Running org.apache.hadoop.hbase.client.TestGetRowVersions
    [junit] Tests run: 1, Failures: 0, Errors: 0, Time elapsed: 58.858 sec
    [junit] Running org.apache.hadoop.hbase.client.TestHBaseAdmin
    [junit] Tests run: 3, Failures: 0, Errors: 0, Time elapsed: 95.692 sec
    [junit] Running org.apache.hadoop.hbase.client.TestHTable
    [junit] Tests run: 6, Failures: 0, Errors: 0, Time elapsed: 137.442 sec
    [junit] Running org.apache.hadoop.hbase.client.TestHTablePool
    [junit] Tests run: 4, Failures: 0, Errors: 0, Time elapsed: 0.19 sec
    [junit] Running org.apache.hadoop.hbase.client.TestListTables
    [junit] Tests run: 1, Failures: 0, Errors: 0, Time elapsed: 30.294 sec
    [junit] Running org.apache.hadoop.hbase.client.TestOldAPIGetRowVersions
    [junit] Tests run: 1, Failures: 0, Errors: 0, Time elapsed: 57.505 sec
    [junit] Running org.apache.hadoop.hbase.client.TestOldAPIHTable
    [junit] Tests run: 5, Failures: 0, Errors: 0, Time elapsed: 100.578 sec
    [junit] Running org.apache.hadoop.hbase.client.TestOldAPITimestamp
    [junit] Tests run: 1, Failures: 0, Errors: 0, Time elapsed: 33.003 sec
    [junit] Running org.apache.hadoop.hbase.client.TestPut
    [junit] Tests run: 5, Failures: 0, Errors: 0, Time elapsed: 131.889 sec
    [junit] Running org.apache.hadoop.hbase.client.TestScannerTimeout
    [junit] Tests run: 1, Failures: 0, Errors: 0, Time elapsed: 46.749 sec
    [junit] Running org.apache.hadoop.hbase.client.TestScannerTimes
    [junit] Tests run: 1, Failures: 0, Errors: 0, Time elapsed: 53.071 sec
    [junit] Running org.apache.hadoop.hbase.client.TestTimestamp
    [junit] Tests run: 1, Failures: 0, Errors: 0, Time elapsed: 18.43 sec
    [junit] Running org.apache.hadoop.hbase.filter.TestColumnPaginationFilter
    [junit] Tests run: 1, Failures: 0, Errors: 0, Time elapsed: 0.1 sec
    [junit] Running org.apache.hadoop.hbase.filter.TestFilter
    [junit] Tests run: 15, Failures: 0, Errors: 0, Time elapsed: 2.243 sec
    [junit] Running org.apache.hadoop.hbase.filter.TestFilterAcrossRegions
    [junit] Tests run: 1, Failures: 0, Errors: 0, Time elapsed: 0.57 sec
    [junit] Running org.apache.hadoop.hbase.filter.TestFilterList
    [junit] Tests run: 4, Failures: 0, Errors: 0, Time elapsed: 0.171 sec
    [junit] Running org.apache.hadoop.hbase.filter.TestInclusiveStopFilter
    [junit] Tests run: 2, Failures: 0, Errors: 0, Time elapsed: 0.045 sec
    [junit] Running org.apache.hadoop.hbase.filter.TestPageFilter
    [junit] Tests run: 2, Failures: 0, Errors: 0, Time elapsed: 0.043 sec
    [junit] Running org.apache.hadoop.hbase.filter.TestPrefixFilter
    [junit] Tests run: 3, Failures: 0, Errors: 0, Time elapsed: 0.047 sec
    [junit] Running org.apache.hadoop.hbase.filter.TestSingleColumnValueFilter
    [junit] Tests run: 2, Failures: 0, Errors: 0, Time elapsed: 0.138 sec
    [junit] Running org.apache.hadoop.hbase.io.TestHbaseObjectWritable
    [junit] Tests run: 1, Failures: 0, Errors: 0, Time elapsed: 0.182 sec
    [junit] Running org.apache.hadoop.hbase.io.TestHeapSize
    [junit] Tests run: 2, Failures: 0, Errors: 0, Time elapsed: 0.077 sec
    [junit] Running org.apache.hadoop.hbase.io.TestImmutableBytesWritable
    [junit] Tests run: 1, Failures: 0, Errors: 0, Time elapsed: 0.047 sec
    [junit] Running org.apache.hadoop.hbase.io.hfile.TestCachedBlockQueue
    [junit] Tests run: 2, Failures: 0, Errors: 0, Time elapsed: 0.095 sec
    [junit] Running org.apache.hadoop.hbase.io.hfile.TestHFile
    [junit] Tests run: 7, Failures: 0, Errors: 0, Time elapsed: 0.439 sec
    [junit] Running org.apache.hadoop.hbase.io.hfile.TestHFilePerformance
    [junit] Tests run: 1, Failures: 0, Errors: 0, Time elapsed: 8.506 sec
    [junit] Running org.apache.hadoop.hbase.io.hfile.TestHFileSeek
    [junit] Tests run: 1, Failures: 0, Errors: 0, Time elapsed: 5.26 sec
    [junit] Running org.apache.hadoop.hbase.io.hfile.TestLruBlockCache
    [junit] Tests run: 7, Failures: 0, Errors: 0, Time elapsed: 1.137 sec
    [junit] Running org.apache.hadoop.hbase.io.hfile.TestSeekTo
    [junit] Tests run: 3, Failures: 0, Errors: 0, Time elapsed: 0.271 sec
    [junit] Running org.apache.hadoop.hbase.mapred.TestTableIndex
    [junit] Tests run: 1, Failures: 0, Errors: 0, Time elapsed: 65.485 sec
    [junit] Running org.apache.hadoop.hbase.mapred.TestTableMapReduce
    [junit] Tests run: 1, Failures: 0, Errors: 0, Time elapsed: 77.897 sec
    [junit] Running org.apache.hadoop.hbase.mapreduce.TestHFileOutputFormat
    [junit] Tests run: 1, Failures: 0, Errors: 0, Time elapsed: 5.359 sec
    [junit] Running org.apache.hadoop.hbase.mapreduce.TestTableIndex
    [junit] Tests run: 1, Failures: 0, Errors: 0, Time elapsed: 54.507 sec
    [junit] Running org.apache.hadoop.hbase.mapreduce.TestTableMapReduce
    [junit] Tests run: 1, Failures: 0, Errors: 0, Time elapsed: 53.549 sec
    [junit] Running org.apache.hadoop.hbase.mapreduce.TestTimeRangeMapRed
    [junit] Tests run: 1, Failures: 0, Errors: 0, Time elapsed: 34.253 sec
    [junit] Running org.apache.hadoop.hbase.master.TestMasterTransistions
    [junit] Tests run: 1, Failures: 0, Errors: 1, Time elapsed: 57.929 sec
    [junit] Test org.apache.hadoop.hbase.master.TestMasterTransistions FAILED
    [junit] Running org.apache.hadoop.hbase.master.TestMinimumServerCount
    [junit] Tests run: 1, Failures: 0, Errors: 0, Time elapsed: 71.892 sec
    [junit] Running org.apache.hadoop.hbase.master.TestRegionManager
    [junit] Tests run: 1, Failures: 0, Errors: 0, Time elapsed: 58.72 sec
    [junit] Running org.apache.hadoop.hbase.master.TestRegionServerOperationQueue
    [junit] Tests run: 1, Failures: 0, Errors: 1, Time elapsed: 0.044 sec
    [junit] Test org.apache.hadoop.hbase.master.TestRegionServerOperationQueue FAILED
    [junit] Running org.apache.hadoop.hbase.metrics.TestMetricsMBeanBase
    [junit] Tests run: 2, Failures: 0, Errors: 0, Time elapsed: 0.123 sec
    [junit] Running org.apache.hadoop.hbase.regionserver.TestCompaction
    [junit] Tests run: 2, Failures: 0, Errors: 0, Time elapsed: 26.647 sec
    [junit] Running org.apache.hadoop.hbase.regionserver.TestDeleteCompare
    [junit] Tests run: 4, Failures: 0, Errors: 0, Time elapsed: 0.116 sec
    [junit] Running org.apache.hadoop.hbase.regionserver.TestExplicitColumnTracker
    [junit] Tests run: 3, Failures: 0, Errors: 0, Time elapsed: 0.661 sec
    [junit] Running org.apache.hadoop.hbase.regionserver.TestGetClosestAtOrBefore
    [junit] Tests run: 3, Failures: 0, Errors: 0, Time elapsed: 39.35 sec
    [junit] Running org.apache.hadoop.hbase.regionserver.TestGetDeleteTracker
    [junit] Tests run: 7, Failures: 0, Errors: 0, Time elapsed: 0.042 sec
    [junit] Running org.apache.hadoop.hbase.regionserver.TestHLog
    [junit] Tests run: 3, Failures: 0, Errors: 0, Time elapsed: 14.134 sec
    [junit] Running org.apache.hadoop.hbase.regionserver.TestHRegion
    [junit] Tests run: 43, Failures: 0, Errors: 0, Time elapsed: 119.285 sec
    [junit] Running org.apache.hadoop.hbase.regionserver.TestHRegionInfo
    [junit] Tests run: 1, Failures: 0, Errors: 0, Time elapsed: 0.161 sec
    [junit] Running org.apache.hadoop.hbase.regionserver.TestKeyValueHeap
    [junit] Tests run: 3, Failures: 0, Errors: 0, Time elapsed: 0.03 sec
    [junit] Running org.apache.hadoop.hbase.regionserver.TestKeyValueScanFixture
    [junit] Tests run: 1, Failures: 0, Errors: 0, Time elapsed: 0.112 sec
    [junit] Running org.apache.hadoop.hbase.regionserver.TestKeyValueSkipListSet
    [junit] Tests run: 4, Failures: 0, Errors: 0, Time elapsed: 0.043 sec
    [junit] Running org.apache.hadoop.hbase.regionserver.TestLogRolling
    [junit] Tests run: 2, Failures: 0, Errors: 0, Time elapsed: 127.023 sec
    [junit] Running org.apache.hadoop.hbase.regionserver.TestLruHashMap
    [junit] Tests run: 9, Failures: 0, Errors: 0, Time elapsed: 1.603 sec
    [junit] Running org.apache.hadoop.hbase.regionserver.TestMemStore
    [junit] Tests run: 20, Failures: 0, Errors: 0, Time elapsed: 0.544 sec
    [junit] Running org.apache.hadoop.hbase.regionserver.TestMinorCompactingStoreScanner
    [junit] Tests run: 2, Failures: 0, Errors: 0, Time elapsed: 0.111 sec
    [junit] Running org.apache.hadoop.hbase.regionserver.TestQueryMatcher
    [junit] Tests run: 4, Failures: 0, Errors: 0, Time elapsed: 0.033 sec
    [junit] Running org.apache.hadoop.hbase.regionserver.TestReadWriteConsistencyControl
    [junit] Tests run: 1, Failures: 0, Errors: 0, Time elapsed: 10.098 sec
    [junit] Running org.apache.hadoop.hbase.regionserver.TestScanDeleteTracker
    [junit] Tests run: 6, Failures: 0, Errors: 0, Time elapsed: 0.023 sec
    [junit] Running org.apache.hadoop.hbase.regionserver.TestScanWildcardColumnTracker
    [junit] Tests run: 2, Failures: 0, Errors: 0, Time elapsed: 0.163 sec
    [junit] Running org.apache.hadoop.hbase.regionserver.TestScanner
    [junit] Tests run: 6, Failures: 0, Errors: 0, Time elapsed: 32.111 sec
    [junit] Running org.apache.hadoop.hbase.regionserver.TestStore
    [junit] Tests run: 5, Failures: 0, Errors: 0, Time elapsed: 0.836 sec
    [junit] Running org.apache.hadoop.hbase.regionserver.TestStoreFile
    [junit] Tests run: 2, Failures: 0, Errors: 0, Time elapsed: 40.333 sec
    [junit] Running org.apache.hadoop.hbase.regionserver.TestStoreScanner
    [junit] Tests run: 13, Failures: 0, Errors: 0, Time elapsed: 0.124 sec
    [junit] Running org.apache.hadoop.hbase.regionserver.TestWideScanner
    [junit] Tests run: 1, Failures: 0, Errors: 0, Time elapsed: 47.747 sec
    [junit] Running org.apache.hadoop.hbase.regionserver.TestWildcardColumnTracker
    [junit] Tests run: 6, Failures: 0, Errors: 0, Time elapsed: 0.387 sec
    [junit] Running org.apache.hadoop.hbase.thrift.TestThriftServer
    [junit] Tests run: 1, Failures: 0, Errors: 0, Time elapsed: 107.446 sec
    [junit] Running org.apache.hadoop.hbase.util.TestBase64
    [junit] Tests run: 1, Failures: 0, Errors: 0, Time elapsed: 0.113 sec
    [junit] Running org.apache.hadoop.hbase.util.TestBytes
    [junit] Tests run: 11, Failures: 0, Errors: 0, Time elapsed: 0.086 sec
    [junit] Running org.apache.hadoop.hbase.util.TestKeying
    [junit] Tests run: 1, Failures: 0, Errors: 0, Time elapsed: 0.052 sec
    [junit] Running org.apache.hadoop.hbase.util.TestMergeTool
    [junit] Tests run: 1, Failures: 0, Errors: 0, Time elapsed: 12.466 sec
    [junit] Running org.apache.hadoop.hbase.util.TestPair
    [junit] Tests run: 9, Failures: 0, Errors: 0, Time elapsed: 0.296 sec
    [junit] Running org.apache.hadoop.hbase.util.TestRootPath
    [junit] Tests run: 1, Failures: 0, Errors: 0, Time elapsed: 0.046 sec
    [junit] Running org.apache.hadoop.hbase.zookeeper.TestHQuorumPeer
    [junit] Tests run: 2, Failures: 0, Errors: 0, Time elapsed: 0.309 sec

BUILD FAILED
<http://hudson.zones.apache.org/hudson/job/hbase-020-branch/ws/trunk/build.xml>:516:
Tests failed!

Total time: 58 minutes 59 seconds
[locks-and-latches] Releasing all the locks
[locks-and-latches] All the locks released
Recording test results


Mime
View raw message