hbase-dev mailing list archives

Site index · List index
Message view « Date » · « Thread »
Top « Date » · « Thread »
From Apache Hudson Server <hud...@hudson.zones.apache.org>
Subject Build failed in Hudson: hbase-020-branch #75
Date Tue, 04 May 2010 23:06:31 GMT
See <http://hudson.zones.apache.org/hudson/job/hbase-020-branch/75/changes>

Changes:

[stack] HBASE-2509 NPEs in various places, HRegion.get, HRS.close

------------------------------------------
[...truncated 242 lines...]
    [junit] Tests run: 3, Failures: 0, Errors: 0, Time elapsed: 97.533 sec
    [junit] Running org.apache.hadoop.hbase.client.TestHTable
    [junit] Tests run: 6, Failures: 0, Errors: 0, Time elapsed: 111.224 sec
    [junit] Running org.apache.hadoop.hbase.client.TestHTablePool
    [junit] Tests run: 4, Failures: 0, Errors: 0, Time elapsed: 0.193 sec
    [junit] Running org.apache.hadoop.hbase.client.TestListTables
    [junit] Tests run: 1, Failures: 0, Errors: 0, Time elapsed: 34.373 sec
    [junit] Running org.apache.hadoop.hbase.client.TestOldAPIGetRowVersions
    [junit] Tests run: 1, Failures: 0, Errors: 0, Time elapsed: 23.441 sec
    [junit] Running org.apache.hadoop.hbase.client.TestOldAPIHTable
    [junit] Tests run: 5, Failures: 0, Errors: 0, Time elapsed: 99.03 sec
    [junit] Running org.apache.hadoop.hbase.client.TestOldAPITimestamp
    [junit] Tests run: 1, Failures: 0, Errors: 0, Time elapsed: 20.388 sec
    [junit] Running org.apache.hadoop.hbase.client.TestPut
    [junit] Tests run: 5, Failures: 0, Errors: 0, Time elapsed: 94.325 sec
    [junit] Running org.apache.hadoop.hbase.client.TestScannerTimeout
    [junit] Tests run: 1, Failures: 0, Errors: 0, Time elapsed: 19.837 sec
    [junit] Running org.apache.hadoop.hbase.client.TestScannerTimes
    [junit] Tests run: 1, Failures: 0, Errors: 0, Time elapsed: 23.461 sec
    [junit] Running org.apache.hadoop.hbase.client.TestTimestamp
    [junit] Tests run: 1, Failures: 0, Errors: 0, Time elapsed: 20.296 sec
    [junit] Running org.apache.hadoop.hbase.filter.TestColumnPaginationFilter
    [junit] Tests run: 1, Failures: 0, Errors: 0, Time elapsed: 0.1 sec
    [junit] Running org.apache.hadoop.hbase.filter.TestFilter
    [junit] Tests run: 15, Failures: 0, Errors: 0, Time elapsed: 2.224 sec
    [junit] Running org.apache.hadoop.hbase.filter.TestFilterAcrossRegions
    [junit] Tests run: 1, Failures: 0, Errors: 0, Time elapsed: 0.492 sec
    [junit] Running org.apache.hadoop.hbase.filter.TestFilterList
    [junit] Tests run: 4, Failures: 0, Errors: 0, Time elapsed: 0.171 sec
    [junit] Running org.apache.hadoop.hbase.filter.TestInclusiveStopFilter
    [junit] Tests run: 2, Failures: 0, Errors: 0, Time elapsed: 0.044 sec
    [junit] Running org.apache.hadoop.hbase.filter.TestPageFilter
    [junit] Tests run: 2, Failures: 0, Errors: 0, Time elapsed: 0.043 sec
    [junit] Running org.apache.hadoop.hbase.filter.TestPrefixFilter
    [junit] Tests run: 3, Failures: 0, Errors: 0, Time elapsed: 0.047 sec
    [junit] Running org.apache.hadoop.hbase.filter.TestSingleColumnValueFilter
    [junit] Tests run: 2, Failures: 0, Errors: 0, Time elapsed: 0.136 sec
    [junit] Running org.apache.hadoop.hbase.io.TestHbaseObjectWritable
    [junit] Tests run: 1, Failures: 0, Errors: 0, Time elapsed: 0.178 sec
    [junit] Running org.apache.hadoop.hbase.io.TestHeapSize
    [junit] Tests run: 2, Failures: 0, Errors: 0, Time elapsed: 0.079 sec
    [junit] Running org.apache.hadoop.hbase.io.TestImmutableBytesWritable
    [junit] Tests run: 1, Failures: 0, Errors: 0, Time elapsed: 0.046 sec
    [junit] Running org.apache.hadoop.hbase.io.hfile.TestCachedBlockQueue
    [junit] Tests run: 2, Failures: 0, Errors: 0, Time elapsed: 0.096 sec
    [junit] Running org.apache.hadoop.hbase.io.hfile.TestHFile
    [junit] Tests run: 7, Failures: 0, Errors: 0, Time elapsed: 0.433 sec
    [junit] Running org.apache.hadoop.hbase.io.hfile.TestHFilePerformance
    [junit] Tests run: 1, Failures: 0, Errors: 0, Time elapsed: 5.923 sec
    [junit] Running org.apache.hadoop.hbase.io.hfile.TestHFileSeek
    [junit] Tests run: 1, Failures: 0, Errors: 0, Time elapsed: 5.226 sec
    [junit] Running org.apache.hadoop.hbase.io.hfile.TestLruBlockCache
    [junit] Tests run: 7, Failures: 0, Errors: 0, Time elapsed: 1.137 sec
    [junit] Running org.apache.hadoop.hbase.io.hfile.TestSeekTo
    [junit] Tests run: 3, Failures: 0, Errors: 0, Time elapsed: 0.267 sec
    [junit] Running org.apache.hadoop.hbase.mapred.TestTableIndex
    [junit] Tests run: 1, Failures: 0, Errors: 0, Time elapsed: 51.859 sec
    [junit] Running org.apache.hadoop.hbase.mapred.TestTableMapReduce
    [junit] Tests run: 1, Failures: 0, Errors: 0, Time elapsed: 112.168 sec
    [junit] Running org.apache.hadoop.hbase.mapreduce.TestHFileOutputFormat
    [junit] Tests run: 1, Failures: 0, Errors: 0, Time elapsed: 5.666 sec
    [junit] Running org.apache.hadoop.hbase.mapreduce.TestTableIndex
    [junit] Tests run: 1, Failures: 0, Errors: 0, Time elapsed: 55.477 sec
    [junit] Running org.apache.hadoop.hbase.mapreduce.TestTableMapReduce
    [junit] Tests run: 1, Failures: 0, Errors: 0, Time elapsed: 56.818 sec
    [junit] Running org.apache.hadoop.hbase.mapreduce.TestTimeRangeMapRed
    [junit] Tests run: 1, Failures: 0, Errors: 0, Time elapsed: 33.486 sec
    [junit] Running org.apache.hadoop.hbase.master.TestMasterTransistions
    [junit] Tests run: 2, Failures: 0, Errors: 0, Time elapsed: 46.801 sec
    [junit] Running org.apache.hadoop.hbase.master.TestMinimumServerCount
    [junit] Tests run: 1, Failures: 0, Errors: 0, Time elapsed: 45.406 sec
    [junit] Running org.apache.hadoop.hbase.master.TestRegionManager
    [junit] Tests run: 1, Failures: 0, Errors: 0, Time elapsed: 14.526 sec
    [junit] Running org.apache.hadoop.hbase.master.TestRegionServerOperationQueue
    [junit] Tests run: 1, Failures: 0, Errors: 0, Time elapsed: 0.131 sec
    [junit] Running org.apache.hadoop.hbase.metrics.TestMetricsMBeanBase
    [junit] Tests run: 2, Failures: 0, Errors: 0, Time elapsed: 0.127 sec
    [junit] Running org.apache.hadoop.hbase.regionserver.TestCompaction
    [junit] Tests run: 2, Failures: 0, Errors: 0, Time elapsed: 26.815 sec
    [junit] Running org.apache.hadoop.hbase.regionserver.TestDeleteCompare
    [junit] Tests run: 4, Failures: 0, Errors: 0, Time elapsed: 0.131 sec
    [junit] Running org.apache.hadoop.hbase.regionserver.TestExplicitColumnTracker
    [junit] Tests run: 3, Failures: 0, Errors: 0, Time elapsed: 0.64 sec
    [junit] Running org.apache.hadoop.hbase.regionserver.TestGetClosestAtOrBefore
    [junit] Tests run: 3, Failures: 0, Errors: 0, Time elapsed: 12.296 sec
    [junit] Running org.apache.hadoop.hbase.regionserver.TestGetDeleteTracker
    [junit] Tests run: 7, Failures: 0, Errors: 0, Time elapsed: 0.041 sec
    [junit] Running org.apache.hadoop.hbase.regionserver.TestHLog
    [junit] Tests run: 3, Failures: 0, Errors: 0, Time elapsed: 18.168 sec
    [junit] Running org.apache.hadoop.hbase.regionserver.TestHRegion
    [junit] Tests run: 44, Failures: 0, Errors: 0, Time elapsed: 134.565 sec
    [junit] Running org.apache.hadoop.hbase.regionserver.TestHRegionInfo
    [junit] Tests run: 1, Failures: 0, Errors: 0, Time elapsed: 0.163 sec
    [junit] Running org.apache.hadoop.hbase.regionserver.TestKeyValueHeap
    [junit] Tests run: 3, Failures: 0, Errors: 0, Time elapsed: 0.031 sec
    [junit] Running org.apache.hadoop.hbase.regionserver.TestKeyValueScanFixture
    [junit] Tests run: 1, Failures: 0, Errors: 0, Time elapsed: 0.116 sec
    [junit] Running org.apache.hadoop.hbase.regionserver.TestKeyValueSkipListSet
    [junit] Tests run: 4, Failures: 0, Errors: 0, Time elapsed: 0.043 sec
    [junit] Running org.apache.hadoop.hbase.regionserver.TestLogRolling
    [junit] Tests run: 2, Failures: 0, Errors: 0, Time elapsed: 125.187 sec
    [junit] Running org.apache.hadoop.hbase.regionserver.TestLruHashMap
    [junit] Tests run: 9, Failures: 0, Errors: 0, Time elapsed: 1.602 sec
    [junit] Running org.apache.hadoop.hbase.regionserver.TestMemStore
    [junit] Tests run: 20, Failures: 0, Errors: 0, Time elapsed: 0.556 sec
    [junit] Running org.apache.hadoop.hbase.regionserver.TestMinorCompactingStoreScanner
    [junit] Tests run: 2, Failures: 0, Errors: 0, Time elapsed: 0.111 sec
    [junit] Running org.apache.hadoop.hbase.regionserver.TestQueryMatcher
    [junit] Tests run: 4, Failures: 0, Errors: 0, Time elapsed: 0.034 sec
    [junit] Running org.apache.hadoop.hbase.regionserver.TestReadWriteConsistencyControl
    [junit] Tests run: 1, Failures: 0, Errors: 0, Time elapsed: 10.061 sec
    [junit] Running org.apache.hadoop.hbase.regionserver.TestScanDeleteTracker
    [junit] Tests run: 6, Failures: 0, Errors: 0, Time elapsed: 0.023 sec
    [junit] Running org.apache.hadoop.hbase.regionserver.TestScanWildcardColumnTracker
    [junit] Tests run: 2, Failures: 0, Errors: 0, Time elapsed: 0.16 sec
    [junit] Running org.apache.hadoop.hbase.regionserver.TestScanner
    [junit] Tests run: 6, Failures: 0, Errors: 0, Time elapsed: 33.639 sec
    [junit] Running org.apache.hadoop.hbase.regionserver.TestStore
    [junit] Tests run: 5, Failures: 0, Errors: 0, Time elapsed: 0.907 sec
    [junit] Running org.apache.hadoop.hbase.regionserver.TestStoreFile
    [junit] Tests run: 2, Failures: 0, Errors: 0, Time elapsed: 12.413 sec
    [junit] Running org.apache.hadoop.hbase.regionserver.TestStoreScanner
    [junit] Tests run: 13, Failures: 0, Errors: 0, Time elapsed: 0.128 sec
    [junit] Running org.apache.hadoop.hbase.regionserver.TestWideScanner
    [junit] Tests run: 1, Failures: 0, Errors: 0, Time elapsed: 14.543 sec
    [junit] Running org.apache.hadoop.hbase.regionserver.TestWildcardColumnTracker
    [junit] Tests run: 6, Failures: 0, Errors: 0, Time elapsed: 0.423 sec
    [junit] Running org.apache.hadoop.hbase.thrift.TestThriftServer
    [junit] Tests run: 1, Failures: 0, Errors: 0, Time elapsed: 86.871 sec
    [junit] Running org.apache.hadoop.hbase.util.TestBase64
    [junit] Tests run: 1, Failures: 0, Errors: 0, Time elapsed: 0.114 sec
    [junit] Running org.apache.hadoop.hbase.util.TestBytes
    [junit] Tests run: 11, Failures: 0, Errors: 0, Time elapsed: 0.078 sec
    [junit] Running org.apache.hadoop.hbase.util.TestKeying
    [junit] Tests run: 1, Failures: 0, Errors: 0, Time elapsed: 0.057 sec
    [junit] Running org.apache.hadoop.hbase.util.TestMergeTool
    [junit] Tests run: 1, Failures: 0, Errors: 0, Time elapsed: 11.909 sec
    [junit] Running org.apache.hadoop.hbase.util.TestPair
    [junit] Tests run: 9, Failures: 0, Errors: 0, Time elapsed: 0.243 sec
    [junit] Running org.apache.hadoop.hbase.util.TestRootPath
    [junit] Tests run: 1, Failures: 0, Errors: 0, Time elapsed: 0.046 sec
    [junit] Running org.apache.hadoop.hbase.zookeeper.TestHQuorumPeer
    [junit] Tests run: 2, Failures: 0, Errors: 0, Time elapsed: 0.202 sec

test-contrib:

test:

compile:

compile-examples:

compile-test:

test:

check-contrib:

init:
     [echo] contrib: stargate

init-contrib:

compile-jar:

compile-war:

compile-test:
    [javac] Compiling 29 source files to <http://hudson.zones.apache.org/hudson/job/hbase-020-branch/ws/trunk/build/contrib/stargate/test>
      [jar] Building jar: <http://hudson.zones.apache.org/hudson/job/hbase-020-branch/ws/trunk/build/contrib/stargate/hbase-0.20.4-dev-stargate-test.jar>

test:
    [junit] Running org.apache.hadoop.hbase.stargate.Test00MiniCluster
    [junit] Tests run: 4, Failures: 0, Errors: 0, Time elapsed: 10.298 sec
    [junit] Running org.apache.hadoop.hbase.stargate.TestRowResource
    [junit] Tests run: 8, Failures: 0, Errors: 8, Time elapsed: 5.448 sec
    [junit] TEST org.apache.hadoop.hbase.stargate.TestRowResource FAILED
    [junit] Running org.apache.hadoop.hbase.stargate.TestScannerResource
    [junit] Tests run: 4, Failures: 0, Errors: 4, Time elapsed: 12.92 sec
    [junit] TEST org.apache.hadoop.hbase.stargate.TestScannerResource FAILED
    [junit] Running org.apache.hadoop.hbase.stargate.TestScannersWithFilters
    [junit] Tests run: 10, Failures: 0, Errors: 10, Time elapsed: 52.246 sec
    [junit] TEST org.apache.hadoop.hbase.stargate.TestScannersWithFilters FAILED
    [junit] Running org.apache.hadoop.hbase.stargate.TestSchemaResource
    [junit] Tests run: 2, Failures: 0, Errors: 2, Time elapsed: 0.099 sec
    [junit] TEST org.apache.hadoop.hbase.stargate.TestSchemaResource FAILED
    [junit] Running org.apache.hadoop.hbase.stargate.TestStatusResource
    [junit] Tests run: 2, Failures: 0, Errors: 2, Time elapsed: 0.008 sec
    [junit] TEST org.apache.hadoop.hbase.stargate.TestStatusResource FAILED
    [junit] Running org.apache.hadoop.hbase.stargate.TestTableResource
    [junit] Tests run: 8, Failures: 0, Errors: 8, Time elapsed: 24.737 sec
    [junit] TEST org.apache.hadoop.hbase.stargate.TestTableResource FAILED
    [junit] Running org.apache.hadoop.hbase.stargate.TestVersionResource
    [junit] Tests run: 7, Failures: 0, Errors: 7, Time elapsed: 0.015 sec
    [junit] TEST org.apache.hadoop.hbase.stargate.TestVersionResource FAILED
    [junit] Running org.apache.hadoop.hbase.stargate.auth.TestHBCAuthenticator
    [junit] Tests run: 4, Failures: 0, Errors: 0, Time elapsed: 0.005 sec
    [junit] Running org.apache.hadoop.hbase.stargate.auth.TestHTableAuthenticator
    [junit] Tests run: 4, Failures: 0, Errors: 0, Time elapsed: 5.383 sec
    [junit] Running org.apache.hadoop.hbase.stargate.auth.TestJDBCAuthenticator
    [junit] Tests run: 4, Failures: 0, Errors: 0, Time elapsed: 0.014 sec
    [junit] Running org.apache.hadoop.hbase.stargate.auth.TestZooKeeperAuthenticator
    [junit] Tests run: 4, Failures: 0, Errors: 0, Time elapsed: 0.332 sec
    [junit] Running org.apache.hadoop.hbase.stargate.client.TestRemoteAdmin
    [junit] Tests run: 2, Failures: 0, Errors: 2, Time elapsed: 5.355 sec
    [junit] TEST org.apache.hadoop.hbase.stargate.client.TestRemoteAdmin FAILED
    [junit] Running org.apache.hadoop.hbase.stargate.client.TestRemoteTable
    [junit] Tests run: 5, Failures: 0, Errors: 5, Time elapsed: 5.406 sec
    [junit] TEST org.apache.hadoop.hbase.stargate.client.TestRemoteTable FAILED
    [junit] Running org.apache.hadoop.hbase.stargate.model.TestCellModel
    [junit] Tests run: 3, Failures: 0, Errors: 0, Time elapsed: 0.007 sec
    [junit] Running org.apache.hadoop.hbase.stargate.model.TestCellSetModel
    [junit] Tests run: 3, Failures: 0, Errors: 0, Time elapsed: 0.006 sec
    [junit] Running org.apache.hadoop.hbase.stargate.model.TestColumnSchemaModel
    [junit] Tests run: 2, Failures: 0, Errors: 0, Time elapsed: 0.005 sec
    [junit] Running org.apache.hadoop.hbase.stargate.model.TestRowModel
    [junit] Tests run: 2, Failures: 0, Errors: 0, Time elapsed: 0.006 sec
    [junit] Running org.apache.hadoop.hbase.stargate.model.TestScannerModel
    [junit] Tests run: 3, Failures: 0, Errors: 0, Time elapsed: 0.005 sec
    [junit] Running org.apache.hadoop.hbase.stargate.model.TestStorageClusterStatusModel
    [junit] Tests run: 3, Failures: 0, Errors: 0, Time elapsed: 0.013 sec
    [junit] Running org.apache.hadoop.hbase.stargate.model.TestStorageClusterVersionModel
    [junit] Tests run: 2, Failures: 0, Errors: 0, Time elapsed: 0.004 sec
    [junit] Running org.apache.hadoop.hbase.stargate.model.TestTableInfoModel
    [junit] Tests run: 3, Failures: 0, Errors: 0, Time elapsed: 0.01 sec
    [junit] Running org.apache.hadoop.hbase.stargate.model.TestTableListModel
    [junit] Tests run: 3, Failures: 0, Errors: 0, Time elapsed: 0.007 sec
    [junit] Running org.apache.hadoop.hbase.stargate.model.TestTableRegionModel
    [junit] Tests run: 2, Failures: 0, Errors: 0, Time elapsed: 0.004 sec
    [junit] Running org.apache.hadoop.hbase.stargate.model.TestTableSchemaModel
    [junit] Tests run: 3, Failures: 0, Errors: 0, Time elapsed: 0.005 sec
    [junit] Running org.apache.hadoop.hbase.stargate.model.TestVersionModel
    [junit] Tests run: 3, Failures: 0, Errors: 0, Time elapsed: 0.007 sec
    [junit] Running org.apache.hadoop.hbase.stargate.util.TestHTableTokenBucket
    [junit] Tests run: 2, Failures: 0, Errors: 0, Time elapsed: 17.385 sec
    [junit] Shutting down the Mini HDFS Cluster
    [junit] Shutting down DataNode 1
    [junit] Shutting down DataNode 0
    [junit] Tests FAILED

BUILD FAILED
<http://hudson.zones.apache.org/hudson/job/hbase-020-branch/ws/trunk/build.xml>:521:
The following error occurred while executing this line:
<http://hudson.zones.apache.org/hudson/job/hbase-020-branch/ws/trunk/src/contrib/build.xml>:54:
The following error occurred while executing this line:
<http://hudson.zones.apache.org/hudson/job/hbase-020-branch/ws/trunk/src/contrib/stargate/build.xml>:94:
Tests failed!

Total time: 50 minutes 3 seconds
[locks-and-latches] Releasing all the locks
[locks-and-latches] All the locks released
Recording test results


Mime
View raw message