hbase-dev mailing list archives

Site index · List index
Message view « Date » · « Thread »
Top « Date » · « Thread »
From Apache Hudson Server <hud...@hudson.zones.apache.org>
Subject Build failed in Hudson: HBase-Patch #1242
Date Tue, 18 May 2010 01:55:38 GMT
See <http://hudson.zones.apache.org/hudson/job/HBase-Patch/1242/changes>

Changes:

[stack] HBASE-2551  Forward port fixes that are in branch but not in trunk (part of the merge
of old 0.20 into TRUNK task)

[stack] HBASE-2520 Cleanup arrays vs Lists of scanners

[stack] HBASE-2457 RS gets stuck compacting region ad infinitum

------------------------------------------
[...truncated 28 lines...]
[INFO]   HBase Contrib - Stargate WAR
[INFO] ------------------------------------------------------------------------
[INFO] Building HBase
[INFO]    task-segment: [clean, deploy]
[INFO] ------------------------------------------------------------------------
[INFO] [clean:clean {execution: default-clean}]
[INFO] [site:attach-descriptor {execution: default-attach-descriptor}]
[INFO] [install:install {execution: default-install}]
[INFO] Installing <http://hudson.zones.apache.org/hudson/job/HBase-Patch/ws/trunk/pom.xml>
to /home/hudson/.m2/repository/org/apache/hbase/hbase/0.21.0-SNAPSHOT/hbase-0.21.0-SNAPSHOT.pom
[INFO] [deploy:deploy {execution: default-deploy}]
[INFO] Retrieving previous build number from apache.snapshots.https
Uploading: https://repository.apache.org/content/repositories/snapshots/org/apache/hbase/hbase/0.21.0-SNAPSHOT/hbase-0.21.0-20100518.013221-35.pom
4/16K
8/16K
12/16K
16/16K
16/16K
16K uploaded  (hbase-0.21.0-20100518.013221-35.pom)
[INFO] Retrieving previous metadata from apache.snapshots.https
[INFO] Uploading repository metadata for: 'snapshot org.apache.hbase:hbase:0.21.0-SNAPSHOT'
[INFO] Retrieving previous metadata from apache.snapshots.https
[INFO] Uploading repository metadata for: 'artifact org.apache.hbase:hbase'
[INFO] ------------------------------------------------------------------------
[INFO] Building HBase Core
[INFO]    task-segment: [clean, deploy]
[INFO] ------------------------------------------------------------------------
[INFO] [clean:clean {execution: default-clean}]
[INFO] Deleting <http://hudson.zones.apache.org/hudson/job/HBase-Patch/ws/trunk/core/target>
[INFO] [antrun:run {execution: JSPC}]
[INFO] Executing tasks
SLF4J: Failed to load class "org.slf4j.impl.StaticLoggerBinder".
SLF4J: See http://www.slf4j.org/codes.html#StaticLoggerBinder for further details.
2010-05-18 01:32:24.927::INFO:  Logging to STDERR via org.mortbay.log.StdErrLog
[INFO] Executed tasks
[INFO] [antrun:run {execution: package-info}]
[INFO] Executing tasks
[INFO] Executed tasks
[INFO] [build-helper:add-source {execution: add-jspc-source}]
[INFO] Source directory: <http://hudson.zones.apache.org/hudson/job/HBase-Patch/ws/trunk/core/target/jspc>
added.
[INFO] [build-helper:add-source {execution: add-package-info}]
[INFO] Source directory: <http://hudson.zones.apache.org/hudson/job/HBase-Patch/ws/trunk/core/target/generated-sources>
added.
[INFO] [resources:resources {execution: default-resources}]
[INFO] Using 'UTF-8' encoding to copy filtered resources.
[INFO] Copying 20 resources
[INFO] skip non existing resourceDirectory <http://hudson.zones.apache.org/hudson/job/HBase-Patch/ws/trunk/core/src/main/webapps>
[INFO] [compiler:compile {execution: default-compile}]
[INFO] Compiling 278 source files to <http://hudson.zones.apache.org/hudson/job/HBase-Patch/ws/trunk/core/target/classes>
[INFO] [resources:testResources {execution: default-testResources}]
[INFO] Using 'UTF-8' encoding to copy filtered resources.
[INFO] Copying 4 resources
[INFO] [compiler:testCompile {execution: default-testCompile}]
[INFO] Compiling 107 source files to <http://hudson.zones.apache.org/hudson/job/HBase-Patch/ws/trunk/core/target/test-classes>
[INFO] [surefire:test {execution: default-test}]
[INFO] Surefire report directory: <http://hudson.zones.apache.org/hudson/job/HBase-Patch/ws/trunk/core/target/surefire-reports>

-------------------------------------------------------
 T E S T S
-------------------------------------------------------
Running org.apache.hadoop.hbase.TestFullLogReconstruction
Tests run: 1, Failures: 0, Errors: 1, Skipped: 0, Time elapsed: 5.041 sec <<< FAILURE!
Running org.apache.hadoop.hbase.TestSerialization
Tests run: 18, Failures: 0, Errors: 0, Skipped: 0, Time elapsed: 0.85 sec
Running org.apache.hadoop.hbase.TestZooKeeper
Tests run: 1, Failures: 0, Errors: 1, Skipped: 0, Time elapsed: 50.72 sec <<< FAILURE!
Running org.apache.hadoop.hbase.regionserver.wal.TestLogRolling
Tests run: 2, Failures: 0, Errors: 2, Skipped: 0, Time elapsed: 47.493 sec <<< FAILURE!
Running org.apache.hadoop.hbase.io.hfile.TestCachedBlockQueue
Tests run: 2, Failures: 0, Errors: 0, Skipped: 0, Time elapsed: 0.099 sec
Running org.apache.hadoop.hbase.regionserver.TestKeyValueHeap
Tests run: 3, Failures: 0, Errors: 0, Skipped: 0, Time elapsed: 0.472 sec
Running org.apache.hadoop.hbase.regionserver.TestStoreScanner
Tests run: 13, Failures: 0, Errors: 0, Skipped: 0, Time elapsed: 0.125 sec
Running org.apache.hadoop.hbase.TestHMsg
Tests run: 2, Failures: 0, Errors: 0, Skipped: 0, Time elapsed: 0.12 sec
Running org.apache.hadoop.hbase.filter.TestPrefixFilter
Tests run: 3, Failures: 0, Errors: 0, Skipped: 0, Time elapsed: 0.102 sec
Running org.apache.hadoop.hbase.regionserver.TestHRegionInfo
Tests run: 1, Failures: 0, Errors: 0, Skipped: 0, Time elapsed: 0.297 sec
Running org.apache.hadoop.hbase.util.TestKeying
Tests run: 1, Failures: 0, Errors: 0, Skipped: 0, Time elapsed: 0.035 sec
Running org.apache.hadoop.hbase.regionserver.TestScanner
Tests run: 6, Failures: 0, Errors: 0, Skipped: 0, Time elapsed: 29.197 sec
Running org.apache.hadoop.hbase.io.TestHeapSize
Tests run: 2, Failures: 0, Errors: 0, Skipped: 0, Time elapsed: 0.131 sec
Running org.apache.hadoop.hbase.io.TestImmutableBytesWritable
Tests run: 1, Failures: 0, Errors: 0, Skipped: 0, Time elapsed: 0.102 sec
Running org.apache.hadoop.hbase.client.TestShell
Tests run: 1, Failures: 0, Errors: 1, Skipped: 0, Time elapsed: 6.1 sec <<< FAILURE!
Running org.apache.hadoop.hbase.regionserver.TestMinorCompactingStoreScanner
Tests run: 2, Failures: 0, Errors: 0, Skipped: 0, Time elapsed: 0.109 sec
Running org.apache.hadoop.hbase.TestInfoServers
Tests run: 1, Failures: 0, Errors: 1, Skipped: 0, Time elapsed: 36.606 sec <<< FAILURE!
Running org.apache.hadoop.hbase.io.hfile.TestHFileSeek
Tests run: 1, Failures: 0, Errors: 0, Skipped: 0, Time elapsed: 5.265 sec
Running org.apache.hadoop.hbase.regionserver.TestStore
Tests run: 5, Failures: 0, Errors: 0, Skipped: 0, Time elapsed: 0.929 sec
Running org.apache.hadoop.hbase.zookeeper.TestHQuorumPeer
Tests run: 3, Failures: 0, Errors: 0, Skipped: 0, Time elapsed: 0.473 sec
Running org.apache.hadoop.hbase.io.hfile.TestHFilePerformance
Tests run: 1, Failures: 0, Errors: 0, Skipped: 0, Time elapsed: 6.392 sec
Running org.apache.hadoop.hbase.io.TestHbaseObjectWritable
Tests run: 1, Failures: 0, Errors: 0, Skipped: 0, Time elapsed: 0.197 sec
Running org.apache.hadoop.hbase.master.TestOldLogsCleaner
Tests run: 1, Failures: 0, Errors: 0, Skipped: 0, Time elapsed: 0.665 sec
Running org.apache.hadoop.hbase.thrift.TestThriftServer
Tests run: 1, Failures: 0, Errors: 1, Skipped: 0, Time elapsed: 28.94 sec <<< FAILURE!
Running org.apache.hadoop.hbase.regionserver.TestQueryMatcher
Tests run: 4, Failures: 0, Errors: 0, Skipped: 0, Time elapsed: 0.47 sec
Running org.apache.hadoop.hbase.client.TestAdmin
Tests run: 1, Failures: 0, Errors: 1, Skipped: 0, Time elapsed: 48.978 sec <<< FAILURE!
Running org.apache.hadoop.hbase.util.TestMergeTool
Tests run: 1, Failures: 0, Errors: 0, Skipped: 0, Time elapsed: 30.671 sec
Running org.apache.hadoop.hbase.TestCompare
Tests run: 1, Failures: 0, Errors: 0, Skipped: 0, Time elapsed: 0.113 sec
Running org.apache.hadoop.hbase.regionserver.TestExplicitColumnTracker
Tests run: 4, Failures: 0, Errors: 0, Skipped: 0, Time elapsed: 0.902 sec
Running org.apache.hadoop.hbase.regionserver.TestStoreReconstruction
Tests run: 1, Failures: 0, Errors: 0, Skipped: 0, Time elapsed: 5.041 sec
Running org.apache.hadoop.hbase.TestEmptyMetaInfo
Tests run: 1, Failures: 0, Errors: 1, Skipped: 0, Time elapsed: 45.745 sec <<< FAILURE!
Running org.apache.hadoop.hbase.master.TestServerManager
Tests run: 1, Failures: 0, Errors: 0, Skipped: 0, Time elapsed: 0.123 sec
Running org.apache.hadoop.hbase.util.TestBase64
Tests run: 1, Failures: 0, Errors: 0, Skipped: 0, Time elapsed: 0.102 sec
Running org.apache.hadoop.hbase.regionserver.TestMemStore
Tests run: 20, Failures: 0, Errors: 0, Skipped: 0, Time elapsed: 0.753 sec
Running org.apache.hadoop.hbase.master.TestMasterWithDisabling
Tests run: 1, Failures: 0, Errors: 1, Skipped: 0, Time elapsed: 30.354 sec <<< FAILURE!
Running org.apache.hadoop.hbase.master.TestMasterTransitions
Tests run: 1, Failures: 0, Errors: 1, Skipped: 0, Time elapsed: 41.985 sec <<< FAILURE!
Running org.apache.hadoop.hbase.io.hfile.TestLruBlockCache
Tests run: 7, Failures: 0, Errors: 0, Skipped: 0, Time elapsed: 1.153 sec
Running org.apache.hadoop.hbase.regionserver.TestDeleteCompare
Tests run: 4, Failures: 0, Errors: 0, Skipped: 0, Time elapsed: 0.112 sec
Running org.apache.hadoop.hbase.regionserver.TestScanWildcardColumnTracker
Tests run: 2, Failures: 0, Errors: 0, Skipped: 0, Time elapsed: 0.427 sec
Running org.apache.hadoop.hbase.regionserver.TestKeyValueSkipListSet
Tests run: 4, Failures: 0, Errors: 0, Skipped: 0, Time elapsed: 0.11 sec
Running org.apache.hadoop.hbase.master.TestRegionServerOperationQueue
Tests run: 1, Failures: 0, Errors: 0, Skipped: 0, Time elapsed: 0.177 sec
Running org.apache.hadoop.hbase.io.hfile.TestSeekTo
Tests run: 3, Failures: 0, Errors: 0, Skipped: 0, Time elapsed: 0.565 sec
Running org.apache.hadoop.hbase.filter.TestPageFilter
Tests run: 2, Failures: 0, Errors: 0, Skipped: 0, Time elapsed: 0.037 sec
Running org.apache.hadoop.hbase.TestMergeMeta
Tests run: 1, Failures: 0, Errors: 0, Skipped: 0, Time elapsed: 52.186 sec
Running org.apache.hadoop.hbase.filter.TestColumnPaginationFilter
Tests run: 1, Failures: 0, Errors: 0, Skipped: 0, Time elapsed: 0.104 sec
Running org.apache.hadoop.hbase.TestKeyValue
Tests run: 8, Failures: 0, Errors: 0, Skipped: 0, Time elapsed: 0.116 sec
Running org.apache.hadoop.hbase.mapreduce.TestTableMapReduce
Tests run: 1, Failures: 0, Errors: 1, Skipped: 0, Time elapsed: 15.127 sec <<< FAILURE!
Running org.apache.hadoop.hbase.client.TestFromClientSide
Tests run: 1, Failures: 0, Errors: 1, Skipped: 0, Time elapsed: 16.214 sec <<< FAILURE!
Running org.apache.hadoop.hbase.regionserver.TestCompaction
Tests run: 2, Failures: 0, Errors: 0, Skipped: 0, Time elapsed: 73.892 sec
Running org.apache.hadoop.hbase.client.TestHTablePool
Tests run: 1, Failures: 0, Errors: 1, Skipped: 0, Time elapsed: 33.239 sec <<< FAILURE!
Running org.apache.hadoop.hbase.TestMultiParallelPut
Tests run: 2, Failures: 0, Errors: 2, Skipped: 0, Time elapsed: 82.548 sec <<< FAILURE!
Running org.apache.hadoop.hbase.master.TestRegionManager
Tests run: 1, Failures: 0, Errors: 1, Skipped: 0, Time elapsed: 35.119 sec <<< FAILURE!
Running org.apache.hadoop.hbase.mapreduce.TestTimeRangeMapRed
Tests run: 1, Failures: 0, Errors: 1, Skipped: 0, Time elapsed: 11.926 sec <<< FAILURE!
Running org.apache.hadoop.hbase.filter.TestSingleColumnValueFilter
Tests run: 2, Failures: 0, Errors: 0, Skipped: 0, Time elapsed: 0.134 sec
Running org.apache.hadoop.hbase.master.TestMinimumServerCount
Tests run: 1, Failures: 0, Errors: 1, Skipped: 0, Time elapsed: 64.169 sec <<< FAILURE!
Running org.apache.hadoop.hbase.mapreduce.TestSimpleTotalOrderPartitioner
Tests run: 1, Failures: 0, Errors: 0, Skipped: 0, Time elapsed: 0.31 sec
Running org.apache.hadoop.hbase.regionserver.TestGetDeleteTracker
Tests run: 7, Failures: 0, Errors: 0, Skipped: 0, Time elapsed: 0.581 sec
Running org.apache.hadoop.hbase.mapreduce.TestHFileOutputFormat
Tests run: 1, Failures: 0, Errors: 0, Skipped: 0, Time elapsed: 5.664 sec
Running org.apache.hadoop.hbase.regionserver.TestScanDeleteTracker
Tests run: 6, Failures: 0, Errors: 0, Skipped: 0, Time elapsed: 0.517 sec
Running org.apache.hadoop.hbase.metrics.TestMetricsMBeanBase
Tests run: 2, Failures: 0, Errors: 0, Skipped: 0, Time elapsed: 0.117 sec
Running org.apache.hadoop.hbase.mapreduce.TestTableInputFormatScan
Tests run: 1, Failures: 0, Errors: 1, Skipped: 0, Time elapsed: 7.641 sec <<< FAILURE!
Running org.apache.hadoop.hbase.filter.TestFilterList
Tests run: 4, Failures: 0, Errors: 0, Skipped: 0, Time elapsed: 0.142 sec
Running org.apache.hadoop.hbase.regionserver.TestHRegion
Tests run: 44, Failures: 1, Errors: 0, Skipped: 0, Time elapsed: 61.463 sec <<< FAILURE!
Running org.apache.hadoop.hbase.TestRegionRebalancing
Tests run: 1, Failures: 0, Errors: 1, Skipped: 0, Time elapsed: 12.763 sec <<< FAILURE!
Running org.apache.hadoop.hbase.filter.TestSingleColumnValueExcludeFilter
Tests run: 1, Failures: 0, Errors: 0, Skipped: 0, Time elapsed: 0.106 sec
Running org.apache.hadoop.hbase.filter.TestInclusiveStopFilter
Tests run: 2, Failures: 0, Errors: 0, Skipped: 0, Time elapsed: 0.101 sec
Running org.apache.hadoop.hbase.util.TestRootPath
Tests run: 1, Failures: 0, Errors: 0, Skipped: 0, Time elapsed: 0.104 sec
Running org.apache.hadoop.hbase.client.TestScannerTimeout
Tests run: 1, Failures: 0, Errors: 1, Skipped: 0, Time elapsed: 20.998 sec <<< FAILURE!
Running org.apache.hadoop.hbase.mapred.TestTableMapReduce
Tests run: 1, Failures: 0, Errors: 1, Skipped: 0, Time elapsed: 65.558 sec <<< FAILURE!
Running org.apache.hadoop.hbase.regionserver.TestKeyValueScanFixture
Tests run: 1, Failures: 0, Errors: 0, Skipped: 0, Time elapsed: 0.104 sec
Running org.apache.hadoop.hbase.util.TestBytes
Tests run: 9, Failures: 0, Errors: 0, Skipped: 0, Time elapsed: 0.108 sec
Running org.apache.hadoop.hbase.regionserver.TestWildcardColumnTracker
Tests run: 6, Failures: 0, Errors: 0, Skipped: 0, Time elapsed: 0.715 sec
Running org.apache.hadoop.hbase.regionserver.TestStoreFile
Tests run: 2, Failures: 0, Errors: 0, Skipped: 0, Time elapsed: 31.688 sec
Running org.apache.hadoop.hbase.client.TestGetRowVersions
Tests run: 1, Failures: 0, Errors: 1, Skipped: 0, Time elapsed: 40.598 sec <<< FAILURE!
Running org.apache.hadoop.hbase.io.hfile.TestHFile
Tests run: 7, Failures: 0, Errors: 0, Skipped: 0, Time elapsed: 0.797 sec
Running org.apache.hadoop.hbase.filter.TestFilter
Tests run: 15, Failures: 0, Errors: 0, Skipped: 0, Time elapsed: 3.011 sec
Running org.apache.hadoop.hbase.regionserver.TestWideScanner
Tests run: 1, Failures: 0, Errors: 0, Skipped: 0, Time elapsed: 31.964 sec
Running org.apache.hadoop.hbase.regionserver.wal.TestHLog
Tests run: 4, Failures: 0, Errors: 0, Skipped: 0, Time elapsed: 46.121 sec
Running org.apache.hadoop.hbase.client.TestTimestamp
Tests run: 1, Failures: 0, Errors: 1, Skipped: 0, Time elapsed: 26.754 sec <<< FAILURE!
Running org.apache.hadoop.hbase.TestScanMultipleVersions
Tests run: 1, Failures: 0, Errors: 1, Skipped: 0, Time elapsed: 49.044 sec <<< FAILURE!
Running org.apache.hadoop.hbase.TestMergeTable
Tests run: 1, Failures: 0, Errors: 1, Skipped: 0, Time elapsed: 82.879 sec <<< FAILURE!
Running org.apache.hadoop.hbase.regionserver.TestGetClosestAtOrBefore
Tests run: 3, Failures: 0, Errors: 0, Skipped: 0, Time elapsed: 37.834 sec
Running org.apache.hadoop.hbase.regionserver.TestReadWriteConsistencyControl
Tests run: 1, Failures: 0, Errors: 0, Skipped: 0, Time elapsed: 10.058 sec

Results :

Failed tests: 

Tests in error: 

Tests run: 281, Failures: 1, Errors: 27, Skipped: 0

[INFO] ------------------------------------------------------------------------
[ERROR] BUILD FAILURE
[INFO] ------------------------------------------------------------------------
[INFO] There are test failures.

Please refer to <http://hudson.zones.apache.org/hudson/job/HBase-Patch/ws/trunk/core/target/surefire-reports>
for the individual test results.
[INFO] ------------------------------------------------------------------------
[INFO] For more information, run Maven with the -e switch
[INFO] ------------------------------------------------------------------------
[INFO] Total time: 23 minutes 13 seconds
[INFO] Finished at: Tue May 18 01:55:33 UTC 2010
[INFO] Final Memory: 36M/108M
[INFO] ------------------------------------------------------------------------
[locks-and-latches] Releasing all the locks
[locks-and-latches] All the locks released
Recording test results


Mime
View raw message