hbase-dev mailing list archives

Site index · List index
Message view « Date » · « Thread »
Top « Date » · « Thread »
From Apache Hudson Server <hud...@hudson.zones.apache.org>
Subject Build failed in Hudson: hbase-020-branch #69
Date Fri, 30 Apr 2010 10:44:54 GMT
See <http://hudson.zones.apache.org/hudson/job/hbase-020-branch/69/changes>

Changes:

[stack] HBASE-2414 Enhance test suite to be able to specify distributed scenarios

[stack] HBASE-2414 Enhance test suite to be able to specify distributed scenarios

[jdcryans] HBASE-2499  Race condition when disabling a table leaves regions in transition

[stack] HBASE-2497  ProcessServerShutdown throws NullPointerException for offline regions

[jdcryans] HBASE-2496  Less ArrayList churn on the scan path

[apurtell] [EC2] increase ip_conntrack_max; disable datanode write timeout

[stack] HBASE-2490 Improve the javadoc of the client API for HTable

[stack] HBASE-2393 ThriftServer instantiates a new HTable per request

[stack] HBASE-2442 Log lease recovery catches IOException too widely

[stack] HBASE-2476 HLog sequence number is obtained outside updateLock

[stack] HBASE-2487 Uncaught exceptions in receiving IPC responses orphan clients

[stack] HBASE-2488 Master should warn more loudly about unexpected events

[stack] HBASE-2381 missing copyright headers

[stack] HBASE-2481 Client is not getting UnknownScannerExceptions; they are being eaten

[stack] HBASE-2447 LogSyncer.addToSyncQueue doesn't check if syncer is still running before
waiting

------------------------------------------
[...truncated 192 lines...]
compile-jar:

compile-war:

compile:
     [echo] contrib: stargate

clover.setup:

clover.info:
     [echo] 
     [echo]       Clover not found. Code coverage reports disabled.
     [echo]     

clover:

check-contrib:

init:
     [echo] contrib: transactional

init-contrib:

compile:
     [echo] contrib: transactional

compile:

compile-core-test:
    [javac] Compiling 120 source files to <http://hudson.zones.apache.org/hudson/job/hbase-020-branch/ws/trunk/build/test>
    [javac] Note: Some input files use or override a deprecated API.
    [javac] Note: Recompile with -Xlint:deprecation for details.
    [javac] Note: Some input files use unchecked or unsafe operations.
    [javac] Note: Recompile with -Xlint:unchecked for details.
      [jar] Building jar: <http://hudson.zones.apache.org/hudson/job/hbase-020-branch/ws/trunk/build/hbase-0.20.4-dev-test.jar>

test-core:
    [mkdir] Created dir: <http://hudson.zones.apache.org/hudson/job/hbase-020-branch/ws/trunk/build/test/logs>
    [junit] Running org.apache.hadoop.hbase.TestClassMigration
    [junit] Tests run: 1, Failures: 0, Errors: 0, Time elapsed: 0.111 sec
    [junit] Running org.apache.hadoop.hbase.TestCompare
    [junit] Tests run: 3, Failures: 0, Errors: 0, Time elapsed: 0.079 sec
    [junit] Running org.apache.hadoop.hbase.TestEmptyMetaInfo
    [junit] Tests run: 1, Failures: 0, Errors: 0, Time elapsed: 22.459 sec
    [junit] Running org.apache.hadoop.hbase.TestFullLogReconstruction
    [junit] Tests run: 1, Failures: 0, Errors: 0, Time elapsed: 200.582 sec
    [junit] Running org.apache.hadoop.hbase.TestHBaseCluster
    [junit] Tests run: 1, Failures: 0, Errors: 0, Time elapsed: 43.699 sec
    [junit] Running org.apache.hadoop.hbase.TestHMsg
    [junit] Tests run: 2, Failures: 0, Errors: 0, Time elapsed: 0.07 sec
    [junit] Running org.apache.hadoop.hbase.TestHStoreKey
    [junit] Tests run: 7, Failures: 0, Errors: 0, Time elapsed: 0.056 sec
    [junit] Running org.apache.hadoop.hbase.TestInfoServers
    [junit] Tests run: 1, Failures: 0, Errors: 0, Time elapsed: 13.847 sec
    [junit] Running org.apache.hadoop.hbase.TestKeyValue
    [junit] Tests run: 8, Failures: 0, Errors: 0, Time elapsed: 0.056 sec
    [junit] Running org.apache.hadoop.hbase.TestMasterAdmin
    [junit] Tests run: 1, Failures: 0, Errors: 0, Time elapsed: 25.268 sec
    [junit] Running org.apache.hadoop.hbase.TestMergeMeta
    [junit] Tests run: 1, Failures: 0, Errors: 0, Time elapsed: 68.443 sec
    [junit] Running org.apache.hadoop.hbase.TestMergeTable
    [junit] Tests run: 1, Failures: 0, Errors: 0, Time elapsed: 73.422 sec
    [junit] Running org.apache.hadoop.hbase.TestMultiParallelPut
    [junit] Tests run: 1, Failures: 0, Errors: 0, Time elapsed: 23.788 sec
    [junit] Running org.apache.hadoop.hbase.TestRegionRebalancing
    [junit] Tests run: 1, Failures: 0, Errors: 0, Time elapsed: 38.187 sec
    [junit] Running org.apache.hadoop.hbase.TestScanMultipleVersions
    [junit] Tests run: 1, Failures: 0, Errors: 0, Time elapsed: 13.889 sec
    [junit] Running org.apache.hadoop.hbase.TestSerialization
    [junit] Tests run: 20, Failures: 0, Errors: 0, Time elapsed: 0.34 sec
    [junit] Running org.apache.hadoop.hbase.TestTable
    [junit] Tests run: 4, Failures: 0, Errors: 2, Time elapsed: 141.991 sec
    [junit] Test org.apache.hadoop.hbase.TestTable FAILED
    [junit] Running org.apache.hadoop.hbase.TestZooKeeper
    [junit] Tests run: 6, Failures: 0, Errors: 4, Time elapsed: 178.577 sec
    [junit] Test org.apache.hadoop.hbase.TestZooKeeper FAILED
    [junit] Running org.apache.hadoop.hbase.client.TestBatchUpdate
    [junit] Tests run: 4, Failures: 0, Errors: 2, Time elapsed: 116.589 sec
    [junit] Test org.apache.hadoop.hbase.client.TestBatchUpdate FAILED
    [junit] Running org.apache.hadoop.hbase.client.TestClient
    [junit] Tests run: 11, Failures: 0, Errors: 9, Time elapsed: 133.208 sec
    [junit] Test org.apache.hadoop.hbase.client.TestClient FAILED
    [junit] Running org.apache.hadoop.hbase.client.TestForceSplit
    [junit] Tests run: 1, Failures: 0, Errors: 0, Time elapsed: 38.982 sec
    [junit] Running org.apache.hadoop.hbase.client.TestGet
    [junit] Tests run: 2, Failures: 0, Errors: 0, Time elapsed: 58.583 sec
    [junit] Running org.apache.hadoop.hbase.client.TestGetRowVersions
    [junit] Tests run: 1, Failures: 0, Errors: 0, Time elapsed: 42.294 sec
    [junit] Running org.apache.hadoop.hbase.client.TestHBaseAdmin
    [junit] Tests run: 3, Failures: 0, Errors: 1, Time elapsed: 184.851 sec
    [junit] Test org.apache.hadoop.hbase.client.TestHBaseAdmin FAILED
    [junit] Running org.apache.hadoop.hbase.client.TestHTable
    [junit] Tests run: 6, Failures: 0, Errors: 4, Time elapsed: 114.447 sec
    [junit] Test org.apache.hadoop.hbase.client.TestHTable FAILED
    [junit] Running org.apache.hadoop.hbase.client.TestHTablePool
    [junit] Tests run: 4, Failures: 0, Errors: 0, Time elapsed: 0.191 sec
    [junit] Running org.apache.hadoop.hbase.client.TestListTables
    [junit] Tests run: 1, Failures: 0, Errors: 0, Time elapsed: 60.661 sec
    [junit] Running org.apache.hadoop.hbase.client.TestOldAPIGetRowVersions
    [junit] Tests run: 1, Failures: 0, Errors: 0, Time elapsed: 18.051 sec
    [junit] Running org.apache.hadoop.hbase.client.TestOldAPIHTable
    [junit] Tests run: 5, Failures: 0, Errors: 3, Time elapsed: 132.914 sec
    [junit] Test org.apache.hadoop.hbase.client.TestOldAPIHTable FAILED
    [junit] Running org.apache.hadoop.hbase.client.TestOldAPITimestamp
    [junit] Tests run: 1, Failures: 0, Errors: 0, Time elapsed: 19.39 sec
    [junit] Running org.apache.hadoop.hbase.client.TestPut
    [junit] Tests run: 5, Failures: 0, Errors: 3, Time elapsed: 123.795 sec
    [junit] Test org.apache.hadoop.hbase.client.TestPut FAILED
    [junit] Running org.apache.hadoop.hbase.client.TestScannerTimeout
    [junit] Tests run: 1, Failures: 0, Errors: 0, Time elapsed: 53.73 sec
    [junit] Running org.apache.hadoop.hbase.client.TestScannerTimes
    [junit] Tests run: 1, Failures: 0, Errors: 0, Time elapsed: 39.415 sec
    [junit] Running org.apache.hadoop.hbase.client.TestTimestamp
    [junit] Tests run: 1, Failures: 0, Errors: 0, Time elapsed: 39.196 sec
    [junit] Running org.apache.hadoop.hbase.filter.TestColumnPaginationFilter
    [junit] Tests run: 1, Failures: 0, Errors: 0, Time elapsed: 0.1 sec
    [junit] Running org.apache.hadoop.hbase.filter.TestFilter
    [junit] Tests run: 15, Failures: 0, Errors: 0, Time elapsed: 2.143 sec
    [junit] Running org.apache.hadoop.hbase.filter.TestFilterAcrossRegions
    [junit] Tests run: 1, Failures: 0, Errors: 0, Time elapsed: 0.557 sec
    [junit] Running org.apache.hadoop.hbase.filter.TestFilterList
    [junit] Tests run: 4, Failures: 0, Errors: 0, Time elapsed: 0.168 sec
    [junit] Running org.apache.hadoop.hbase.filter.TestInclusiveStopFilter
    [junit] Tests run: 2, Failures: 0, Errors: 0, Time elapsed: 0.044 sec
    [junit] Running org.apache.hadoop.hbase.filter.TestPageFilter
    [junit] Tests run: 2, Failures: 0, Errors: 0, Time elapsed: 0.043 sec
    [junit] Running org.apache.hadoop.hbase.filter.TestPrefixFilter
    [junit] Tests run: 3, Failures: 0, Errors: 0, Time elapsed: 0.048 sec
    [junit] Running org.apache.hadoop.hbase.filter.TestSingleColumnValueFilter
    [junit] Tests run: 2, Failures: 0, Errors: 0, Time elapsed: 0.136 sec
    [junit] Running org.apache.hadoop.hbase.io.TestHbaseObjectWritable
    [junit] Tests run: 1, Failures: 0, Errors: 0, Time elapsed: 0.177 sec
    [junit] Running org.apache.hadoop.hbase.io.TestHeapSize
    [junit] Tests run: 2, Failures: 0, Errors: 0, Time elapsed: 0.08 sec
    [junit] Running org.apache.hadoop.hbase.io.TestImmutableBytesWritable
    [junit] Tests run: 1, Failures: 0, Errors: 0, Time elapsed: 0.047 sec
    [junit] Running org.apache.hadoop.hbase.io.hfile.TestCachedBlockQueue
    [junit] Tests run: 2, Failures: 0, Errors: 0, Time elapsed: 0.096 sec
    [junit] Running org.apache.hadoop.hbase.io.hfile.TestHFile
    [junit] Tests run: 7, Failures: 0, Errors: 0, Time elapsed: 0.433 sec
    [junit] Running org.apache.hadoop.hbase.io.hfile.TestHFilePerformance
    [junit] Tests run: 1, Failures: 0, Errors: 0, Time elapsed: 5.911 sec
    [junit] Running org.apache.hadoop.hbase.io.hfile.TestHFileSeek
    [junit] Tests run: 1, Failures: 0, Errors: 0, Time elapsed: 5.357 sec
    [junit] Running org.apache.hadoop.hbase.io.hfile.TestLruBlockCache
    [junit] Tests run: 7, Failures: 0, Errors: 0, Time elapsed: 1.137 sec
    [junit] Running org.apache.hadoop.hbase.io.hfile.TestSeekTo
    [junit] Tests run: 3, Failures: 0, Errors: 0, Time elapsed: 0.332 sec
    [junit] Running org.apache.hadoop.hbase.mapred.TestTableIndex
    [junit] Tests run: 1, Failures: 0, Errors: 0, Time elapsed: 77.495 sec
    [junit] Running org.apache.hadoop.hbase.mapred.TestTableMapReduce
    [junit] Tests run: 1, Failures: 0, Errors: 0, Time elapsed: 59.144 sec
    [junit] Running org.apache.hadoop.hbase.mapreduce.TestHFileOutputFormat
    [junit] Tests run: 1, Failures: 0, Errors: 0, Time elapsed: 5.502 sec
    [junit] Running org.apache.hadoop.hbase.mapreduce.TestTableIndex
    [junit] Tests run: 1, Failures: 0, Errors: 0, Time elapsed: 54.376 sec
    [junit] Running org.apache.hadoop.hbase.mapreduce.TestTableMapReduce
    [junit] Tests run: 1, Failures: 0, Errors: 0, Time elapsed: 51.384 sec
    [junit] Running org.apache.hadoop.hbase.mapreduce.TestTimeRangeMapRed
    [junit] Tests run: 1, Failures: 0, Errors: 0, Time elapsed: 33.369 sec
    [junit] Running org.apache.hadoop.hbase.master.TestMasterTransistions
    [junit] Tests run: 1, Failures: 0, Errors: 1, Time elapsed: 64.169 sec
    [junit] Test org.apache.hadoop.hbase.master.TestMasterTransistions FAILED
    [junit] Running org.apache.hadoop.hbase.master.TestMinimumServerCount
    [junit] Tests run: 1, Failures: 0, Errors: 0, Time elapsed: 80.287 sec
    [junit] Running org.apache.hadoop.hbase.master.TestRegionManager
    [junit] Tests run: 1, Failures: 0, Errors: 0, Time elapsed: 14.276 sec
    [junit] Running org.apache.hadoop.hbase.master.TestRegionServerOperationQueue
    [junit] Tests run: 1, Failures: 0, Errors: 1, Time elapsed: 0.044 sec
    [junit] Test org.apache.hadoop.hbase.master.TestRegionServerOperationQueue FAILED
    [junit] Running org.apache.hadoop.hbase.metrics.TestMetricsMBeanBase
    [junit] Tests run: 2, Failures: 0, Errors: 0, Time elapsed: 0.118 sec
    [junit] Running org.apache.hadoop.hbase.regionserver.TestCompaction
    [junit] Tests run: 2, Failures: 0, Errors: 0, Time elapsed: 58.829 sec
    [junit] Running org.apache.hadoop.hbase.regionserver.TestDeleteCompare
    [junit] Tests run: 4, Failures: 0, Errors: 0, Time elapsed: 0.12 sec
    [junit] Running org.apache.hadoop.hbase.regionserver.TestExplicitColumnTracker
    [junit] Tests run: 3, Failures: 0, Errors: 0, Time elapsed: 0.613 sec
    [junit] Running org.apache.hadoop.hbase.regionserver.TestGetClosestAtOrBefore
    [junit] Tests run: 3, Failures: 0, Errors: 0, Time elapsed: 13.368 sec
    [junit] Running org.apache.hadoop.hbase.regionserver.TestGetDeleteTracker
    [junit] Tests run: 7, Failures: 0, Errors: 0, Time elapsed: 0.041 sec
    [junit] Running org.apache.hadoop.hbase.regionserver.TestHLog
    [junit] Tests run: 3, Failures: 0, Errors: 0, Time elapsed: 14.407 sec
    [junit] Running org.apache.hadoop.hbase.regionserver.TestHRegion
    [junit] Tests run: 43, Failures: 0, Errors: 0, Time elapsed: 134.323 sec
    [junit] Running org.apache.hadoop.hbase.regionserver.TestHRegionInfo
    [junit] Tests run: 1, Failures: 0, Errors: 0, Time elapsed: 0.162 sec
    [junit] Running org.apache.hadoop.hbase.regionserver.TestKeyValueHeap
    [junit] Tests run: 3, Failures: 0, Errors: 0, Time elapsed: 0.03 sec
    [junit] Running org.apache.hadoop.hbase.regionserver.TestKeyValueScanFixture
    [junit] Tests run: 1, Failures: 0, Errors: 0, Time elapsed: 0.113 sec
    [junit] Running org.apache.hadoop.hbase.regionserver.TestKeyValueSkipListSet
    [junit] Tests run: 4, Failures: 0, Errors: 0, Time elapsed: 0.044 sec
    [junit] Running org.apache.hadoop.hbase.regionserver.TestLogRolling
    [junit] Tests run: 2, Failures: 0, Errors: 0, Time elapsed: 139.486 sec
    [junit] Running org.apache.hadoop.hbase.regionserver.TestLruHashMap
    [junit] Tests run: 9, Failures: 0, Errors: 0, Time elapsed: 1.941 sec
    [junit] Running org.apache.hadoop.hbase.regionserver.TestMemStore
    [junit] Tests run: 20, Failures: 0, Errors: 0, Time elapsed: 0.684 sec
    [junit] Running org.apache.hadoop.hbase.regionserver.TestMinorCompactingStoreScanner
    [junit] Tests run: 2, Failures: 0, Errors: 0, Time elapsed: 0.109 sec
    [junit] Running org.apache.hadoop.hbase.regionserver.TestQueryMatcher
    [junit] Tests run: 4, Failures: 0, Errors: 0, Time elapsed: 0.033 sec
    [junit] Running org.apache.hadoop.hbase.regionserver.TestReadWriteConsistencyControl
    [junit] Tests run: 1, Failures: 0, Errors: 0, Time elapsed: 10.147 sec
    [junit] Running org.apache.hadoop.hbase.regionserver.TestScanDeleteTracker
    [junit] Tests run: 6, Failures: 0, Errors: 0, Time elapsed: 0.023 sec
    [junit] Running org.apache.hadoop.hbase.regionserver.TestScanWildcardColumnTracker
    [junit] Tests run: 2, Failures: 0, Errors: 0, Time elapsed: 0.202 sec
    [junit] Running org.apache.hadoop.hbase.regionserver.TestScanner
    [junit] Tests run: 6, Failures: 0, Errors: 0, Time elapsed: 31.292 sec
    [junit] Running org.apache.hadoop.hbase.regionserver.TestStore
    [junit] Tests run: 5, Failures: 0, Errors: 0, Time elapsed: 0.838 sec
    [junit] Running org.apache.hadoop.hbase.regionserver.TestStoreFile
    [junit] Tests run: 2, Failures: 0, Errors: 0, Time elapsed: 17.782 sec
    [junit] Running org.apache.hadoop.hbase.regionserver.TestStoreScanner
    [junit] Tests run: 13, Failures: 0, Errors: 0, Time elapsed: 0.124 sec
    [junit] Running org.apache.hadoop.hbase.regionserver.TestWideScanner
    [junit] Tests run: 1, Failures: 0, Errors: 0, Time elapsed: 35.909 sec
    [junit] Running org.apache.hadoop.hbase.regionserver.TestWildcardColumnTracker
    [junit] Tests run: 6, Failures: 0, Errors: 0, Time elapsed: 0.401 sec
    [junit] Running org.apache.hadoop.hbase.thrift.TestThriftServer
    [junit] Tests run: 1, Failures: 0, Errors: 0, Time elapsed: 101.707 sec
    [junit] Running org.apache.hadoop.hbase.util.TestBase64
    [junit] Tests run: 1, Failures: 0, Errors: 0, Time elapsed: 0.102 sec
    [junit] Running org.apache.hadoop.hbase.util.TestBytes
    [junit] Tests run: 11, Failures: 0, Errors: 0, Time elapsed: 0.081 sec
    [junit] Running org.apache.hadoop.hbase.util.TestKeying
    [junit] Tests run: 1, Failures: 0, Errors: 0, Time elapsed: 0.053 sec
    [junit] Running org.apache.hadoop.hbase.util.TestMergeTool
    [junit] Tests run: 1, Failures: 0, Errors: 0, Time elapsed: 12.199 sec
    [junit] Running org.apache.hadoop.hbase.util.TestMigration
    [junit] Tests run: 1, Failures: 1, Errors: 0, Time elapsed: 0.042 sec
    [junit] Test org.apache.hadoop.hbase.util.TestMigration FAILED
    [junit] Running org.apache.hadoop.hbase.util.TestPair
    [junit] Tests run: 9, Failures: 0, Errors: 0, Time elapsed: 0.248 sec
    [junit] Running org.apache.hadoop.hbase.util.TestRootPath
    [junit] Tests run: 1, Failures: 0, Errors: 0, Time elapsed: 0.045 sec
    [junit] Running org.apache.hadoop.hbase.zookeeper.TestHQuorumPeer
    [junit] Tests run: 2, Failures: 0, Errors: 0, Time elapsed: 0.377 sec

BUILD FAILED
<http://hudson.zones.apache.org/hudson/job/hbase-020-branch/ws/trunk/build.xml>:516:
Tests failed!

Total time: 52 minutes 15 seconds
[locks-and-latches] Releasing all the locks
[locks-and-latches] All the locks released
Recording test results


Mime
View raw message