hbase-dev mailing list archives

Site index · List index
Message view « Date » · « Thread »
Top « Date » · « Thread »
From Ryan Rawson <ryano...@gmail.com>
Subject Re: Build failed in Hudson: HBase-Patch #1150
Date Tue, 09 Mar 2010 00:04:32 GMT
We are getting checksum errors on the build machine:

10/03/08 23:47:19 ERROR replication.ReplicationSink: Unable to accept
edit because
java.io.IOException: cannot get log reader
	at org.apache.hadoop.hbase.regionserver.wal.HLog.getReader(HLog.java:413)
	at org.apache.hadoop.hbase.regionserver.replication.ReplicationSink.run(ReplicationSink.java:165)
Caused by: org.apache.hadoop.fs.ChecksumException: Checksum error:
/blk_-1531007770660206103:of:/user/hudson/.replogs/vesta.apache.org,34798,1268092007516
at 0
	at org.apache.hadoop.fs.FSInputChecker.verifySum(FSInputChecker.java:278)


and

10/03/08 23:47:16 INFO fs.FSInputChecker: Found checksum error: b[0,
512]=53455106306f72672e6170616368652e6861646f6f702e68626173652e726567696f6e7365727665722e77616c2e484c6f674b6579206f72672e6170616368652e6861646f6f702e68626173652e4b657956616c7565000000000000366ce0ff2563d6756074dfbae0862824000000500000002e13746573742c2c313236383039323032333839320474657374000000000000000900000127402cdd7d00000000010000001e00000013000000030003726f770166726f7700000127402cdd7d04726f77ffffffff366ce0ff2563d6756074dfbae08628240000004a0000002e13746573742c2c313236383039323032333839320474657374000000000000000a00000127402cdf7700000000010000001800000010000000000003726f77016600000127402cdf770effffffff366ce0ff2563d6756074dfbae0862824000000510000002e13746573742c2c313236383039323032333839320474657374000000000000000c00000127402ce36900000000010000001f00000014000000030004000000000166726f7700000127402ce36904726f77000000510000002e13746573742c2c313236383039323032333839320474657374000000000000000d00000127402ce36900000000010000001f00000014000000030004000000010166726f7700000127402ce36904726f77000000510000002e13746573742c2c31
org.apache.hadoop.fs.ChecksumException: Checksum error:
/blk_-1531007770660206103:of:/user/hudson/.replogs/vesta.apache.org,34798,1268092007516
at 0
	at org.apache.hadoop.fs.FSInputChecker.verifySum(FSInputChecker.java:278)
	at org.apache.hadoop.fs.FSInputChecker.readChecksumChunk(FSInputChecker.java:242)


I'll give it a kick and see if it passes

On Mon, Mar 8, 2010 at 3:49 PM, Apache Hudson Server
<hudson@hudson.zones.apache.org> wrote:
> See <http://hudson.zones.apache.org/hudson/job/HBase-Patch/1150/changes>
>
> Changes:
>
> [rawson] Javadoc, copyright, static analysis cleanup. Bug fix in HConnectionManager.java,
code removal in Put.java.
>
> ------------------------------------------
> [...truncated 580 lines...]
> [WARNING] <http://hudson.zones.apache.org/hudson/job/HBase-Patch/ws/trunk/core/src/test/java/org/apache/hadoop/hbase/io/hfile/KVGenerator.java>:[72,12]
[deprecation] getSize() in org.apache.hadoop.io.BytesWritable has been deprecated
>
> [WARNING] <http://hudson.zones.apache.org/hudson/job/HBase-Patch/ws/trunk/core/src/test/java/org/apache/hadoop/hbase/io/hfile/KVGenerator.java>:[73,28]
[deprecation] get() in org.apache.hadoop.io.BytesWritable has been deprecated
>
> [WARNING] <http://hudson.zones.apache.org/hudson/job/HBase-Patch/ws/trunk/core/src/test/java/org/apache/hadoop/hbase/io/hfile/KVGenerator.java>:[73,50]
[deprecation] getSize() in org.apache.hadoop.io.BytesWritable has been deprecated
>
> [WARNING] <http://hudson.zones.apache.org/hudson/job/HBase-Patch/ws/trunk/core/src/test/java/org/apache/hadoop/hbase/io/hfile/KVGenerator.java>:[77,33]
[deprecation] get() in org.apache.hadoop.io.BytesWritable has been deprecated
>
> [WARNING] <http://hudson.zones.apache.org/hudson/job/HBase-Patch/ws/trunk/core/src/test/java/org/apache/hadoop/hbase/io/hfile/KVGenerator.java>:[88,33]
[deprecation] get() in org.apache.hadoop.io.BytesWritable has been deprecated
>
> [WARNING] <http://hudson.zones.apache.org/hudson/job/HBase-Patch/ws/trunk/core/src/test/java/org/apache/hadoop/hbase/mapred/TestTableMapReduce.java>:[126,4]
[deprecation] org.apache.hadoop.mapred.JobConf in org.apache.hadoop.mapred has been deprecated
>
> [WARNING] <http://hudson.zones.apache.org/hudson/job/HBase-Patch/ws/trunk/core/src/test/java/org/apache/hadoop/hbase/mapred/TestTableMapReduce.java>:[129,20]
[deprecation] org.apache.hadoop.mapred.JobConf in org.apache.hadoop.mapred has been deprecated
>
> [WARNING] <http://hudson.zones.apache.org/hudson/job/HBase-Patch/ws/trunk/core/src/test/java/org/apache/hadoop/hbase/mapred/TestTableMapReduce.java>:[132,6]
[deprecation] org.apache.hadoop.hbase.mapred.TableMapReduceUtil in org.apache.hadoop.hbase.mapred
has been deprecated
>
> [WARNING] <http://hudson.zones.apache.org/hudson/job/HBase-Patch/ws/trunk/core/src/test/java/org/apache/hadoop/hbase/mapred/TestTableMapReduce.java>:[136,8]
[deprecation] org.apache.hadoop.hbase.mapred.IdentityTableReduce in org.apache.hadoop.hbase.mapred
has been deprecated
>
> [WARNING] <http://hudson.zones.apache.org/hudson/job/HBase-Patch/ws/trunk/core/src/test/java/org/apache/hadoop/hbase/mapred/TestTableMapReduce.java>:[135,6]
[deprecation] org.apache.hadoop.hbase.mapred.TableMapReduceUtil in org.apache.hadoop.hbase.mapred
has been deprecated
>
> [INFO] [surefire:test {execution: default-test}]
> [INFO] Surefire report directory: <http://hudson.zones.apache.org/hudson/job/HBase-Patch/ws/trunk/core/target/surefire-reports>
>
> -------------------------------------------------------
>  T E S T S
> -------------------------------------------------------
> Running org.apache.hadoop.hbase.TestFullLogReconstruction
> Tests run: 1, Failures: 0, Errors: 0, Skipped: 0, Time elapsed: 146.201 sec
> Running org.apache.hadoop.hbase.TestSerialization
> Tests run: 18, Failures: 0, Errors: 0, Skipped: 0, Time elapsed: 10.947 sec
> Running org.apache.hadoop.hbase.TestZooKeeper
> Tests run: 4, Failures: 0, Errors: 0, Skipped: 0, Time elapsed: 114.691 sec
> Running org.apache.hadoop.hbase.regionserver.wal.TestLogRolling
> Tests run: 1, Failures: 0, Errors: 0, Skipped: 0, Time elapsed: 72.941 sec
> Running org.apache.hadoop.hbase.io.hfile.TestCachedBlockQueue
> Tests run: 2, Failures: 0, Errors: 0, Skipped: 0, Time elapsed: 0.096 sec
> Running org.apache.hadoop.hbase.regionserver.TestKeyValueHeap
> Tests run: 3, Failures: 0, Errors: 0, Skipped: 0, Time elapsed: 0.45 sec
> Running org.apache.hadoop.hbase.regionserver.TestStoreScanner
> Tests run: 13, Failures: 0, Errors: 0, Skipped: 0, Time elapsed: 0.116 sec
> Running org.apache.hadoop.hbase.TestHMsg
> Tests run: 2, Failures: 0, Errors: 0, Skipped: 0, Time elapsed: 0.062 sec
> Running org.apache.hadoop.hbase.filter.TestPrefixFilter
> Tests run: 3, Failures: 0, Errors: 0, Skipped: 0, Time elapsed: 0.041 sec
> Running org.apache.hadoop.hbase.util.TestKeying
> Tests run: 1, Failures: 0, Errors: 0, Skipped: 0, Time elapsed: 0.039 sec
> Running org.apache.hadoop.hbase.regionserver.TestScanner
> Tests run: 5, Failures: 0, Errors: 0, Skipped: 0, Time elapsed: 37.388 sec
> Running org.apache.hadoop.hbase.regionserver.TestHRegionInfo
> Tests run: 1, Failures: 0, Errors: 0, Skipped: 0, Time elapsed: 0.366 sec
> Running org.apache.hadoop.hbase.io.TestHeapSize
> Tests run: 2, Failures: 0, Errors: 0, Skipped: 0, Time elapsed: 0.125 sec
> Running org.apache.hadoop.hbase.regionserver.TestMinorCompactingStoreScanner
> Tests run: 2, Failures: 0, Errors: 0, Skipped: 0, Time elapsed: 0.103 sec
> Running org.apache.hadoop.hbase.TestInfoServers
> Tests run: 1, Failures: 0, Errors: 0, Skipped: 0, Time elapsed: 29.477 sec
> Running org.apache.hadoop.hbase.io.hfile.TestHFileSeek
> Tests run: 1, Failures: 0, Errors: 0, Skipped: 0, Time elapsed: 4.584 sec
> Running org.apache.hadoop.hbase.regionserver.TestStore
> Tests run: 5, Failures: 0, Errors: 0, Skipped: 0, Time elapsed: 1.08 sec
> Running org.apache.hadoop.hbase.zookeeper.TestHQuorumPeer
> Tests run: 2, Failures: 0, Errors: 0, Skipped: 0, Time elapsed: 0.424 sec
> Running org.apache.hadoop.hbase.io.hfile.TestHFilePerformance
> Tests run: 1, Failures: 0, Errors: 0, Skipped: 0, Time elapsed: 5.928 sec
> Running org.apache.hadoop.hbase.io.TestHbaseObjectWritable
> Tests run: 1, Failures: 0, Errors: 0, Skipped: 0, Time elapsed: 0.215 sec
> Running org.apache.hadoop.hbase.master.TestOldLogsCleaner
> Tests run: 1, Failures: 0, Errors: 0, Skipped: 0, Time elapsed: 0.801 sec
> Running org.apache.hadoop.hbase.thrift.TestThriftServer
> Tests run: 1, Failures: 0, Errors: 0, Skipped: 0, Time elapsed: 80.534 sec
> Running org.apache.hadoop.hbase.regionserver.TestQueryMatcher
> Tests run: 4, Failures: 0, Errors: 0, Skipped: 0, Time elapsed: 0.494 sec
> Running org.apache.hadoop.hbase.client.TestAdmin
> Tests run: 14, Failures: 0, Errors: 0, Skipped: 0, Time elapsed: 138.097 sec
> Running org.apache.hadoop.hbase.util.TestMergeTool
> Tests run: 1, Failures: 0, Errors: 0, Skipped: 0, Time elapsed: 26.853 sec
> Running org.apache.hadoop.hbase.TestCompare
> Tests run: 1, Failures: 0, Errors: 0, Skipped: 0, Time elapsed: 0.054 sec
> Running org.apache.hadoop.hbase.regionserver.TestExplicitColumnTracker
> Tests run: 3, Failures: 0, Errors: 0, Skipped: 0, Time elapsed: 0.837 sec
> Running org.apache.hadoop.hbase.regionserver.TestStoreReconstruction
> Tests run: 1, Failures: 0, Errors: 0, Skipped: 0, Time elapsed: 12.937 sec
> Running org.apache.hadoop.hbase.TestEmptyMetaInfo
> Tests run: 1, Failures: 0, Errors: 0, Skipped: 0, Time elapsed: 56.776 sec
> Running org.apache.hadoop.hbase.util.TestBase64
> Tests run: 1, Failures: 0, Errors: 0, Skipped: 0, Time elapsed: 0.092 sec
> Running org.apache.hadoop.hbase.regionserver.TestMemStore
> Tests run: 17, Failures: 0, Errors: 0, Skipped: 0, Time elapsed: 0.306 sec
> Running org.apache.hadoop.hbase.io.hfile.TestLruBlockCache
> Tests run: 7, Failures: 0, Errors: 0, Skipped: 0, Time elapsed: 1.147 sec
> Running org.apache.hadoop.hbase.regionserver.TestDeleteCompare
> Tests run: 4, Failures: 0, Errors: 0, Skipped: 0, Time elapsed: 0.102 sec
> Running org.apache.hadoop.hbase.regionserver.TestScanWildcardColumnTracker
> Tests run: 2, Failures: 0, Errors: 0, Skipped: 0, Time elapsed: 0.388 sec
> Running org.apache.hadoop.hbase.regionserver.TestKeyValueSkipListSet
> Tests run: 4, Failures: 0, Errors: 0, Skipped: 0, Time elapsed: 0.103 sec
> Running org.apache.hadoop.hbase.io.hfile.TestSeekTo
> Tests run: 3, Failures: 0, Errors: 0, Skipped: 0, Time elapsed: 0.521 sec
> Running org.apache.hadoop.hbase.filter.TestPageFilter
> Tests run: 2, Failures: 0, Errors: 0, Skipped: 0, Time elapsed: 0.04 sec
> Running org.apache.hadoop.hbase.TestMergeMeta
> Tests run: 1, Failures: 0, Errors: 0, Skipped: 0, Time elapsed: 53.3 sec
> Running org.apache.hadoop.hbase.TestKeyValue
> Tests run: 7, Failures: 0, Errors: 0, Skipped: 0, Time elapsed: 0.106 sec
> Running org.apache.hadoop.hbase.mapreduce.TestTableMapReduce
> Tests run: 1, Failures: 0, Errors: 0, Skipped: 0, Time elapsed: 59.426 sec
> Running org.apache.hadoop.hbase.client.TestFromClientSide
> Tests run: 33, Failures: 0, Errors: 0, Skipped: 4, Time elapsed: 247.297 sec
> Running org.apache.hadoop.hbase.regionserver.TestCompaction
> Tests run: 2, Failures: 0, Errors: 0, Skipped: 0, Time elapsed: 16.906 sec
> Running org.apache.hadoop.hbase.client.TestHTablePool
> Tests run: 4, Failures: 0, Errors: 0, Skipped: 0, Time elapsed: 0.486 sec
> Running org.apache.hadoop.hbase.TestMultiParallelPut
> Tests run: 1, Failures: 0, Errors: 0, Skipped: 0, Time elapsed: 49.433 sec
> Running org.apache.hadoop.hbase.master.TestRegionManager
> Tests run: 1, Failures: 0, Errors: 0, Skipped: 0, Time elapsed: 33.048 sec
> Running org.apache.hadoop.hbase.mapreduce.TestTimeRangeMapRed
> Tests run: 1, Failures: 0, Errors: 0, Skipped: 0, Time elapsed: 42.634 sec
> Running org.apache.hadoop.hbase.filter.TestSingleColumnValueFilter
> Tests run: 2, Failures: 0, Errors: 0, Skipped: 0, Time elapsed: 0.136 sec
> Running org.apache.hadoop.hbase.master.TestMinimumServerCount
> Tests run: 1, Failures: 0, Errors: 0, Skipped: 0, Time elapsed: 42.538 sec
> Running org.apache.hadoop.hbase.mapreduce.TestSimpleTotalOrderPartitioner
> Tests run: 1, Failures: 0, Errors: 0, Skipped: 0, Time elapsed: 0.332 sec
> Running org.apache.hadoop.hbase.regionserver.TestGetDeleteTracker
> Tests run: 7, Failures: 0, Errors: 0, Skipped: 0, Time elapsed: 0.619 sec
> Running org.apache.hadoop.hbase.mapreduce.TestHFileOutputFormat
> Tests run: 1, Failures: 0, Errors: 0, Skipped: 0, Time elapsed: 5.744 sec
> Running org.apache.hadoop.hbase.regionserver.TestScanDeleteTracker
> Tests run: 6, Failures: 0, Errors: 0, Skipped: 0, Time elapsed: 0.571 sec
> Running org.apache.hadoop.hbase.metrics.TestMetricsMBeanBase
> Tests run: 2, Failures: 0, Errors: 0, Skipped: 0, Time elapsed: 0.107 sec
> Running org.apache.hadoop.hbase.mapreduce.TestTableInputFormatScan
> Tests run: 11, Failures: 0, Errors: 0, Skipped: 0, Time elapsed: 95.303 sec
> Running org.apache.hadoop.hbase.filter.TestFilterList
> Tests run: 4, Failures: 0, Errors: 0, Skipped: 0, Time elapsed: 0.15 sec
> Running org.apache.hadoop.hbase.regionserver.TestHRegion
> Tests run: 37, Failures: 0, Errors: 0, Skipped: 0, Time elapsed: 8.148 sec
> Running org.apache.hadoop.hbase.TestRegionRebalancing
> Tests run: 1, Failures: 0, Errors: 0, Skipped: 0, Time elapsed: 63.945 sec
> Running org.apache.hadoop.hbase.filter.TestInclusiveStopFilter
> Tests run: 2, Failures: 0, Errors: 0, Skipped: 0, Time elapsed: 0.041 sec
> Running org.apache.hadoop.hbase.filter.TestSingleColumnValueExcludeFilter
> Tests run: 1, Failures: 0, Errors: 0, Skipped: 0, Time elapsed: 0.103 sec
> Running org.apache.hadoop.hbase.util.TestRootPath
> Tests run: 1, Failures: 0, Errors: 0, Skipped: 0, Time elapsed: 0.096 sec
> Running org.apache.hadoop.hbase.mapred.TestTableMapReduce
> Tests run: 1, Failures: 0, Errors: 0, Skipped: 0, Time elapsed: 54.124 sec
> Running org.apache.hadoop.hbase.regionserver.TestKeyValueScanFixture
> Tests run: 1, Failures: 0, Errors: 0, Skipped: 0, Time elapsed: 0.097 sec
> Running org.apache.hadoop.hbase.util.TestBytes
> Tests run: 8, Failures: 0, Errors: 0, Skipped: 0, Time elapsed: 0.049 sec
> Running org.apache.hadoop.hbase.regionserver.TestWildcardColumnTracker
> Tests run: 6, Failures: 0, Errors: 0, Skipped: 0, Time elapsed: 0.85 sec
> Running org.apache.hadoop.hbase.regionserver.TestStoreFile
> Tests run: 2, Failures: 0, Errors: 0, Skipped: 0, Time elapsed: 27.354 sec
> Running org.apache.hadoop.hbase.client.TestGetRowVersions
> Tests run: 1, Failures: 0, Errors: 0, Skipped: 0, Time elapsed: 59.983 sec
> Running org.apache.hadoop.hbase.io.hfile.TestHFile
> Tests run: 7, Failures: 0, Errors: 0, Skipped: 0, Time elapsed: 0.846 sec
> Running org.apache.hadoop.hbase.filter.TestFilter
> Tests run: 14, Failures: 0, Errors: 0, Skipped: 0, Time elapsed: 3.092 sec
> Running org.apache.hadoop.hbase.regionserver.TestWideScanner
> Tests run: 1, Failures: 0, Errors: 0, Skipped: 0, Time elapsed: 6.198 sec
> Running org.apache.hadoop.hbase.regionserver.wal.TestHLog
> Tests run: 4, Failures: 0, Errors: 0, Skipped: 0, Time elapsed: 43.608 sec
> Running org.apache.hadoop.hbase.client.TestTimestamp
> Tests run: 1, Failures: 0, Errors: 0, Skipped: 0, Time elapsed: 17.656 sec
> Running org.apache.hadoop.hbase.TestScanMultipleVersions
> Tests run: 1, Failures: 0, Errors: 0, Skipped: 0, Time elapsed: 33.27 sec
> Running org.apache.hadoop.hbase.TestMergeTable
> Tests run: 1, Failures: 0, Errors: 0, Skipped: 0, Time elapsed: 67.227 sec
> Running org.apache.hadoop.hbase.regionserver.TestGetClosestAtOrBefore
> Tests run: 3, Failures: 0, Errors: 0, Skipped: 0, Time elapsed: 23.997 sec
>
> Results :
>
> Tests run: 315, Failures: 0, Errors: 0, Skipped: 4
>
> [INFO] [jar:jar {execution: default-jar}]
> [INFO] Building jar: <http://hudson.zones.apache.org/hudson/job/HBase-Patch/ws/trunk/core/target/hbase-core-0.21.0-SNAPSHOT.jar>
> [INFO] [jar:test-jar {execution: default}]
> [INFO] Building jar: <http://hudson.zones.apache.org/hudson/job/HBase-Patch/ws/trunk/core/target/hbase-core-0.21.0-SNAPSHOT-tests.jar>
> [INFO] [source:jar-no-fork {execution: attach-sources}]
> [INFO] Building jar: <http://hudson.zones.apache.org/hudson/job/HBase-Patch/ws/trunk/core/target/hbase-core-0.21.0-SNAPSHOT-sources.jar>
> [INFO] [install:install {execution: default-install}]
> [INFO] Installing <http://hudson.zones.apache.org/hudson/job/HBase-Patch/ws/trunk/core/target/hbase-core-0.21.0-SNAPSHOT.jar>
to /home/hudson/.m2/repository/org/apache/hbase/hbase-core/0.21.0-SNAPSHOT/hbase-core-0.21.0-SNAPSHOT.jar
> [INFO] Installing <http://hudson.zones.apache.org/hudson/job/HBase-Patch/ws/trunk/core/target/hbase-core-0.21.0-SNAPSHOT-tests.jar>
to /home/hudson/.m2/repository/org/apache/hbase/hbase-core/0.21.0-SNAPSHOT/hbase-core-0.21.0-SNAPSHOT-tests.jar
> [INFO] Installing <http://hudson.zones.apache.org/hudson/job/HBase-Patch/ws/trunk/core/target/hbase-core-0.21.0-SNAPSHOT-sources.jar>
to /home/hudson/.m2/repository/org/apache/hbase/hbase-core/0.21.0-SNAPSHOT/hbase-core-0.21.0-SNAPSHOT-sources.jar
> [INFO] ------------------------------------------------------------------------
> [INFO] Building HBase Contrib
> [INFO]    task-segment: [clean, install]
> [INFO] ------------------------------------------------------------------------
> [INFO] [clean:clean {execution: default-clean}]
> [INFO] [site:attach-descriptor {execution: default-attach-descriptor}]
> [INFO] [install:install {execution: default-install}]
> [INFO] Installing <http://hudson.zones.apache.org/hudson/job/HBase-Patch/ws/trunk/contrib/pom.xml>
to /home/hudson/.m2/repository/org/apache/hbase/hbase-contrib/0.21.0-SNAPSHOT/hbase-contrib-0.21.0-SNAPSHOT.pom
> [INFO] ------------------------------------------------------------------------
> [INFO] Building HBase Contrib - Multi Datacenter Replication
> [INFO]    task-segment: [clean, install]
> [INFO] ------------------------------------------------------------------------
> [INFO] [clean:clean {execution: default-clean}]
> [INFO] Deleting <http://hudson.zones.apache.org/hudson/job/HBase-Patch/ws/trunk/contrib/mdc_replication/target>
> [INFO] [resources:resources {execution: default-resources}]
> [INFO] Using 'UTF-8' encoding to copy filtered resources.
> [INFO] skip non existing resourceDirectory <http://hudson.zones.apache.org/hudson/job/HBase-Patch/ws/trunk/contrib/mdc_replication/src/main/resources>
> [INFO] [compiler:compile {execution: default-compile}]
> [INFO] Compiling 8 source files to <http://hudson.zones.apache.org/hudson/job/HBase-Patch/ws/trunk/contrib/mdc_replication/target/classes>
> [INFO] [resources:testResources {execution: default-testResources}]
> [INFO] Using 'UTF-8' encoding to copy filtered resources.
> [INFO] skip non existing resourceDirectory <http://hudson.zones.apache.org/hudson/job/HBase-Patch/ws/trunk/contrib/mdc_replication/src/test/resources>
> [INFO] [compiler:testCompile {execution: default-testCompile}]
> [INFO] Compiling 2 source files to <http://hudson.zones.apache.org/hudson/job/HBase-Patch/ws/trunk/contrib/mdc_replication/target/test-classes>
> [INFO] [surefire:test {execution: default-test}]
> [INFO] Surefire report directory: <http://hudson.zones.apache.org/hudson/job/HBase-Patch/ws/trunk/contrib/mdc_replication/target/surefire-reports>
>
> -------------------------------------------------------
>  T E S T S
> -------------------------------------------------------
> Running org.apache.hadoop.hbase.replication.TestReplication
> Tests run: 4, Failures: 1, Errors: 3, Skipped: 0, Time elapsed: 156.418 sec <<<
FAILURE!
> Running org.apache.hadoop.hbase.regionserver.replication.TestReplicationSink
> Tests run: 5, Failures: 0, Errors: 0, Skipped: 0, Time elapsed: 32.977 sec
>
> Results :
>
> Failed tests:
>
> Tests in error:
>
> Tests run: 9, Failures: 1, Errors: 3, Skipped: 0
>
> [INFO] ------------------------------------------------------------------------
> [ERROR] BUILD FAILURE
> [INFO] ------------------------------------------------------------------------
> [INFO] There are test failures.
>
> Please refer to <http://hudson.zones.apache.org/hudson/job/HBase-Patch/ws/trunk/contrib/mdc_replication/target/surefire-reports>
for the individual test results.
> [INFO] ------------------------------------------------------------------------
> [INFO] For more information, run Maven with the -e switch
> [INFO] ------------------------------------------------------------------------
> [INFO] Total time: 33 minutes 58 seconds
> [INFO] Finished at: Mon Mar 08 23:49:46 UTC 2010
> [INFO] Final Memory: 49M/94M
> [INFO] ------------------------------------------------------------------------
> [locks-and-latches] Releasing all the locks
> [locks-and-latches] All the locks released
> Archiving artifacts
> Recording test results
>
>

Mime
View raw message