hbase-dev mailing list archives

Site index · List index
Message view « Date » · « Thread »
Top « Date » · « Thread »
From Apache Hudson Server <hud...@hudson.zones.apache.org>
Subject Build failed in Hudson: HBase-Patch #1134
Date Mon, 01 Mar 2010 23:58:06 GMT
See <http://hudson.zones.apache.org/hudson/job/HBase-Patch/1134/changes>

Changes:

[jdcryans] HBASE-2245  Unnecessary call to syncWal(region); in HRegionServer 
            (Benoit Sigoure via JD)
HBASE-2246  Add a getConfiguration method to HTableInterface
            (Benoit Sigoure via JD)

------------------------------------------
[...truncated 607 lines...]
Tests run: 1, Failures: 0, Errors: 0, Skipped: 0, Time elapsed: 16.089 sec
Running org.apache.hadoop.hbase.regionserver.wal.TestHLog
Tests run: 4, Failures: 0, Errors: 0, Skipped: 0, Time elapsed: 54.864 sec
Running org.apache.hadoop.hbase.client.TestTimestamp
Tests run: 1, Failures: 0, Errors: 0, Skipped: 0, Time elapsed: 17.483 sec
Running org.apache.hadoop.hbase.TestScanMultipleVersions
Tests run: 1, Failures: 0, Errors: 0, Skipped: 0, Time elapsed: 47.348 sec
Running org.apache.hadoop.hbase.TestMergeTable
Tests run: 1, Failures: 0, Errors: 0, Skipped: 0, Time elapsed: 44.09 sec
Running org.apache.hadoop.hbase.regionserver.TestGetClosestAtOrBefore
Tests run: 3, Failures: 0, Errors: 0, Skipped: 0, Time elapsed: 17.24 sec

Results :

Tests run: 315, Failures: 0, Errors: 0, Skipped: 4

[INFO] [jar:jar {execution: default-jar}]
[INFO] Building jar: <http://hudson.zones.apache.org/hudson/job/HBase-Patch/ws/trunk/core/target/hbase-core-0.21.0-SNAPSHOT.jar>
[INFO] [jar:test-jar {execution: default}]
[INFO] Building jar: <http://hudson.zones.apache.org/hudson/job/HBase-Patch/ws/trunk/core/target/hbase-core-0.21.0-SNAPSHOT-tests.jar>
[INFO] [source:jar-no-fork {execution: attach-sources}]
[INFO] Building jar: <http://hudson.zones.apache.org/hudson/job/HBase-Patch/ws/trunk/core/target/hbase-core-0.21.0-SNAPSHOT-sources.jar>
[INFO] [install:install {execution: default-install}]
[INFO] Installing <http://hudson.zones.apache.org/hudson/job/HBase-Patch/ws/trunk/core/target/hbase-core-0.21.0-SNAPSHOT.jar>
to /home/hudson/.m2/repository/org/apache/hbase/hbase-core/0.21.0-SNAPSHOT/hbase-core-0.21.0-SNAPSHOT.jar
[INFO] Installing <http://hudson.zones.apache.org/hudson/job/HBase-Patch/ws/trunk/core/target/hbase-core-0.21.0-SNAPSHOT-tests.jar>
to /home/hudson/.m2/repository/org/apache/hbase/hbase-core/0.21.0-SNAPSHOT/hbase-core-0.21.0-SNAPSHOT-tests.jar
[INFO] Installing <http://hudson.zones.apache.org/hudson/job/HBase-Patch/ws/trunk/core/target/hbase-core-0.21.0-SNAPSHOT-sources.jar>
to /home/hudson/.m2/repository/org/apache/hbase/hbase-core/0.21.0-SNAPSHOT/hbase-core-0.21.0-SNAPSHOT-sources.jar
[INFO] ------------------------------------------------------------------------
[INFO] Building HBase Contrib
[INFO]    task-segment: [clean, install]
[INFO] ------------------------------------------------------------------------
[INFO] [clean:clean {execution: default-clean}]
[INFO] [site:attach-descriptor {execution: default-attach-descriptor}]
[INFO] [install:install {execution: default-install}]
[INFO] Installing <http://hudson.zones.apache.org/hudson/job/HBase-Patch/ws/trunk/contrib/pom.xml>
to /home/hudson/.m2/repository/org/apache/hbase/hbase-contrib/0.21.0-SNAPSHOT/hbase-contrib-0.21.0-SNAPSHOT.pom
[INFO] ------------------------------------------------------------------------
[INFO] Building HBase Contrib - Multi Datacenter Replication
[INFO]    task-segment: [clean, install]
[INFO] ------------------------------------------------------------------------
[INFO] [clean:clean {execution: default-clean}]
[INFO] Deleting directory <http://hudson.zones.apache.org/hudson/job/HBase-Patch/ws/trunk/contrib/mdc_replication/target>
[INFO] [resources:resources {execution: default-resources}]
[INFO] Using 'UTF-8' encoding to copy filtered resources.
[INFO] skip non existing resourceDirectory <http://hudson.zones.apache.org/hudson/job/HBase-Patch/ws/trunk/contrib/mdc_replication/src/main/resources>
[INFO] [compiler:compile {execution: default-compile}]
[INFO] Compiling 8 source files to <http://hudson.zones.apache.org/hudson/job/HBase-Patch/ws/trunk/contrib/mdc_replication/target/classes>
[INFO] [resources:testResources {execution: default-testResources}]
[INFO] Using 'UTF-8' encoding to copy filtered resources.
[INFO] skip non existing resourceDirectory <http://hudson.zones.apache.org/hudson/job/HBase-Patch/ws/trunk/contrib/mdc_replication/src/test/resources>
[INFO] [compiler:testCompile {execution: default-testCompile}]
[INFO] Compiling 2 source files to <http://hudson.zones.apache.org/hudson/job/HBase-Patch/ws/trunk/contrib/mdc_replication/target/test-classes>
[INFO] [surefire:test {execution: default-test}]
[INFO] Surefire report directory: <http://hudson.zones.apache.org/hudson/job/HBase-Patch/ws/trunk/contrib/mdc_replication/target/surefire-reports>

-------------------------------------------------------
 T E S T S
-------------------------------------------------------
Running org.apache.hadoop.hbase.replication.TestReplication
Tests run: 2, Failures: 0, Errors: 0, Skipped: 0, Time elapsed: 59.957 sec
Running org.apache.hadoop.hbase.regionserver.replication.TestReplicationSink
Tests run: 5, Failures: 0, Errors: 0, Skipped: 0, Time elapsed: 57.401 sec

Results :

Tests run: 7, Failures: 0, Errors: 0, Skipped: 0

[INFO] [jar:jar {execution: default-jar}]
[INFO] Building jar: <http://hudson.zones.apache.org/hudson/job/HBase-Patch/ws/trunk/contrib/mdc_replication/target/hbase-contrib-mdc_replication-0.21.0-SNAPSHOT.jar>
[INFO] [install:install {execution: default-install}]
[INFO] Installing <http://hudson.zones.apache.org/hudson/job/HBase-Patch/ws/trunk/contrib/mdc_replication/target/hbase-contrib-mdc_replication-0.21.0-SNAPSHOT.jar>
to /home/hudson/.m2/repository/org/apache/hbase/hbase-contrib-mdc_replication/0.21.0-SNAPSHOT/hbase-contrib-mdc_replication-0.21.0-SNAPSHOT.jar
[INFO] ------------------------------------------------------------------------
[INFO] Building HBase Contrib - Stargate
[INFO]    task-segment: [clean, install]
[INFO] ------------------------------------------------------------------------
[INFO] [clean:clean {execution: default-clean}]
[INFO] Deleting directory <http://hudson.zones.apache.org/hudson/job/HBase-Patch/ws/trunk/contrib/stargate/target>
[INFO] [resources:resources {execution: default-resources}]
[INFO] Using 'UTF-8' encoding to copy filtered resources.
[INFO] Copying 10 resources
[INFO] [compiler:compile {execution: default-compile}]
[INFO] Compiling 56 source files to <http://hudson.zones.apache.org/hudson/job/HBase-Patch/ws/trunk/contrib/stargate/target/classes>
[INFO] [resources:testResources {execution: default-testResources}]
[INFO] Using 'UTF-8' encoding to copy filtered resources.
[INFO] skip non existing resourceDirectory <http://hudson.zones.apache.org/hudson/job/HBase-Patch/ws/trunk/contrib/stargate/src/test/resources>
[INFO] [compiler:testCompile {execution: default-testCompile}]
[INFO] Compiling 24 source files to <http://hudson.zones.apache.org/hudson/job/HBase-Patch/ws/trunk/contrib/stargate/target/test-classes>
[INFO] [surefire:test {execution: default-test}]
[INFO] Surefire report directory: <http://hudson.zones.apache.org/hudson/job/HBase-Patch/ws/trunk/contrib/stargate/target/surefire-reports>

-------------------------------------------------------
 T E S T S
-------------------------------------------------------
Running org.apache.hadoop.hbase.stargate.model.TestScannerModel
Tests run: 3, Failures: 0, Errors: 0, Skipped: 0, Time elapsed: 0.615 sec
Running org.apache.hadoop.hbase.stargate.model.TestTableSchemaModel
Tests run: 3, Failures: 0, Errors: 0, Skipped: 0, Time elapsed: 0.039 sec
Running org.apache.hadoop.hbase.stargate.model.TestStorageClusterVersionModel
Tests run: 2, Failures: 0, Errors: 0, Skipped: 0, Time elapsed: 0.013 sec
Running org.apache.hadoop.hbase.stargate.TestRowResource
Tests run: 8, Failures: 0, Errors: 0, Skipped: 0, Time elapsed: 16.531 sec
Running org.apache.hadoop.hbase.stargate.model.TestTableInfoModel
Tests run: 3, Failures: 0, Errors: 0, Skipped: 0, Time elapsed: 0.029 sec
Running org.apache.hadoop.hbase.stargate.TestStatusResource
Tests run: 2, Failures: 0, Errors: 0, Skipped: 0, Time elapsed: 0.057 sec
Running org.apache.hadoop.hbase.stargate.auth.TestHTableAuthenticator
Tests run: 4, Failures: 0, Errors: 0, Skipped: 0, Time elapsed: 5.222 sec
Running org.apache.hadoop.hbase.stargate.TestSchemaResource
Tests run: 2, Failures: 0, Errors: 0, Skipped: 0, Time elapsed: 20.906 sec
Running org.apache.hadoop.hbase.stargate.auth.TestJDBCAuthenticator
Tests run: 4, Failures: 0, Errors: 0, Skipped: 0, Time elapsed: 0.254 sec
Running org.apache.hadoop.hbase.stargate.auth.TestZooKeeperAuthenticator
Tests run: 4, Failures: 0, Errors: 0, Skipped: 0, Time elapsed: 0.38 sec
Running org.apache.hadoop.hbase.stargate.Test00MiniCluster
Tests run: 4, Failures: 0, Errors: 0, Skipped: 0, Time elapsed: 0.011 sec
Running org.apache.hadoop.hbase.stargate.TestVersionResource
Tests run: 7, Failures: 0, Errors: 0, Skipped: 0, Time elapsed: 0.088 sec
Running org.apache.hadoop.hbase.stargate.model.TestTableListModel
Tests run: 3, Failures: 0, Errors: 0, Skipped: 0, Time elapsed: 0.038 sec
Running org.apache.hadoop.hbase.stargate.model.TestVersionModel
Tests run: 3, Failures: 0, Errors: 0, Skipped: 0, Time elapsed: 0.056 sec
Running org.apache.hadoop.hbase.stargate.auth.TestHBCAuthenticator
Tests run: 4, Failures: 0, Errors: 0, Skipped: 0, Time elapsed: 0.016 sec
Running org.apache.hadoop.hbase.stargate.model.TestStorageClusterStatusModel
Tests run: 3, Failures: 0, Errors: 0, Skipped: 0, Time elapsed: 0.06 sec
Running org.apache.hadoop.hbase.stargate.model.TestCellModel
Tests run: 3, Failures: 0, Errors: 0, Skipped: 0, Time elapsed: 0.013 sec
Running org.apache.hadoop.hbase.stargate.TestScannerResource
Tests run: 4, Failures: 0, Errors: 0, Skipped: 0, Time elapsed: 22.117 sec
Running org.apache.hadoop.hbase.stargate.model.TestCellSetModel
Tests run: 3, Failures: 0, Errors: 0, Skipped: 0, Time elapsed: 0.02 sec
Running org.apache.hadoop.hbase.stargate.model.TestTableRegionModel
Tests run: 2, Failures: 0, Errors: 0, Skipped: 0, Time elapsed: 0.011 sec
Running org.apache.hadoop.hbase.stargate.model.TestColumnSchemaModel
Tests run: 2, Failures: 0, Errors: 0, Skipped: 0, Time elapsed: 0.005 sec
Running org.apache.hadoop.hbase.stargate.model.TestRowModel
Tests run: 2, Failures: 0, Errors: 0, Skipped: 0, Time elapsed: 0.012 sec
Running org.apache.hadoop.hbase.stargate.TestTableResource
Tests run: 4, Failures: 0, Errors: 0, Skipped: 0, Time elapsed: 5.399 sec

Results :

Tests run: 79, Failures: 0, Errors: 0, Skipped: 0

[INFO] [war:war {execution: default-war}]
[INFO] Packaging webapp
[INFO] Assembling webapp[hbase-contrib-stargate] in [<http://hudson.zones.apache.org/hudson/job/HBase-Patch/ws/trunk/contrib/stargate/target/hbase-contrib-stargate-0.21.0-SNAPSHOT]>
[INFO] Processing war project
[INFO] Webapp assembled in[727 msecs]
[INFO] Building war: <http://hudson.zones.apache.org/hudson/job/HBase-Patch/ws/trunk/contrib/stargate/target/hbase-contrib-stargate-0.21.0-SNAPSHOT.war>
[INFO] [install:install {execution: default-install}]
[INFO] Installing <http://hudson.zones.apache.org/hudson/job/HBase-Patch/ws/trunk/contrib/stargate/target/hbase-contrib-stargate-0.21.0-SNAPSHOT.war>
to /home/hudson/.m2/repository/org/apache/hbase/hbase-contrib-stargate/0.21.0-SNAPSHOT/hbase-contrib-stargate-0.21.0-SNAPSHOT.war
[INFO] ------------------------------------------------------------------------
[INFO] Building HBase Contrib - Transactional
[INFO]    task-segment: [clean, install]
[INFO] ------------------------------------------------------------------------
[INFO] [clean:clean {execution: default-clean}]
[INFO] Deleting directory <http://hudson.zones.apache.org/hudson/job/HBase-Patch/ws/trunk/contrib/transactional/target>
[INFO] [resources:resources {execution: default-resources}]
[INFO] Using 'UTF-8' encoding to copy filtered resources.
[INFO] skip non existing resourceDirectory <http://hudson.zones.apache.org/hudson/job/HBase-Patch/ws/trunk/contrib/transactional/src/main/resources>
[INFO] [compiler:compile {execution: default-compile}]
[INFO] Compiling 31 source files to <http://hudson.zones.apache.org/hudson/job/HBase-Patch/ws/trunk/contrib/transactional/target/classes>
[WARNING] <http://hudson.zones.apache.org/hudson/job/HBase-Patch/ws/trunk/contrib/transactional/src/main/java/org/apache/hadoop/hbase/client/transactional/HBaseBackedTransactionLogger.java>:[56,38]
[deprecation] HBaseConfiguration() in org.apache.hadoop.hbase.HBaseConfiguration has been
deprecated

[WARNING] <http://hudson.zones.apache.org/hudson/job/HBase-Patch/ws/trunk/contrib/transactional/src/main/java/org/apache/hadoop/hbase/client/transactional/HBaseBackedTransactionLogger.java>:[68,38]
[deprecation] HBaseConfiguration() in org.apache.hadoop.hbase.HBaseConfiguration has been
deprecated

[WARNING] <http://hudson.zones.apache.org/hudson/job/HBase-Patch/ws/trunk/contrib/transactional/src/main/java/org/apache/hadoop/hbase/client/tableindexed/IndexSpecification.java>:[154,49]
[deprecation] HBaseConfiguration() in org.apache.hadoop.hbase.HBaseConfiguration has been
deprecated

[INFO] [resources:testResources {execution: default-testResources}]
[INFO] Using 'UTF-8' encoding to copy filtered resources.
[INFO] skip non existing resourceDirectory <http://hudson.zones.apache.org/hudson/job/HBase-Patch/ws/trunk/contrib/transactional/src/test/resources>
[INFO] [compiler:testCompile {execution: default-testCompile}]
[INFO] Compiling 7 source files to <http://hudson.zones.apache.org/hudson/job/HBase-Patch/ws/trunk/contrib/transactional/target/test-classes>
[WARNING] <http://hudson.zones.apache.org/hudson/job/HBase-Patch/ws/trunk/contrib/transactional/src/test/java/org/apache/hadoop/hbase/client/tableindexed/TestIndexedTable.java>:[29,30]
[deprecation] org.apache.hadoop.hbase.HBaseClusterTestCase in org.apache.hadoop.hbase has
been deprecated

[WARNING] <http://hudson.zones.apache.org/hudson/job/HBase-Patch/ws/trunk/contrib/transactional/src/test/java/org/apache/hadoop/hbase/client/tableindexed/TestIndexedTable.java>:[43,38]
[deprecation] org.apache.hadoop.hbase.HBaseClusterTestCase in org.apache.hadoop.hbase has
been deprecated

[WARNING] <http://hudson.zones.apache.org/hudson/job/HBase-Patch/ws/trunk/contrib/transactional/src/test/java/org/apache/hadoop/hbase/client/transactional/TestTransactions.java>:[26,30]
[deprecation] org.apache.hadoop.hbase.HBaseClusterTestCase in org.apache.hadoop.hbase has
been deprecated

[WARNING] <http://hudson.zones.apache.org/hudson/job/HBase-Patch/ws/trunk/contrib/transactional/src/test/java/org/apache/hadoop/hbase/client/transactional/TestTransactions.java>:[44,38]
[deprecation] org.apache.hadoop.hbase.HBaseClusterTestCase in org.apache.hadoop.hbase has
been deprecated

[WARNING] <http://hudson.zones.apache.org/hudson/job/HBase-Patch/ws/trunk/contrib/transactional/src/test/java/org/apache/hadoop/hbase/regionserver/transactional/TestTHLogRecovery.java>:[30,30]
[deprecation] org.apache.hadoop.hbase.HBaseClusterTestCase in org.apache.hadoop.hbase has
been deprecated

[WARNING] <http://hudson.zones.apache.org/hudson/job/HBase-Patch/ws/trunk/contrib/transactional/src/test/java/org/apache/hadoop/hbase/regionserver/transactional/TestTHLogRecovery.java>:[51,39]
[deprecation] org.apache.hadoop.hbase.HBaseClusterTestCase in org.apache.hadoop.hbase has
been deprecated

[WARNING] <http://hudson.zones.apache.org/hudson/job/HBase-Patch/ws/trunk/contrib/transactional/src/test/java/org/apache/hadoop/hbase/client/transactional/StressTestTransactions.java>:[32,30]
[deprecation] org.apache.hadoop.hbase.HBaseClusterTestCase in org.apache.hadoop.hbase has
been deprecated

[WARNING] <http://hudson.zones.apache.org/hudson/job/HBase-Patch/ws/trunk/contrib/transactional/src/test/java/org/apache/hadoop/hbase/client/transactional/StressTestTransactions.java>:[53,44]
[deprecation] org.apache.hadoop.hbase.HBaseClusterTestCase in org.apache.hadoop.hbase has
been deprecated

[WARNING] <http://hudson.zones.apache.org/hudson/job/HBase-Patch/ws/trunk/contrib/transactional/src/test/java/org/apache/hadoop/hbase/regionserver/transactional/TestTHLog.java>:[27,30]
[deprecation] org.apache.hadoop.hbase.HBaseTestCase in org.apache.hadoop.hbase has been deprecated

[WARNING] <http://hudson.zones.apache.org/hudson/job/HBase-Patch/ws/trunk/contrib/transactional/src/test/java/org/apache/hadoop/hbase/regionserver/transactional/TestTHLog.java>:[37,31]
[deprecation] org.apache.hadoop.hbase.HBaseTestCase in org.apache.hadoop.hbase has been deprecated

[INFO] [surefire:test {execution: default-test}]
[INFO] Surefire report directory: <http://hudson.zones.apache.org/hudson/job/HBase-Patch/ws/trunk/contrib/transactional/target/surefire-reports>

-------------------------------------------------------
 T E S T S
-------------------------------------------------------
Running org.apache.hadoop.hbase.client.tableindexed.TestIndexedTable
Tests run: 7, Failures: 0, Errors: 7, Skipped: 0, Time elapsed: 2.672 sec <<< FAILURE!
Running org.apache.hadoop.hbase.regionserver.transactional.TestTHLog
Tests run: 5, Failures: 0, Errors: 5, Skipped: 0, Time elapsed: 1.477 sec <<< FAILURE!
Running org.apache.hadoop.hbase.client.transactional.TestTransactions
Tests run: 7, Failures: 0, Errors: 7, Skipped: 0, Time elapsed: 1.973 sec <<< FAILURE!
Running org.apache.hadoop.hbase.regionserver.transactional.TestTHLogRecovery
Tests run: 2, Failures: 0, Errors: 0, Skipped: 0, Time elapsed: 514.228 sec

Results :

Tests in error: 
  testInitialWrites(org.apache.hadoop.hbase.client.tableindexed.TestIndexedTable)
  testMultipleWrites(org.apache.hadoop.hbase.client.tableindexed.TestIndexedTable)
  testDelete(org.apache.hadoop.hbase.client.tableindexed.TestIndexedTable)
  testRowUpdate(org.apache.hadoop.hbase.client.tableindexed.TestIndexedTable)
  testLockedRowUpdate(org.apache.hadoop.hbase.client.tableindexed.TestIndexedTable)
  testLockedRowUpdateNoAutoFlush(org.apache.hadoop.hbase.client.tableindexed.TestIndexedTable)
  testLockedRowDelete(org.apache.hadoop.hbase.client.tableindexed.TestIndexedTable)
  testSingleCommit(org.apache.hadoop.hbase.regionserver.transactional.TestTHLog)
  testSingleAbort(org.apache.hadoop.hbase.regionserver.transactional.TestTHLog)
  testInterlievedCommits(org.apache.hadoop.hbase.regionserver.transactional.TestTHLog)
  testInterlievedAbortCommit(org.apache.hadoop.hbase.regionserver.transactional.TestTHLog)
  testInterlievedCommitAbort(org.apache.hadoop.hbase.regionserver.transactional.TestTHLog)
  testSimpleTransaction(org.apache.hadoop.hbase.client.transactional.TestTransactions)
  testTwoTransactionsWithoutConflict(org.apache.hadoop.hbase.client.transactional.TestTransactions)
  testTwoTransactionsWithConflict(org.apache.hadoop.hbase.client.transactional.TestTransactions)
  testGetAfterPut(org.apache.hadoop.hbase.client.transactional.TestTransactions)
  testScanAfterUpdatePut(org.apache.hadoop.hbase.client.transactional.TestTransactions)
  testScanAfterNewPut(org.apache.hadoop.hbase.client.transactional.TestTransactions)
  testPutPutScan(org.apache.hadoop.hbase.client.transactional.TestTransactions)

Tests run: 21, Failures: 0, Errors: 19, Skipped: 0

[INFO] ------------------------------------------------------------------------
[ERROR] BUILD FAILURE
[INFO] ------------------------------------------------------------------------
[INFO] There are test failures.

Please refer to <http://hudson.zones.apache.org/hudson/job/HBase-Patch/ws/trunk/contrib/transactional/target/surefire-reports>
for the individual test results.
[INFO] ------------------------------------------------------------------------
[INFO] For more information, run Maven with the -e switch
[INFO] ------------------------------------------------------------------------
[INFO] Total time: 42 minutes 10 seconds
[INFO] Finished at: Mon Mar 01 23:58:05 UTC 2010
[INFO] Final Memory: 71M/131M
[INFO] ------------------------------------------------------------------------
[locks-and-latches] Releasing all the locks
[locks-and-latches] All the locks released
Archiving artifacts
Recording test results


Mime
View raw message