hbase-dev mailing list archives

Site index · List index
Message view « Date » · « Thread »
Top « Date » · « Thread »
From Jean-Daniel Cryans <jdcry...@apache.org>
Subject Re: Build failed in Hudson: hbase-020-branch #21
Date Sun, 21 Mar 2010 06:33:28 GMT
Running locally I get:

    [junit] 2010-03-20 23:32:03,365 WARN  [RegionServer:0]
regionserver.HRegionServer(1307): Unable to connect to master.
Retrying. Error was:
    [junit] java.io.IOException: Call to /192.168.1.105:60000 failed
on local exception: java.io.EOFException
    [junit] 	at
org.apache.hadoop.hbase.ipc.HBaseClient.wrapException(HBaseClient.java:757)
    [junit] 	at
org.apache.hadoop.hbase.ipc.HBaseClient.call(HBaseClient.java:727)
    [junit] 	at
org.apache.hadoop.hbase.ipc.HBaseRPC$Invoker.invoke(HBaseRPC.java:253)
    [junit] 	at $Proxy2.getProtocolVersion(Unknown Source)
    [junit] 	at org.apache.hadoop.hbase.ipc.HBaseRPC.getProxy(HBaseRPC.java:409)
    [junit] 	at org.apache.hadoop.hbase.ipc.HBaseRPC.getProxy(HBaseRPC.java:385)
    [junit] 	at org.apache.hadoop.hbase.ipc.HBaseRPC.getProxy(HBaseRPC.java:432)
    [junit] 	at
org.apache.hadoop.hbase.ipc.HBaseRPC.waitForProxy(HBaseRPC.java:343)
    [junit] 	at
org.apache.hadoop.hbase.regionserver.HRegionServer.getMaster(HRegionServer.java:1302)
    [junit] 	at
org.apache.hadoop.hbase.regionserver.HRegionServer.reportForDuty(HRegionServer.java:1320)
    [junit] 	at
org.apache.hadoop.hbase.regionserver.HRegionServer.run(HRegionServer.java:428)
    [junit] 	at java.lang.Thread.run(Thread.java:637)
    [junit] Caused by: java.io.EOFException
    [junit] 	at java.io.DataInputStream.readInt(DataInputStream.java:375)
    [junit] 	at
org.apache.hadoop.hbase.ipc.HBaseClient$Connection.receiveResponse(HBaseClient.java:504)
    [junit] 	at
org.apache.hadoop.hbase.ipc.HBaseClient$Connection.run(HBaseClient.java:448)


On Sat, Mar 20, 2010 at 11:16 PM, Apache Hudson Server
<hudson@hudson.zones.apache.org> wrote:
> See <http://hudson.zones.apache.org/hudson/job/hbase-020-branch/21/changes>
>
> Changes:
>
> [rawson] HBASE-2066  Perf: parallelize puts
>
> ------------------------------------------
> [...truncated 194 lines...]
>
> clover.setup:
>
> clover.info:
>     [echo]
>     [echo]       Clover not found. Code coverage reports disabled.
>     [echo]
>
> clover:
>
> check-contrib:
>
> init:
>     [echo] contrib: indexed
>
> init-contrib:
>
> compile:
>     [echo] contrib: indexed
>
> check-contrib:
>
> init:
>     [echo] contrib: stargate
>
> init-contrib:
>
> compile-jar:
>
> compile-war:
>
> compile:
>     [echo] contrib: stargate
>
> clover.setup:
>
> clover.info:
>     [echo]
>     [echo]       Clover not found. Code coverage reports disabled.
>     [echo]
>
> clover:
>
> check-contrib:
>
> init:
>     [echo] contrib: transactional
>
> init-contrib:
>
> compile:
>     [echo] contrib: transactional
>
> compile:
>
> compile-core-test:
>    [javac] Compiling 113 source files to <http://hudson.zones.apache.org/hudson/job/hbase-020-branch/ws/trunk/build/test>
>    [javac] Note: Some input files use or override a deprecated API.
>    [javac] Note: Recompile with -Xlint:deprecation for details.
>    [javac] Note: Some input files use unchecked or unsafe operations.
>    [javac] Note: Recompile with -Xlint:unchecked for details.
>      [jar] Building jar: <http://hudson.zones.apache.org/hudson/job/hbase-020-branch/ws/trunk/build/hbase-0.20.4-dev-test.jar>
>
> test-core:
>    [mkdir] Created dir: <http://hudson.zones.apache.org/hudson/job/hbase-020-branch/ws/trunk/build/test/logs>
>    [junit] Running org.apache.hadoop.hbase.TestClassMigration
>    [junit] Tests run: 1, Failures: 0, Errors: 0, Time elapsed: 0.113 sec
>    [junit] Running org.apache.hadoop.hbase.TestCompare
>    [junit] Tests run: 3, Failures: 0, Errors: 0, Time elapsed: 0.068 sec
>    [junit] Running org.apache.hadoop.hbase.TestEmptyMetaInfo
>    [junit] Tests run: 1, Failures: 0, Errors: 0, Time elapsed: 24.421 sec
>    [junit] Running org.apache.hadoop.hbase.TestHBaseCluster
>    [junit] Tests run: 1, Failures: 0, Errors: 0, Time elapsed: 42.57 sec
>    [junit] Running org.apache.hadoop.hbase.TestHMsg
>    [junit] Tests run: 2, Failures: 0, Errors: 0, Time elapsed: 0.078 sec
>    [junit] Running org.apache.hadoop.hbase.TestHStoreKey
>    [junit] Tests run: 7, Failures: 0, Errors: 0, Time elapsed: 0.06 sec
>    [junit] Running org.apache.hadoop.hbase.TestInfoServers
>    [junit] Tests run: 1, Failures: 0, Errors: 0, Time elapsed: 35.173 sec
>    [junit] Running org.apache.hadoop.hbase.TestKeyValue
>    [junit] Tests run: 7, Failures: 0, Errors: 0, Time elapsed: 0.049 sec
>    [junit] Running org.apache.hadoop.hbase.TestMasterAdmin
>    [junit] Tests run: 1, Failures: 0, Errors: 0, Time elapsed: 55.799 sec
>    [junit] Running org.apache.hadoop.hbase.TestMergeMeta
>    [junit] Tests run: 1, Failures: 0, Errors: 0, Time elapsed: 38.139 sec
>    [junit] Running org.apache.hadoop.hbase.TestMergeTable
>    [junit] Tests run: 1, Failures: 0, Errors: 0, Time elapsed: 67.573 sec
>    [junit] Running org.apache.hadoop.hbase.TestMultiParallelPut
>    [junit] Tests run: 1, Failures: 0, Errors: 0, Time elapsed: 34.271 sec
>    [junit] Running org.apache.hadoop.hbase.TestRegionRebalancing
>    [junit] Tests run: 1, Failures: 0, Errors: 0, Time elapsed: 59.929 sec
>    [junit] Running org.apache.hadoop.hbase.TestScanMultipleVersions
>    [junit] Tests run: 1, Failures: 0, Errors: 0, Time elapsed: 25.406 sec
>    [junit] Running org.apache.hadoop.hbase.TestSerialization
>    [junit] Tests run: 20, Failures: 0, Errors: 0, Time elapsed: 0.329 sec
>    [junit] Running org.apache.hadoop.hbase.TestTable
>    [junit] Tests run: 4, Failures: 0, Errors: 0, Time elapsed: 125.685 sec
>    [junit] Running org.apache.hadoop.hbase.TestZooKeeper
>    [junit] Tests run: 6, Failures: 0, Errors: 0, Time elapsed: 446.242 sec
>    [junit] Running org.apache.hadoop.hbase.client.TestBatchUpdate
>    [junit] Tests run: 4, Failures: 0, Errors: 0, Time elapsed: 94.866 sec
>    [junit] Running org.apache.hadoop.hbase.client.TestClient
>    [junit] Tests run: 11, Failures: 0, Errors: 0, Time elapsed: 290.404 sec
>    [junit] Running org.apache.hadoop.hbase.client.TestForceSplit
>    [junit] Tests run: 1, Failures: 0, Errors: 0, Time elapsed: 38.42 sec
>    [junit] Running org.apache.hadoop.hbase.client.TestGet
>    [junit] Tests run: 2, Failures: 0, Errors: 0, Time elapsed: 54.175 sec
>    [junit] Running org.apache.hadoop.hbase.client.TestGetRowVersions
>    [junit] Running org.apache.hadoop.hbase.client.TestGetRowVersions
>    [junit] Tests run: 1, Failures: 0, Errors: 1, Time elapsed: 0 sec
>    [junit] Test org.apache.hadoop.hbase.client.TestGetRowVersions FAILED (timeout)
>    [junit] Running org.apache.hadoop.hbase.client.TestHBaseAdmin
>    [junit] Tests run: 3, Failures: 0, Errors: 0, Time elapsed: 96.021 sec
>    [junit] Running org.apache.hadoop.hbase.client.TestHTable
>    [junit] Tests run: 6, Failures: 0, Errors: 0, Time elapsed: 106.666 sec
>    [junit] Running org.apache.hadoop.hbase.client.TestHTablePool
>    [junit] Tests run: 4, Failures: 0, Errors: 0, Time elapsed: 0.257 sec
>    [junit] Running org.apache.hadoop.hbase.client.TestListTables
>    [junit] Tests run: 1, Failures: 0, Errors: 0, Time elapsed: 67.19 sec
>    [junit] Running org.apache.hadoop.hbase.client.TestOldAPIGetRowVersions
>    [junit] Tests run: 1, Failures: 0, Errors: 0, Time elapsed: 19.158 sec
>    [junit] Running org.apache.hadoop.hbase.client.TestOldAPIHTable
>    [junit] Tests run: 5, Failures: 0, Errors: 0, Time elapsed: 94.08 sec
>    [junit] Running org.apache.hadoop.hbase.client.TestOldAPITimestamp
>    [junit] Tests run: 1, Failures: 0, Errors: 0, Time elapsed: 19.334 sec
>    [junit] Running org.apache.hadoop.hbase.client.TestPut
>    [junit] Tests run: 5, Failures: 0, Errors: 0, Time elapsed: 111.467 sec
>    [junit] Running org.apache.hadoop.hbase.client.TestScannerTimes
>    [junit] Tests run: 1, Failures: 0, Errors: 0, Time elapsed: 56.348 sec
>    [junit] Running org.apache.hadoop.hbase.client.TestTimestamp
>    [junit] Tests run: 1, Failures: 0, Errors: 0, Time elapsed: 18.067 sec
>    [junit] Running org.apache.hadoop.hbase.filter.TestFilter
>    [junit] Tests run: 14, Failures: 0, Errors: 0, Time elapsed: 1.968 sec
>    [junit] Running org.apache.hadoop.hbase.filter.TestFilterAcrossRegions
>    [junit] Tests run: 1, Failures: 0, Errors: 0, Time elapsed: 0.419 sec
>    [junit] Running org.apache.hadoop.hbase.filter.TestFilterList
>    [junit] Tests run: 4, Failures: 0, Errors: 0, Time elapsed: 0.221 sec
>    [junit] Running org.apache.hadoop.hbase.filter.TestInclusiveStopFilter
>    [junit] Tests run: 2, Failures: 0, Errors: 0, Time elapsed: 0.054 sec
>    [junit] Running org.apache.hadoop.hbase.filter.TestPageFilter
>    [junit] Tests run: 2, Failures: 0, Errors: 0, Time elapsed: 0.037 sec
>    [junit] Running org.apache.hadoop.hbase.filter.TestPrefixFilter
>    [junit] Tests run: 3, Failures: 0, Errors: 0, Time elapsed: 0.047 sec
>    [junit] Running org.apache.hadoop.hbase.filter.TestSingleColumnValueFilter
>    [junit] Tests run: 2, Failures: 0, Errors: 0, Time elapsed: 0.149 sec
>    [junit] Running org.apache.hadoop.hbase.io.TestHbaseObjectWritable
>    [junit] Tests run: 1, Failures: 0, Errors: 0, Time elapsed: 0.182 sec
>    [junit] Running org.apache.hadoop.hbase.io.TestHeapSize
>    [junit] Tests run: 2, Failures: 0, Errors: 0, Time elapsed: 0.074 sec
>    [junit] Running org.apache.hadoop.hbase.io.hfile.TestCachedBlockQueue
>    [junit] Tests run: 2, Failures: 0, Errors: 0, Time elapsed: 0.096 sec
>    [junit] Running org.apache.hadoop.hbase.io.hfile.TestHFile
>    [junit] Tests run: 7, Failures: 0, Errors: 0, Time elapsed: 0.424 sec
>    [junit] Running org.apache.hadoop.hbase.io.hfile.TestHFilePerformance
>    [junit] Tests run: 1, Failures: 0, Errors: 0, Time elapsed: 5.987 sec
>    [junit] Running org.apache.hadoop.hbase.io.hfile.TestHFileSeek
>    [junit] Tests run: 1, Failures: 0, Errors: 0, Time elapsed: 5.266 sec
>    [junit] Running org.apache.hadoop.hbase.io.hfile.TestLruBlockCache
>    [junit] Tests run: 7, Failures: 0, Errors: 0, Time elapsed: 1.14 sec
>    [junit] Running org.apache.hadoop.hbase.io.hfile.TestSeekTo
>    [junit] Tests run: 3, Failures: 0, Errors: 0, Time elapsed: 0.266 sec
>    [junit] Running org.apache.hadoop.hbase.mapred.TestTableIndex
>    [junit] Tests run: 1, Failures: 0, Errors: 0, Time elapsed: 57.464 sec
>    [junit] Running org.apache.hadoop.hbase.mapred.TestTableMapReduce
>    [junit] Tests run: 1, Failures: 0, Errors: 0, Time elapsed: 58.091 sec
>    [junit] Running org.apache.hadoop.hbase.mapreduce.TestHFileOutputFormat
>    [junit] Tests run: 1, Failures: 0, Errors: 0, Time elapsed: 5.51 sec
>    [junit] Running org.apache.hadoop.hbase.mapreduce.TestTableIndex
>    [junit] Tests run: 1, Failures: 0, Errors: 0, Time elapsed: 65.602 sec
>    [junit] Running org.apache.hadoop.hbase.mapreduce.TestTableMapReduce
>    [junit] Tests run: 1, Failures: 0, Errors: 0, Time elapsed: 63.691 sec
>    [junit] Running org.apache.hadoop.hbase.mapreduce.TestTimeRangeMapRed
>    [junit] Tests run: 1, Failures: 0, Errors: 0, Time elapsed: 31.166 sec
>    [junit] Running org.apache.hadoop.hbase.master.TestMinimumServerCount
>    [junit] Tests run: 1, Failures: 0, Errors: 0, Time elapsed: 45.115 sec
>    [junit] Running org.apache.hadoop.hbase.master.TestRegionManager
>    [junit] Tests run: 1, Failures: 0, Errors: 0, Time elapsed: 38.74 sec
>    [junit] Running org.apache.hadoop.hbase.metrics.TestMetricsMBeanBase
>    [junit] Tests run: 2, Failures: 0, Errors: 0, Time elapsed: 0.114 sec
>    [junit] Running org.apache.hadoop.hbase.regionserver.TestCompaction
>    [junit] Tests run: 2, Failures: 0, Errors: 0, Time elapsed: 72.638 sec
>    [junit] Running org.apache.hadoop.hbase.regionserver.TestDeleteCompare
>    [junit] Tests run: 4, Failures: 0, Errors: 0, Time elapsed: 0.113 sec
>    [junit] Running org.apache.hadoop.hbase.regionserver.TestExplicitColumnTracker
>    [junit] Tests run: 3, Failures: 0, Errors: 0, Time elapsed: 0.577 sec
>    [junit] Running org.apache.hadoop.hbase.regionserver.TestGetClosestAtOrBefore
>    [junit] Tests run: 3, Failures: 0, Errors: 0, Time elapsed: 46.804 sec
>    [junit] Running org.apache.hadoop.hbase.regionserver.TestGetDeleteTracker
>    [junit] Tests run: 7, Failures: 0, Errors: 0, Time elapsed: 0.034 sec
>    [junit] Running org.apache.hadoop.hbase.regionserver.TestHLog
>    [junit] Tests run: 3, Failures: 0, Errors: 0, Time elapsed: 15.253 sec
>    [junit] Running org.apache.hadoop.hbase.regionserver.TestHRegion
>    [junit] Tests run: 41, Failures: 0, Errors: 0, Time elapsed: 38.625 sec
>    [junit] Running org.apache.hadoop.hbase.regionserver.TestHRegionInfo
>    [junit] Tests run: 1, Failures: 0, Errors: 0, Time elapsed: 0.207 sec
>    [junit] Running org.apache.hadoop.hbase.regionserver.TestKeyValueHeap
>    [junit] Tests run: 3, Failures: 0, Errors: 0, Time elapsed: 0.023 sec
>    [junit] Running org.apache.hadoop.hbase.regionserver.TestKeyValueScanFixture
>    [junit] Tests run: 1, Failures: 0, Errors: 0, Time elapsed: 0.105 sec
>    [junit] Running org.apache.hadoop.hbase.regionserver.TestKeyValueSkipListSet
>    [junit] Tests run: 4, Failures: 0, Errors: 0, Time elapsed: 0.034 sec
>    [junit] Running org.apache.hadoop.hbase.regionserver.TestLogRolling
>    [junit] Tests run: 2, Failures: 0, Errors: 0, Time elapsed: 129.146 sec
>    [junit] Running org.apache.hadoop.hbase.regionserver.TestLruHashMap
>    [junit] Tests run: 9, Failures: 0, Errors: 0, Time elapsed: 1.639 sec
>    [junit] Running org.apache.hadoop.hbase.regionserver.TestMemStore
>    [junit] Tests run: 17, Failures: 0, Errors: 0, Time elapsed: 0.238 sec
>    [junit] Running org.apache.hadoop.hbase.regionserver.TestMinorCompactingStoreScanner
>    [junit] Tests run: 2, Failures: 0, Errors: 0, Time elapsed: 0.116 sec
>    [junit] Running org.apache.hadoop.hbase.regionserver.TestQueryMatcher
>    [junit] Tests run: 4, Failures: 0, Errors: 0, Time elapsed: 0.028 sec
>    [junit] Running org.apache.hadoop.hbase.regionserver.TestScanDeleteTracker
>    [junit] Tests run: 6, Failures: 0, Errors: 0, Time elapsed: 0.019 sec
>    [junit] Running org.apache.hadoop.hbase.regionserver.TestScanWildcardColumnTracker
>    [junit] Tests run: 2, Failures: 0, Errors: 0, Time elapsed: 0.195 sec
>    [junit] Running org.apache.hadoop.hbase.regionserver.TestScanner
>    [junit] Tests run: 6, Failures: 0, Errors: 0, Time elapsed: 32.286 sec
>    [junit] Running org.apache.hadoop.hbase.regionserver.TestStore
>    [junit] Tests run: 5, Failures: 0, Errors: 0, Time elapsed: 0.869 sec
>    [junit] Running org.apache.hadoop.hbase.regionserver.TestStoreFile
>    [junit] Tests run: 2, Failures: 0, Errors: 0, Time elapsed: 28.078 sec
>    [junit] Running org.apache.hadoop.hbase.regionserver.TestStoreScanner
>    [junit] Tests run: 13, Failures: 0, Errors: 0, Time elapsed: 0.123 sec
>    [junit] Running org.apache.hadoop.hbase.regionserver.TestWildcardColumnTracker
>    [junit] Tests run: 6, Failures: 0, Errors: 0, Time elapsed: 0.43 sec
>    [junit] Running org.apache.hadoop.hbase.thrift.TestThriftServer
>    [junit] Tests run: 1, Failures: 0, Errors: 0, Time elapsed: 95.763 sec
>    [junit] Running org.apache.hadoop.hbase.util.TestBase64
>    [junit] Tests run: 1, Failures: 0, Errors: 0, Time elapsed: 0.097 sec
>    [junit] Running org.apache.hadoop.hbase.util.TestBytes
>    [junit] Tests run: 11, Failures: 0, Errors: 0, Time elapsed: 0.072 sec
>    [junit] Running org.apache.hadoop.hbase.util.TestKeying
>    [junit] Tests run: 1, Failures: 0, Errors: 0, Time elapsed: 0.038 sec
>    [junit] Running org.apache.hadoop.hbase.util.TestMergeTool
>    [junit] Tests run: 1, Failures: 0, Errors: 0, Time elapsed: 12.258 sec
>    [junit] Running org.apache.hadoop.hbase.util.TestMigration
>    [junit] Tests run: 1, Failures: 0, Errors: 0, Time elapsed: 19.169 sec
>    [junit] Running org.apache.hadoop.hbase.util.TestPair
>    [junit] Tests run: 9, Failures: 0, Errors: 0, Time elapsed: 0.241 sec
>    [junit] Running org.apache.hadoop.hbase.util.TestRootPath
>    [junit] Tests run: 1, Failures: 0, Errors: 0, Time elapsed: 0.04 sec
>
> BUILD FAILED
> <http://hudson.zones.apache.org/hudson/job/hbase-020-branch/ws/trunk/build.xml>:517:
Tests failed!
>
> Total time: 59 minutes 15 seconds
> [locks-and-latches] Releasing all the locks
> [locks-and-latches] All the locks released
> Recording test results
>
>

Mime
View raw message