hbase-dev mailing list archives

Site index · List index
Message view « Date » · « Thread »
Top « Date » · « Thread »
From Apache Hudson Server <hud...@hudson.zones.apache.org>
Subject Build failed in Hudson: hbase-020-branch #7
Date Fri, 12 Mar 2010 00:29:05 GMT
See <http://hudson.zones.apache.org/hudson/job/hbase-020-branch/7/changes>

Changes:

[stack] HBASE-2268 PerformanceEvaluation --nomapred may assign duplicate random seed over
multiple testing threads

------------------------------------------
[...truncated 287 lines...]
    [junit] Tests run: 2, Failures: 0, Errors: 0, Time elapsed: 58.995 sec
    [junit] Running org.apache.hadoop.hbase.client.TestGetRowVersions
    [junit] Tests run: 1, Failures: 0, Errors: 0, Time elapsed: 59.576 sec
    [junit] Running org.apache.hadoop.hbase.client.TestHBaseAdmin
    [junit] Tests run: 3, Failures: 0, Errors: 0, Time elapsed: 113.818 sec
    [junit] Running org.apache.hadoop.hbase.client.TestHTable
    [junit] Tests run: 6, Failures: 0, Errors: 0, Time elapsed: 110.29 sec
    [junit] Running org.apache.hadoop.hbase.client.TestHTablePool
    [junit] Tests run: 4, Failures: 0, Errors: 0, Time elapsed: 0.175 sec
    [junit] Running org.apache.hadoop.hbase.client.TestListTables
    [junit] Tests run: 1, Failures: 0, Errors: 0, Time elapsed: 48.662 sec
    [junit] Running org.apache.hadoop.hbase.client.TestOldAPIGetRowVersions
    [junit] Tests run: 1, Failures: 0, Errors: 0, Time elapsed: 18.348 sec
    [junit] Running org.apache.hadoop.hbase.client.TestOldAPIHTable
    [junit] Tests run: 5, Failures: 0, Errors: 0, Time elapsed: 115.279 sec
    [junit] Running org.apache.hadoop.hbase.client.TestOldAPITimestamp
    [junit] Tests run: 1, Failures: 0, Errors: 0, Time elapsed: 19.347 sec
    [junit] Running org.apache.hadoop.hbase.client.TestPut
    [junit] Tests run: 5, Failures: 0, Errors: 0, Time elapsed: 89.133 sec
    [junit] Running org.apache.hadoop.hbase.client.TestScannerTimes
    [junit] Tests run: 1, Failures: 0, Errors: 0, Time elapsed: 34.77 sec
    [junit] Running org.apache.hadoop.hbase.client.TestTimestamp
    [junit] Tests run: 1, Failures: 0, Errors: 0, Time elapsed: 19.287 sec
    [junit] Running org.apache.hadoop.hbase.filter.TestFilter
    [junit] Tests run: 14, Failures: 0, Errors: 0, Time elapsed: 1.993 sec
    [junit] Running org.apache.hadoop.hbase.filter.TestFilterAcrossRegions
    [junit] Tests run: 1, Failures: 0, Errors: 0, Time elapsed: 0.442 sec
    [junit] Running org.apache.hadoop.hbase.filter.TestFilterList
    [junit] Tests run: 4, Failures: 0, Errors: 0, Time elapsed: 0.21 sec
    [junit] Running org.apache.hadoop.hbase.filter.TestInclusiveStopFilter
    [junit] Tests run: 2, Failures: 0, Errors: 0, Time elapsed: 0.006 sec
    [junit] Running org.apache.hadoop.hbase.filter.TestPageFilter
    [junit] Tests run: 2, Failures: 0, Errors: 0, Time elapsed: 0.005 sec
    [junit] Running org.apache.hadoop.hbase.filter.TestPrefixFilter
    [junit] Tests run: 3, Failures: 0, Errors: 0, Time elapsed: 0.009 sec
    [junit] Running org.apache.hadoop.hbase.filter.TestSingleColumnValueFilter
    [junit] Tests run: 2, Failures: 0, Errors: 0, Time elapsed: 0.124 sec
    [junit] Running org.apache.hadoop.hbase.io.TestHbaseObjectWritable
    [junit] Tests run: 1, Failures: 0, Errors: 0, Time elapsed: 0.173 sec
    [junit] Running org.apache.hadoop.hbase.io.TestHeapSize
    [junit] Tests run: 2, Failures: 0, Errors: 0, Time elapsed: 0.047 sec
    [junit] Running org.apache.hadoop.hbase.io.hfile.TestCachedBlockQueue
    [junit] Tests run: 2, Failures: 0, Errors: 0, Time elapsed: 0.073 sec
    [junit] Running org.apache.hadoop.hbase.io.hfile.TestHFile
    [junit] Tests run: 7, Failures: 0, Errors: 0, Time elapsed: 0.42 sec
    [junit] Running org.apache.hadoop.hbase.io.hfile.TestHFilePerformance
    [junit] Tests run: 1, Failures: 0, Errors: 0, Time elapsed: 5.953 sec
    [junit] Running org.apache.hadoop.hbase.io.hfile.TestHFileSeek
    [junit] Tests run: 1, Failures: 0, Errors: 0, Time elapsed: 5.339 sec
    [junit] Running org.apache.hadoop.hbase.io.hfile.TestLruBlockCache
    [junit] Tests run: 7, Failures: 0, Errors: 0, Time elapsed: 1.127 sec
    [junit] Running org.apache.hadoop.hbase.io.hfile.TestSeekTo
    [junit] Tests run: 3, Failures: 0, Errors: 0, Time elapsed: 0.254 sec
    [junit] Running org.apache.hadoop.hbase.mapred.TestTableIndex
    [junit] Tests run: 1, Failures: 0, Errors: 0, Time elapsed: 78.174 sec
    [junit] Running org.apache.hadoop.hbase.mapred.TestTableMapReduce
    [junit] Tests run: 1, Failures: 0, Errors: 0, Time elapsed: 54.946 sec
    [junit] Running org.apache.hadoop.hbase.mapreduce.TestHFileOutputFormat
    [junit] Tests run: 1, Failures: 0, Errors: 0, Time elapsed: 5.359 sec
    [junit] Running org.apache.hadoop.hbase.mapreduce.TestTableIndex
    [junit] Tests run: 1, Failures: 0, Errors: 0, Time elapsed: 62.513 sec
    [junit] Running org.apache.hadoop.hbase.mapreduce.TestTableMapReduce
    [junit] Tests run: 1, Failures: 0, Errors: 0, Time elapsed: 60.975 sec
    [junit] Running org.apache.hadoop.hbase.mapreduce.TestTimeRangeMapRed
    [junit] Tests run: 1, Failures: 0, Errors: 0, Time elapsed: 33.364 sec
    [junit] Running org.apache.hadoop.hbase.master.TestMinimumServerCount
    [junit] Tests run: 1, Failures: 0, Errors: 0, Time elapsed: 69.678 sec
    [junit] Running org.apache.hadoop.hbase.master.TestRegionManager
    [junit] Tests run: 1, Failures: 0, Errors: 0, Time elapsed: 14.386 sec
    [junit] Running org.apache.hadoop.hbase.metrics.TestMetricsMBeanBase
    [junit] Tests run: 2, Failures: 0, Errors: 0, Time elapsed: 0.095 sec
    [junit] Running org.apache.hadoop.hbase.regionserver.TestCompaction
    [junit] Tests run: 2, Failures: 0, Errors: 0, Time elapsed: 34.609 sec
    [junit] Running org.apache.hadoop.hbase.regionserver.TestDeleteCompare
    [junit] Tests run: 4, Failures: 0, Errors: 0, Time elapsed: 0.082 sec
    [junit] Running org.apache.hadoop.hbase.regionserver.TestExplicitColumnTracker
    [junit] Tests run: 3, Failures: 0, Errors: 0, Time elapsed: 0.58 sec
    [junit] Running org.apache.hadoop.hbase.regionserver.TestGetClosestAtOrBefore
    [junit] Tests run: 3, Failures: 0, Errors: 0, Time elapsed: 34.164 sec
    [junit] Running org.apache.hadoop.hbase.regionserver.TestGetDeleteTracker
    [junit] Tests run: 7, Failures: 0, Errors: 0, Time elapsed: 0.026 sec
    [junit] Running org.apache.hadoop.hbase.regionserver.TestHLog
    [junit] Tests run: 3, Failures: 0, Errors: 0, Time elapsed: 35.67 sec
    [junit] Running org.apache.hadoop.hbase.regionserver.TestHRegion
    [junit] Tests run: 41, Failures: 0, Errors: 0, Time elapsed: 29.79 sec
    [junit] Running org.apache.hadoop.hbase.regionserver.TestHRegionInfo
    [junit] Tests run: 1, Failures: 0, Errors: 0, Time elapsed: 0.174 sec
    [junit] Running org.apache.hadoop.hbase.regionserver.TestKeyValueHeap
    [junit] Tests run: 3, Failures: 0, Errors: 0, Time elapsed: 0.015 sec
    [junit] Running org.apache.hadoop.hbase.regionserver.TestKeyValueScanFixture
    [junit] Tests run: 1, Failures: 0, Errors: 0, Time elapsed: 0.079 sec
    [junit] Running org.apache.hadoop.hbase.regionserver.TestKeyValueSkipListSet
    [junit] Tests run: 4, Failures: 0, Errors: 0, Time elapsed: 0.009 sec
    [junit] Running org.apache.hadoop.hbase.regionserver.TestLogRolling
    [junit] Tests run: 2, Failures: 0, Errors: 0, Time elapsed: 130.324 sec
    [junit] Running org.apache.hadoop.hbase.regionserver.TestLruHashMap
    [junit] Tests run: 9, Failures: 0, Errors: 0, Time elapsed: 1.598 sec
    [junit] Running org.apache.hadoop.hbase.regionserver.TestMemStore
    [junit] Tests run: 17, Failures: 0, Errors: 0, Time elapsed: 0.211 sec
    [junit] Running org.apache.hadoop.hbase.regionserver.TestMinorCompactingStoreScanner
    [junit] Tests run: 2, Failures: 0, Errors: 0, Time elapsed: 0.082 sec
    [junit] Running org.apache.hadoop.hbase.regionserver.TestQueryMatcher
    [junit] Tests run: 4, Failures: 0, Errors: 0, Time elapsed: 0.019 sec
    [junit] Running org.apache.hadoop.hbase.regionserver.TestScanDeleteTracker
    [junit] Tests run: 6, Failures: 0, Errors: 0, Time elapsed: 0.007 sec
    [junit] Running org.apache.hadoop.hbase.regionserver.TestScanWildcardColumnTracker
    [junit] Tests run: 2, Failures: 0, Errors: 0, Time elapsed: 0.216 sec
    [junit] Running org.apache.hadoop.hbase.regionserver.TestScanner
    [junit] Tests run: 6, Failures: 0, Errors: 0, Time elapsed: 29.329 sec
    [junit] Running org.apache.hadoop.hbase.regionserver.TestStore
    [junit] Tests run: 5, Failures: 0, Errors: 0, Time elapsed: 0.832 sec
    [junit] Running org.apache.hadoop.hbase.regionserver.TestStoreFile
    [junit] Tests run: 2, Failures: 0, Errors: 0, Time elapsed: 20.815 sec
    [junit] Running org.apache.hadoop.hbase.regionserver.TestStoreScanner
    [junit] Tests run: 13, Failures: 0, Errors: 0, Time elapsed: 0.1 sec
    [junit] Running org.apache.hadoop.hbase.regionserver.TestWildcardColumnTracker
    [junit] Tests run: 6, Failures: 0, Errors: 0, Time elapsed: 0.397 sec
    [junit] Running org.apache.hadoop.hbase.thrift.TestThriftServer
    [junit] Tests run: 1, Failures: 0, Errors: 0, Time elapsed: 86.84 sec
    [junit] Running org.apache.hadoop.hbase.util.TestBase64
    [junit] Tests run: 1, Failures: 0, Errors: 0, Time elapsed: 0.073 sec
    [junit] Running org.apache.hadoop.hbase.util.TestBytes
    [junit] Tests run: 11, Failures: 0, Errors: 0, Time elapsed: 0.037 sec
    [junit] Running org.apache.hadoop.hbase.util.TestKeying
    [junit] Tests run: 1, Failures: 0, Errors: 0, Time elapsed: 0.006 sec
    [junit] Running org.apache.hadoop.hbase.util.TestMergeTool
    [junit] Tests run: 1, Failures: 0, Errors: 0, Time elapsed: 12.734 sec
    [junit] Running org.apache.hadoop.hbase.util.TestMigration
    [junit] Tests run: 1, Failures: 0, Errors: 0, Time elapsed: 19.129 sec
    [junit] Running org.apache.hadoop.hbase.util.TestPair
    [junit] Tests run: 9, Failures: 0, Errors: 0, Time elapsed: 0.235 sec
    [junit] Running org.apache.hadoop.hbase.util.TestRootPath
    [junit] Tests run: 1, Failures: 0, Errors: 0, Time elapsed: 0.014 sec

test-contrib:

test:

compile:

compile-examples:

compile-test:

test:

clover.setup:

clover.info:
     [echo] 
     [echo]       Clover not found. Code coverage reports disabled.
     [echo]     

clover:

check-contrib:

init:
     [echo] contrib: indexed

init-contrib:

compile:
     [echo] contrib: indexed

compile-examples:

compile-test:
     [echo] contrib: indexed
    [javac] Compiling 32 source files to <http://hudson.zones.apache.org/hudson/job/hbase-020-branch/ws/trunk/build/contrib/indexed/test>
    [javac] Note: <http://hudson.zones.apache.org/hudson/job/hbase-020-branch/ws/trunk/src/contrib/indexed/src/test/org/apache/hadoop/hbase/regionserver/TestIdxRegion.java>
uses unchecked or unsafe operations.
    [javac] Note: Recompile with -Xlint:unchecked for details.

test:
     [echo] contrib: indexed
   [delete] Deleting directory <http://hudson.zones.apache.org/hudson/job/hbase-020-branch/ws/trunk/build/contrib/indexed/test/logs>
    [mkdir] Created dir: <http://hudson.zones.apache.org/hudson/job/hbase-020-branch/ws/trunk/build/contrib/indexed/test/logs>
    [junit] Running org.apache.hadoop.hbase.TestIdxHBaseCluster
    [junit] Tests run: 2, Failures: 0, Errors: 0, Time elapsed: 122.24 sec
    [junit] Running org.apache.hadoop.hbase.TestIdxMasterAdmin
    [junit] Tests run: 1, Failures: 0, Errors: 0, Time elapsed: 24.242 sec
    [junit] Running org.apache.hadoop.hbase.TestWritableHelper
    [junit] Tests run: 6, Failures: 0, Errors: 0, Time elapsed: 0.029 sec
    [junit] Running org.apache.hadoop.hbase.client.idx.TestIdxColumnDescriptor
    [junit] Tests run: 8, Failures: 0, Errors: 0, Time elapsed: 0.105 sec
    [junit] Running org.apache.hadoop.hbase.client.idx.TestIdxIndexDescriptor
    [junit] Tests run: 2, Failures: 0, Errors: 0, Time elapsed: 0.085 sec
    [junit] Running org.apache.hadoop.hbase.client.idx.TestIdxScan
    [junit] Tests run: 2, Failures: 0, Errors: 0, Time elapsed: 0.024 sec
    [junit] Running org.apache.hadoop.hbase.client.idx.exp.TestComparison
    [junit] Tests run: 4, Failures: 0, Errors: 0, Time elapsed: 0.017 sec
    [junit] Running org.apache.hadoop.hbase.client.idx.exp.TestExpression
    [junit] Tests run: 2, Failures: 0, Errors: 0, Time elapsed: 0.019 sec
    [junit] Running org.apache.hadoop.hbase.regionserver.TestCompleteIndex
    [junit] Tests run: 5, Failures: 1, Errors: 0, Time elapsed: 0.212 sec
    [junit] Test org.apache.hadoop.hbase.regionserver.TestCompleteIndex FAILED
    [junit] Running org.apache.hadoop.hbase.regionserver.TestHRegionWithIdxRegion
    [junit] Tests run: 41, Failures: 0, Errors: 0, Time elapsed: 23.432 sec
    [junit] Running org.apache.hadoop.hbase.regionserver.TestHRegionWithIdxRegionNoIndexes
    [junit] Tests run: 41, Failures: 0, Errors: 0, Time elapsed: 24.671 sec
    [junit] Running org.apache.hadoop.hbase.regionserver.TestIdxExpressionEvaluator
    [junit] Tests run: 12, Failures: 0, Errors: 0, Time elapsed: 0.145 sec
    [junit] Running org.apache.hadoop.hbase.regionserver.TestIdxRegion
    [junit] Tests run: 13, Failures: 0, Errors: 0, Time elapsed: 9.561 sec
    [junit] Running org.apache.hadoop.hbase.regionserver.TestIdxRegionIndexManager
    [junit] Tests run: 1, Failures: 0, Errors: 0, Time elapsed: 0.194 sec
    [junit] Running org.apache.hadoop.hbase.regionserver.TestIdxRegionMBeanImpl
    [junit] Tests run: 2, Failures: 0, Errors: 0, Time elapsed: 0.102 sec
    [junit] Running org.apache.hadoop.hbase.regionserver.TestIdxRegionPerformance
    [junit] Tests run: 1, Failures: 0, Errors: 0, Time elapsed: 2.032 sec
    [junit] Running org.apache.hadoop.hbase.regionserver.idx.support.TestBits
    [junit] Tests run: 4, Failures: 0, Errors: 0, Time elapsed: 1.637 sec
    [junit] Running org.apache.hadoop.hbase.regionserver.idx.support.TestIdxClassSize
    [junit] Tests run: 1, Failures: 0, Errors: 0, Time elapsed: 0.19 sec
    [junit] Running org.apache.hadoop.hbase.regionserver.idx.support.arrays.TestBigDecimalArrayList
    [junit] Tests run: 13, Failures: 0, Errors: 0, Time elapsed: 0.32 sec
    [junit] Running org.apache.hadoop.hbase.regionserver.idx.support.arrays.TestByteArrayArrayList
    [junit] Tests run: 13, Failures: 0, Errors: 0, Time elapsed: 0.27 sec
    [junit] Running org.apache.hadoop.hbase.regionserver.idx.support.arrays.TestByteArrayList
    [junit] Tests run: 13, Failures: 0, Errors: 0, Time elapsed: 0.272 sec
    [junit] Running org.apache.hadoop.hbase.regionserver.idx.support.arrays.TestCharArrayArrayList
    [junit] Tests run: 13, Failures: 0, Errors: 0, Time elapsed: 0.27 sec
    [junit] Running org.apache.hadoop.hbase.regionserver.idx.support.arrays.TestCharArrayList
    [junit] Tests run: 13, Failures: 0, Errors: 0, Time elapsed: 0.278 sec
    [junit] Running org.apache.hadoop.hbase.regionserver.idx.support.arrays.TestDoubleArrayList
    [junit] Tests run: 13, Failures: 0, Errors: 0, Time elapsed: 0.33 sec
    [junit] Running org.apache.hadoop.hbase.regionserver.idx.support.arrays.TestFloatArrayList
    [junit] Tests run: 13, Failures: 0, Errors: 0, Time elapsed: 0.273 sec
    [junit] Running org.apache.hadoop.hbase.regionserver.idx.support.arrays.TestIntegerArrayList
    [junit] Tests run: 13, Failures: 0, Errors: 0, Time elapsed: 0.275 sec
    [junit] Running org.apache.hadoop.hbase.regionserver.idx.support.arrays.TestLongArrayList
    [junit] Tests run: 13, Failures: 0, Errors: 0, Time elapsed: 0.271 sec
    [junit] Running org.apache.hadoop.hbase.regionserver.idx.support.arrays.TestShortArrayList
    [junit] Tests run: 13, Failures: 0, Errors: 0, Time elapsed: 0.275 sec
    [junit] Running org.apache.hadoop.hbase.regionserver.idx.support.sets.TestBitSet
    [junit] Tests run: 11, Failures: 1, Errors: 0, Time elapsed: 0.277 sec
    [junit] Test org.apache.hadoop.hbase.regionserver.idx.support.sets.TestBitSet FAILED
    [junit] Running org.apache.hadoop.hbase.regionserver.idx.support.sets.TestSparseBitSet
    [junit] Tests run: 11, Failures: 0, Errors: 0, Time elapsed: 0.27 sec

BUILD FAILED
<http://hudson.zones.apache.org/hudson/job/hbase-020-branch/ws/trunk/build.xml>:522:
The following error occurred while executing this line:
<http://hudson.zones.apache.org/hudson/job/hbase-020-branch/ws/trunk/src/contrib/build.xml>:54:
The following error occurred while executing this line:
<http://hudson.zones.apache.org/hudson/job/hbase-020-branch/ws/trunk/src/contrib/build-contrib.xml>:284:
Tests failed!

Total time: 49 minutes 44 seconds
[locks-and-latches] Releasing all the locks
[locks-and-latches] All the locks released
Recording test results


Mime
View raw message