hbase-dev mailing list archives

Site index · List index
Message view « Date » · « Thread »
Top « Date » · « Thread »
From Apache Hudson Server <hud...@hudson.zones.apache.org>
Subject Build failed in Hudson: hbase-020-branch #5
Date Thu, 11 Mar 2010 17:18:17 GMT
See <http://hudson.zones.apache.org/hudson/job/hbase-020-branch/5/>

------------------------------------------
[...truncated 286 lines...]
    [junit] Tests run: 2, Failures: 0, Errors: 0, Time elapsed: 59.126 sec
    [junit] Running org.apache.hadoop.hbase.client.TestGetRowVersions
    [junit] Tests run: 1, Failures: 0, Errors: 0, Time elapsed: 36.255 sec
    [junit] Running org.apache.hadoop.hbase.client.TestHBaseAdmin
    [junit] Tests run: 3, Failures: 0, Errors: 0, Time elapsed: 96.205 sec
    [junit] Running org.apache.hadoop.hbase.client.TestHTable
    [junit] Tests run: 6, Failures: 0, Errors: 0, Time elapsed: 132.295 sec
    [junit] Running org.apache.hadoop.hbase.client.TestHTablePool
    [junit] Tests run: 4, Failures: 0, Errors: 0, Time elapsed: 0.178 sec
    [junit] Running org.apache.hadoop.hbase.client.TestListTables
    [junit] Tests run: 1, Failures: 0, Errors: 0, Time elapsed: 30.191 sec
    [junit] Running org.apache.hadoop.hbase.client.TestOldAPIGetRowVersions
    [junit] Tests run: 1, Failures: 0, Errors: 0, Time elapsed: 35.068 sec
    [junit] Running org.apache.hadoop.hbase.client.TestOldAPIHTable
    [junit] Tests run: 5, Failures: 0, Errors: 0, Time elapsed: 105.054 sec
    [junit] Running org.apache.hadoop.hbase.client.TestOldAPITimestamp
    [junit] Tests run: 1, Failures: 0, Errors: 0, Time elapsed: 20.35 sec
    [junit] Running org.apache.hadoop.hbase.client.TestPut
    [junit] Tests run: 5, Failures: 0, Errors: 0, Time elapsed: 114.013 sec
    [junit] Running org.apache.hadoop.hbase.client.TestScannerTimes
    [junit] Tests run: 1, Failures: 0, Errors: 0, Time elapsed: 36.404 sec
    [junit] Running org.apache.hadoop.hbase.client.TestTimestamp
    [junit] Tests run: 1, Failures: 0, Errors: 0, Time elapsed: 20.512 sec
    [junit] Running org.apache.hadoop.hbase.filter.TestFilter
    [junit] Tests run: 14, Failures: 0, Errors: 0, Time elapsed: 1.876 sec
    [junit] Running org.apache.hadoop.hbase.filter.TestFilterAcrossRegions
    [junit] Tests run: 1, Failures: 0, Errors: 0, Time elapsed: 0.554 sec
    [junit] Running org.apache.hadoop.hbase.filter.TestFilterList
    [junit] Tests run: 4, Failures: 0, Errors: 0, Time elapsed: 0.211 sec
    [junit] Running org.apache.hadoop.hbase.filter.TestInclusiveStopFilter
    [junit] Tests run: 2, Failures: 0, Errors: 0, Time elapsed: 0.006 sec
    [junit] Running org.apache.hadoop.hbase.filter.TestPageFilter
    [junit] Tests run: 2, Failures: 0, Errors: 0, Time elapsed: 0.005 sec
    [junit] Running org.apache.hadoop.hbase.filter.TestPrefixFilter
    [junit] Tests run: 3, Failures: 0, Errors: 0, Time elapsed: 0.009 sec
    [junit] Running org.apache.hadoop.hbase.filter.TestSingleColumnValueFilter
    [junit] Tests run: 2, Failures: 0, Errors: 0, Time elapsed: 0.12 sec
    [junit] Running org.apache.hadoop.hbase.io.TestHbaseObjectWritable
    [junit] Tests run: 1, Failures: 0, Errors: 0, Time elapsed: 0.167 sec
    [junit] Running org.apache.hadoop.hbase.io.TestHeapSize
    [junit] Tests run: 2, Failures: 0, Errors: 0, Time elapsed: 0.047 sec
    [junit] Running org.apache.hadoop.hbase.io.hfile.TestCachedBlockQueue
    [junit] Tests run: 2, Failures: 0, Errors: 0, Time elapsed: 0.086 sec
    [junit] Running org.apache.hadoop.hbase.io.hfile.TestHFile
    [junit] Tests run: 7, Failures: 0, Errors: 0, Time elapsed: 0.418 sec
    [junit] Running org.apache.hadoop.hbase.io.hfile.TestHFilePerformance
    [junit] Tests run: 1, Failures: 0, Errors: 0, Time elapsed: 7.832 sec
    [junit] Running org.apache.hadoop.hbase.io.hfile.TestHFileSeek
    [junit] Tests run: 1, Failures: 0, Errors: 0, Time elapsed: 5.371 sec
    [junit] Running org.apache.hadoop.hbase.io.hfile.TestLruBlockCache
    [junit] Tests run: 7, Failures: 0, Errors: 0, Time elapsed: 1.114 sec
    [junit] Running org.apache.hadoop.hbase.io.hfile.TestSeekTo
    [junit] Tests run: 3, Failures: 0, Errors: 0, Time elapsed: 0.304 sec
    [junit] Running org.apache.hadoop.hbase.mapred.TestTableIndex
    [junit] Tests run: 1, Failures: 0, Errors: 0, Time elapsed: 75.651 sec
    [junit] Running org.apache.hadoop.hbase.mapred.TestTableMapReduce
    [junit] Tests run: 1, Failures: 0, Errors: 0, Time elapsed: 68.835 sec
    [junit] Running org.apache.hadoop.hbase.mapreduce.TestHFileOutputFormat
    [junit] Tests run: 1, Failures: 0, Errors: 0, Time elapsed: 5.36 sec
    [junit] Running org.apache.hadoop.hbase.mapreduce.TestTableIndex
    [junit] Tests run: 1, Failures: 0, Errors: 0, Time elapsed: 61.649 sec
    [junit] Running org.apache.hadoop.hbase.mapreduce.TestTableMapReduce
    [junit] Tests run: 1, Failures: 0, Errors: 0, Time elapsed: 72.156 sec
    [junit] Running org.apache.hadoop.hbase.mapreduce.TestTimeRangeMapRed
    [junit] Tests run: 1, Failures: 0, Errors: 0, Time elapsed: 46.171 sec
    [junit] Running org.apache.hadoop.hbase.master.TestMinimumServerCount
    [junit] Tests run: 1, Failures: 0, Errors: 0, Time elapsed: 45.184 sec
    [junit] Running org.apache.hadoop.hbase.master.TestRegionManager
    [junit] Tests run: 1, Failures: 0, Errors: 0, Time elapsed: 34.483 sec
    [junit] Running org.apache.hadoop.hbase.metrics.TestMetricsMBeanBase
    [junit] Tests run: 2, Failures: 0, Errors: 0, Time elapsed: 0.09 sec
    [junit] Running org.apache.hadoop.hbase.regionserver.TestCompaction
    [junit] Tests run: 2, Failures: 0, Errors: 0, Time elapsed: 34.855 sec
    [junit] Running org.apache.hadoop.hbase.regionserver.TestDeleteCompare
    [junit] Tests run: 4, Failures: 0, Errors: 0, Time elapsed: 0.091 sec
    [junit] Running org.apache.hadoop.hbase.regionserver.TestExplicitColumnTracker
    [junit] Tests run: 3, Failures: 0, Errors: 0, Time elapsed: 0.565 sec
    [junit] Running org.apache.hadoop.hbase.regionserver.TestGetClosestAtOrBefore
    [junit] Tests run: 3, Failures: 0, Errors: 0, Time elapsed: 13.784 sec
    [junit] Running org.apache.hadoop.hbase.regionserver.TestGetDeleteTracker
    [junit] Tests run: 7, Failures: 0, Errors: 0, Time elapsed: 0.026 sec
    [junit] Running org.apache.hadoop.hbase.regionserver.TestHLog
    [junit] Tests run: 3, Failures: 0, Errors: 0, Time elapsed: 14.373 sec
    [junit] Running org.apache.hadoop.hbase.regionserver.TestHRegion
    [junit] Tests run: 41, Failures: 0, Errors: 0, Time elapsed: 30.442 sec
    [junit] Running org.apache.hadoop.hbase.regionserver.TestHRegionInfo
    [junit] Tests run: 1, Failures: 0, Errors: 0, Time elapsed: 0.152 sec
    [junit] Running org.apache.hadoop.hbase.regionserver.TestKeyValueHeap
    [junit] Tests run: 3, Failures: 0, Errors: 0, Time elapsed: 0.014 sec
    [junit] Running org.apache.hadoop.hbase.regionserver.TestKeyValueScanFixture
    [junit] Tests run: 1, Failures: 0, Errors: 0, Time elapsed: 0.082 sec
    [junit] Running org.apache.hadoop.hbase.regionserver.TestKeyValueSkipListSet
    [junit] Tests run: 4, Failures: 0, Errors: 0, Time elapsed: 0.009 sec
    [junit] Running org.apache.hadoop.hbase.regionserver.TestLogRolling
    [junit] Tests run: 2, Failures: 0, Errors: 0, Time elapsed: 108.366 sec
    [junit] Running org.apache.hadoop.hbase.regionserver.TestLruHashMap
    [junit] Tests run: 9, Failures: 0, Errors: 0, Time elapsed: 1.604 sec
    [junit] Running org.apache.hadoop.hbase.regionserver.TestMemStore
    [junit] Tests run: 17, Failures: 0, Errors: 0, Time elapsed: 0.212 sec
    [junit] Running org.apache.hadoop.hbase.regionserver.TestMinorCompactingStoreScanner
    [junit] Tests run: 2, Failures: 0, Errors: 0, Time elapsed: 0.081 sec
    [junit] Running org.apache.hadoop.hbase.regionserver.TestQueryMatcher
    [junit] Tests run: 4, Failures: 0, Errors: 0, Time elapsed: 0.019 sec
    [junit] Running org.apache.hadoop.hbase.regionserver.TestScanDeleteTracker
    [junit] Tests run: 6, Failures: 0, Errors: 0, Time elapsed: 0.007 sec
    [junit] Running org.apache.hadoop.hbase.regionserver.TestScanWildcardColumnTracker
    [junit] Tests run: 2, Failures: 0, Errors: 0, Time elapsed: 0.146 sec
    [junit] Running org.apache.hadoop.hbase.regionserver.TestScanner
    [junit] Tests run: 6, Failures: 0, Errors: 0, Time elapsed: 27.997 sec
    [junit] Running org.apache.hadoop.hbase.regionserver.TestStore
    [junit] Tests run: 5, Failures: 0, Errors: 0, Time elapsed: 0.822 sec
    [junit] Running org.apache.hadoop.hbase.regionserver.TestStoreFile
    [junit] Tests run: 2, Failures: 0, Errors: 0, Time elapsed: 11.541 sec
    [junit] Running org.apache.hadoop.hbase.regionserver.TestStoreScanner
    [junit] Tests run: 13, Failures: 0, Errors: 0, Time elapsed: 0.1 sec
    [junit] Running org.apache.hadoop.hbase.regionserver.TestWildcardColumnTracker
    [junit] Tests run: 6, Failures: 0, Errors: 0, Time elapsed: 0.409 sec
    [junit] Running org.apache.hadoop.hbase.thrift.TestThriftServer
    [junit] Tests run: 1, Failures: 0, Errors: 0, Time elapsed: 88.5 sec
    [junit] Running org.apache.hadoop.hbase.util.TestBase64
    [junit] Tests run: 1, Failures: 0, Errors: 0, Time elapsed: 0.071 sec
    [junit] Running org.apache.hadoop.hbase.util.TestBytes
    [junit] Tests run: 11, Failures: 0, Errors: 0, Time elapsed: 0.036 sec
    [junit] Running org.apache.hadoop.hbase.util.TestKeying
    [junit] Tests run: 1, Failures: 0, Errors: 0, Time elapsed: 0.006 sec
    [junit] Running org.apache.hadoop.hbase.util.TestMergeTool
    [junit] Tests run: 1, Failures: 0, Errors: 0, Time elapsed: 12.525 sec
    [junit] Running org.apache.hadoop.hbase.util.TestMigration
    [junit] Tests run: 1, Failures: 0, Errors: 0, Time elapsed: 19.16 sec
    [junit] Running org.apache.hadoop.hbase.util.TestPair
    [junit] Tests run: 9, Failures: 0, Errors: 0, Time elapsed: 0.232 sec
    [junit] Running org.apache.hadoop.hbase.util.TestRootPath
    [junit] Tests run: 1, Failures: 0, Errors: 0, Time elapsed: 0.013 sec

test-contrib:

test:

compile:

compile-examples:

compile-test:

test:

clover.setup:

clover.info:
     [echo] 
     [echo]       Clover not found. Code coverage reports disabled.
     [echo]     

clover:

check-contrib:

init:
     [echo] contrib: indexed

init-contrib:

compile:
     [echo] contrib: indexed

compile-examples:

compile-test:
     [echo] contrib: indexed
    [javac] Compiling 32 source files to <http://hudson.zones.apache.org/hudson/job/hbase-020-branch/ws/trunk/build/contrib/indexed/test>
    [javac] Note: <http://hudson.zones.apache.org/hudson/job/hbase-020-branch/ws/trunk/src/contrib/indexed/src/test/org/apache/hadoop/hbase/regionserver/TestIdxRegion.java>
uses unchecked or unsafe operations.
    [javac] Note: Recompile with -Xlint:unchecked for details.

test:
     [echo] contrib: indexed
   [delete] Deleting directory <http://hudson.zones.apache.org/hudson/job/hbase-020-branch/ws/trunk/build/contrib/indexed/test/logs>
    [mkdir] Created dir: <http://hudson.zones.apache.org/hudson/job/hbase-020-branch/ws/trunk/build/contrib/indexed/test/logs>
    [junit] Running org.apache.hadoop.hbase.TestIdxHBaseCluster
    [junit] Tests run: 2, Failures: 0, Errors: 0, Time elapsed: 121.298 sec
    [junit] Running org.apache.hadoop.hbase.TestIdxMasterAdmin
    [junit] Tests run: 1, Failures: 0, Errors: 0, Time elapsed: 25.265 sec
    [junit] Running org.apache.hadoop.hbase.TestWritableHelper
    [junit] Tests run: 6, Failures: 0, Errors: 0, Time elapsed: 0.02 sec
    [junit] Running org.apache.hadoop.hbase.client.idx.TestIdxColumnDescriptor
    [junit] Tests run: 8, Failures: 0, Errors: 0, Time elapsed: 0.099 sec
    [junit] Running org.apache.hadoop.hbase.client.idx.TestIdxIndexDescriptor
    [junit] Tests run: 2, Failures: 0, Errors: 0, Time elapsed: 0.084 sec
    [junit] Running org.apache.hadoop.hbase.client.idx.TestIdxScan
    [junit] Tests run: 2, Failures: 0, Errors: 0, Time elapsed: 0.027 sec
    [junit] Running org.apache.hadoop.hbase.client.idx.exp.TestComparison
    [junit] Tests run: 4, Failures: 0, Errors: 0, Time elapsed: 0.022 sec
    [junit] Running org.apache.hadoop.hbase.client.idx.exp.TestExpression
    [junit] Tests run: 2, Failures: 0, Errors: 0, Time elapsed: 0.036 sec
    [junit] Running org.apache.hadoop.hbase.regionserver.TestCompleteIndex
    [junit] Tests run: 5, Failures: 1, Errors: 0, Time elapsed: 0.21 sec
    [junit] Test org.apache.hadoop.hbase.regionserver.TestCompleteIndex FAILED
    [junit] Running org.apache.hadoop.hbase.regionserver.TestHRegionWithIdxRegion
    [junit] Tests run: 41, Failures: 0, Errors: 0, Time elapsed: 23.954 sec
    [junit] Running org.apache.hadoop.hbase.regionserver.TestHRegionWithIdxRegionNoIndexes
    [junit] Tests run: 41, Failures: 0, Errors: 0, Time elapsed: 24.399 sec
    [junit] Running org.apache.hadoop.hbase.regionserver.TestIdxExpressionEvaluator
    [junit] Tests run: 12, Failures: 0, Errors: 0, Time elapsed: 0.149 sec
    [junit] Running org.apache.hadoop.hbase.regionserver.TestIdxRegion
    [junit] Tests run: 13, Failures: 0, Errors: 0, Time elapsed: 9.674 sec
    [junit] Running org.apache.hadoop.hbase.regionserver.TestIdxRegionIndexManager
    [junit] Tests run: 1, Failures: 0, Errors: 0, Time elapsed: 0.145 sec
    [junit] Running org.apache.hadoop.hbase.regionserver.TestIdxRegionMBeanImpl
    [junit] Tests run: 2, Failures: 0, Errors: 0, Time elapsed: 0.105 sec
    [junit] Running org.apache.hadoop.hbase.regionserver.TestIdxRegionPerformance
    [junit] Tests run: 1, Failures: 0, Errors: 0, Time elapsed: 2.045 sec
    [junit] Running org.apache.hadoop.hbase.regionserver.idx.support.TestBits
    [junit] Tests run: 4, Failures: 0, Errors: 0, Time elapsed: 1.63 sec
    [junit] Running org.apache.hadoop.hbase.regionserver.idx.support.TestIdxClassSize
    [junit] Tests run: 1, Failures: 0, Errors: 0, Time elapsed: 0.141 sec
    [junit] Running org.apache.hadoop.hbase.regionserver.idx.support.arrays.TestBigDecimalArrayList
    [junit] Tests run: 13, Failures: 0, Errors: 0, Time elapsed: 0.557 sec
    [junit] Running org.apache.hadoop.hbase.regionserver.idx.support.arrays.TestByteArrayArrayList
    [junit] Tests run: 13, Failures: 0, Errors: 0, Time elapsed: 0.269 sec
    [junit] Running org.apache.hadoop.hbase.regionserver.idx.support.arrays.TestByteArrayList
    [junit] Tests run: 13, Failures: 0, Errors: 0, Time elapsed: 0.269 sec
    [junit] Running org.apache.hadoop.hbase.regionserver.idx.support.arrays.TestCharArrayArrayList
    [junit] Tests run: 13, Failures: 0, Errors: 0, Time elapsed: 0.278 sec
    [junit] Running org.apache.hadoop.hbase.regionserver.idx.support.arrays.TestCharArrayList
    [junit] Tests run: 13, Failures: 0, Errors: 0, Time elapsed: 0.268 sec
    [junit] Running org.apache.hadoop.hbase.regionserver.idx.support.arrays.TestDoubleArrayList
    [junit] Tests run: 13, Failures: 0, Errors: 0, Time elapsed: 0.266 sec
    [junit] Running org.apache.hadoop.hbase.regionserver.idx.support.arrays.TestFloatArrayList
    [junit] Tests run: 13, Failures: 0, Errors: 0, Time elapsed: 0.268 sec
    [junit] Running org.apache.hadoop.hbase.regionserver.idx.support.arrays.TestIntegerArrayList
    [junit] Tests run: 13, Failures: 0, Errors: 0, Time elapsed: 0.272 sec
    [junit] Running org.apache.hadoop.hbase.regionserver.idx.support.arrays.TestLongArrayList
    [junit] Tests run: 13, Failures: 0, Errors: 0, Time elapsed: 0.272 sec
    [junit] Running org.apache.hadoop.hbase.regionserver.idx.support.arrays.TestShortArrayList
    [junit] Tests run: 13, Failures: 0, Errors: 0, Time elapsed: 0.269 sec
    [junit] Running org.apache.hadoop.hbase.regionserver.idx.support.sets.TestBitSet
    [junit] Tests run: 11, Failures: 1, Errors: 0, Time elapsed: 0.277 sec
    [junit] Test org.apache.hadoop.hbase.regionserver.idx.support.sets.TestBitSet FAILED
    [junit] Running org.apache.hadoop.hbase.regionserver.idx.support.sets.TestSparseBitSet
    [junit] Tests run: 11, Failures: 0, Errors: 0, Time elapsed: 0.318 sec

BUILD FAILED
<http://hudson.zones.apache.org/hudson/job/hbase-020-branch/ws/trunk/build.xml>:522:
The following error occurred while executing this line:
<http://hudson.zones.apache.org/hudson/job/hbase-020-branch/ws/trunk/src/contrib/build.xml>:54:
The following error occurred while executing this line:
<http://hudson.zones.apache.org/hudson/job/hbase-020-branch/ws/trunk/src/contrib/build-contrib.xml>:284:
Tests failed!

Total time: 47 minutes 19 seconds
[locks-and-latches] Releasing all the locks
[locks-and-latches] All the locks released
Recording test results


Mime
View raw message