hbase-dev mailing list archives

Site index · List index
Message view « Date » · « Thread »
Top « Date » · « Thread »
From Apache Hudson Server <hud...@hudson.zones.apache.org>
Subject Build failed in Hudson: HBase-Patch #1153
Date Tue, 09 Mar 2010 22:39:12 GMT
See <http://hudson.zones.apache.org/hudson/job/HBase-Patch/1153/changes>

Changes:

[stack] HBASE-2295 Row locks may deadlock with themselves

------------------------------------------
[...truncated 384 lines...]

[WARNING] <http://hudson.zones.apache.org/hudson/job/HBase-Patch/ws/trunk/core/src/test/java/org/apache/hadoop/hbase/regionserver/TestHRegion.java>:[56,33]
[deprecation] org.apache.hadoop.hbase.HBaseTestCase in org.apache.hadoop.hbase has been deprecated

[WARNING] <http://hudson.zones.apache.org/hudson/job/HBase-Patch/ws/trunk/core/src/test/java/org/apache/hadoop/hbase/util/DisabledTestMetaUtils.java>:[22,30]
[deprecation] org.apache.hadoop.hbase.HBaseClusterTestCase in org.apache.hadoop.hbase has
been deprecated

[WARNING] <http://hudson.zones.apache.org/hudson/job/HBase-Patch/ws/trunk/core/src/test/java/org/apache/hadoop/hbase/util/DisabledTestMetaUtils.java>:[33,43]
[deprecation] org.apache.hadoop.hbase.HBaseClusterTestCase in org.apache.hadoop.hbase has
been deprecated

[WARNING] <http://hudson.zones.apache.org/hudson/job/HBase-Patch/ws/trunk/core/src/test/java/org/apache/hadoop/hbase/TestSerialization.java>:[51,39]
[deprecation] org.apache.hadoop.hbase.HBaseTestCase in org.apache.hadoop.hbase has been deprecated

[WARNING] <http://hudson.zones.apache.org/hudson/job/HBase-Patch/ws/trunk/core/src/test/java/org/apache/hadoop/hbase/regionserver/wal/TestHLog.java>:[25,30]
[deprecation] org.apache.hadoop.hbase.HBaseTestCase in org.apache.hadoop.hbase has been deprecated

[WARNING] <http://hudson.zones.apache.org/hudson/job/HBase-Patch/ws/trunk/core/src/test/java/org/apache/hadoop/hbase/regionserver/wal/TestHLog.java>:[40,30]
[deprecation] org.apache.hadoop.hbase.HBaseTestCase in org.apache.hadoop.hbase has been deprecated

[WARNING] <http://hudson.zones.apache.org/hudson/job/HBase-Patch/ws/trunk/core/src/test/java/org/apache/hadoop/hbase/client/TestTimestamp.java>:[23,30]
[deprecation] org.apache.hadoop.hbase.HBaseClusterTestCase in org.apache.hadoop.hbase has
been deprecated

[WARNING] <http://hudson.zones.apache.org/hudson/job/HBase-Patch/ws/trunk/core/src/test/java/org/apache/hadoop/hbase/client/TestTimestamp.java>:[33,35]
[deprecation] org.apache.hadoop.hbase.HBaseClusterTestCase in org.apache.hadoop.hbase has
been deprecated

[WARNING] <http://hudson.zones.apache.org/hudson/job/HBase-Patch/ws/trunk/core/src/test/java/org/apache/hadoop/hbase/regionserver/TestCompaction.java>:[29,30]
[deprecation] org.apache.hadoop.hbase.HBaseTestCase in org.apache.hadoop.hbase has been deprecated

[WARNING] <http://hudson.zones.apache.org/hudson/job/HBase-Patch/ws/trunk/core/src/test/java/org/apache/hadoop/hbase/regionserver/TestCompaction.java>:[46,36]
[deprecation] org.apache.hadoop.hbase.HBaseTestCase in org.apache.hadoop.hbase has been deprecated

[WARNING] <http://hudson.zones.apache.org/hudson/job/HBase-Patch/ws/trunk/core/src/test/java/org/apache/hadoop/hbase/regionserver/TestGetClosestAtOrBefore.java>:[30,30]
[deprecation] org.apache.hadoop.hbase.HBaseTestCase in org.apache.hadoop.hbase has been deprecated

[WARNING] <http://hudson.zones.apache.org/hudson/job/HBase-Patch/ws/trunk/core/src/test/java/org/apache/hadoop/hbase/regionserver/TestGetClosestAtOrBefore.java>:[47,46]
[deprecation] org.apache.hadoop.hbase.HBaseTestCase in org.apache.hadoop.hbase has been deprecated

[WARNING] <http://hudson.zones.apache.org/hudson/job/HBase-Patch/ws/trunk/core/src/test/java/org/apache/hadoop/hbase/TestZooKeeper.java>:[139,37]
[deprecation] HBaseConfiguration(org.apache.hadoop.conf.Configuration) in org.apache.hadoop.hbase.HBaseConfiguration
has been deprecated

[WARNING] <http://hudson.zones.apache.org/hudson/job/HBase-Patch/ws/trunk/core/src/test/java/org/apache/hadoop/hbase/io/hfile/KeySampler.java>:[54,24]
[deprecation] get() in org.apache.hadoop.io.BytesWritable has been deprecated

[WARNING] <http://hudson.zones.apache.org/hudson/job/HBase-Patch/ws/trunk/core/src/test/java/org/apache/hadoop/hbase/io/hfile/KeySampler.java>:[56,18]
[deprecation] get() in org.apache.hadoop.io.BytesWritable has been deprecated

[WARNING] <http://hudson.zones.apache.org/hudson/job/HBase-Patch/ws/trunk/core/src/test/java/org/apache/hadoop/hbase/io/hfile/TestHFilePerformance.java>:[196,38]
[deprecation] getSize() in org.apache.hadoop.io.BytesWritable has been deprecated

[WARNING] <http://hudson.zones.apache.org/hudson/job/HBase-Patch/ws/trunk/core/src/test/java/org/apache/hadoop/hbase/io/hfile/TestHFilePerformance.java>:[201,38]
[deprecation] getSize() in org.apache.hadoop.io.BytesWritable has been deprecated

[WARNING] <http://hudson.zones.apache.org/hudson/job/HBase-Patch/ws/trunk/core/src/test/java/org/apache/hadoop/hbase/io/hfile/TestHFilePerformance.java>:[273,34]
[deprecation] getSize() in org.apache.hadoop.io.BytesWritable has been deprecated

[WARNING] <http://hudson.zones.apache.org/hudson/job/HBase-Patch/ws/trunk/core/src/test/java/org/apache/hadoop/hbase/io/hfile/TestHFilePerformance.java>:[273,53]
[deprecation] getSize() in org.apache.hadoop.io.BytesWritable has been deprecated

[WARNING] <http://hudson.zones.apache.org/hudson/job/HBase-Patch/ws/trunk/core/src/test/java/org/apache/hadoop/hbase/regionserver/TestStore.java>:[78,30]
[deprecation] HBaseConfiguration() in org.apache.hadoop.hbase.HBaseConfiguration has been
deprecated

[WARNING] <http://hudson.zones.apache.org/hudson/job/HBase-Patch/ws/trunk/core/src/test/java/org/apache/hadoop/hbase/regionserver/TestStore.java>:[115,27]
[deprecation] HBaseConfiguration() in org.apache.hadoop.hbase.HBaseConfiguration has been
deprecated

[WARNING] <http://hudson.zones.apache.org/hudson/job/HBase-Patch/ws/trunk/core/src/test/java/org/apache/hadoop/hbase/mapreduce/TestTimeRangeMapRed.java>:[132,27]
[deprecation] HBaseConfiguration(org.apache.hadoop.conf.Configuration) in org.apache.hadoop.hbase.HBaseConfiguration
has been deprecated

[WARNING] <http://hudson.zones.apache.org/hudson/job/HBase-Patch/ws/trunk/core/src/test/java/org/apache/hadoop/hbase/mapreduce/TestTimeRangeMapRed.java>:[161,12]
[deprecation] Job(org.apache.hadoop.conf.Configuration,java.lang.String) in org.apache.hadoop.mapreduce.Job
has been deprecated

[WARNING] <http://hudson.zones.apache.org/hudson/job/HBase-Patch/ws/trunk/core/src/test/java/org/apache/hadoop/hbase/io/hfile/KVGenerator.java>:[67,33]
[deprecation] get() in org.apache.hadoop.io.BytesWritable has been deprecated

[WARNING] <http://hudson.zones.apache.org/hudson/job/HBase-Patch/ws/trunk/core/src/test/java/org/apache/hadoop/hbase/io/hfile/KVGenerator.java>:[71,50]
[deprecation] get() in org.apache.hadoop.io.BytesWritable has been deprecated

[WARNING] <http://hudson.zones.apache.org/hudson/job/HBase-Patch/ws/trunk/core/src/test/java/org/apache/hadoop/hbase/io/hfile/KVGenerator.java>:[72,12]
[deprecation] getSize() in org.apache.hadoop.io.BytesWritable has been deprecated

[WARNING] <http://hudson.zones.apache.org/hudson/job/HBase-Patch/ws/trunk/core/src/test/java/org/apache/hadoop/hbase/io/hfile/KVGenerator.java>:[73,28]
[deprecation] get() in org.apache.hadoop.io.BytesWritable has been deprecated

[WARNING] <http://hudson.zones.apache.org/hudson/job/HBase-Patch/ws/trunk/core/src/test/java/org/apache/hadoop/hbase/io/hfile/KVGenerator.java>:[73,50]
[deprecation] getSize() in org.apache.hadoop.io.BytesWritable has been deprecated

[WARNING] <http://hudson.zones.apache.org/hudson/job/HBase-Patch/ws/trunk/core/src/test/java/org/apache/hadoop/hbase/io/hfile/KVGenerator.java>:[77,33]
[deprecation] get() in org.apache.hadoop.io.BytesWritable has been deprecated

[WARNING] <http://hudson.zones.apache.org/hudson/job/HBase-Patch/ws/trunk/core/src/test/java/org/apache/hadoop/hbase/io/hfile/KVGenerator.java>:[88,33]
[deprecation] get() in org.apache.hadoop.io.BytesWritable has been deprecated

[WARNING] <http://hudson.zones.apache.org/hudson/job/HBase-Patch/ws/trunk/core/src/test/java/org/apache/hadoop/hbase/mapred/TestTableMapReduce.java>:[126,4]
[deprecation] org.apache.hadoop.mapred.JobConf in org.apache.hadoop.mapred has been deprecated

[WARNING] <http://hudson.zones.apache.org/hudson/job/HBase-Patch/ws/trunk/core/src/test/java/org/apache/hadoop/hbase/mapred/TestTableMapReduce.java>:[129,20]
[deprecation] org.apache.hadoop.mapred.JobConf in org.apache.hadoop.mapred has been deprecated

[WARNING] <http://hudson.zones.apache.org/hudson/job/HBase-Patch/ws/trunk/core/src/test/java/org/apache/hadoop/hbase/mapred/TestTableMapReduce.java>:[132,6]
[deprecation] org.apache.hadoop.hbase.mapred.TableMapReduceUtil in org.apache.hadoop.hbase.mapred
has been deprecated

[WARNING] <http://hudson.zones.apache.org/hudson/job/HBase-Patch/ws/trunk/core/src/test/java/org/apache/hadoop/hbase/mapred/TestTableMapReduce.java>:[136,8]
[deprecation] org.apache.hadoop.hbase.mapred.IdentityTableReduce in org.apache.hadoop.hbase.mapred
has been deprecated

[WARNING] <http://hudson.zones.apache.org/hudson/job/HBase-Patch/ws/trunk/core/src/test/java/org/apache/hadoop/hbase/mapred/TestTableMapReduce.java>:[135,6]
[deprecation] org.apache.hadoop.hbase.mapred.TableMapReduceUtil in org.apache.hadoop.hbase.mapred
has been deprecated

[INFO] [surefire:test {execution: default-test}]
[INFO] Surefire report directory: <http://hudson.zones.apache.org/hudson/job/HBase-Patch/ws/trunk/core/target/surefire-reports>

-------------------------------------------------------
 T E S T S
-------------------------------------------------------
Running org.apache.hadoop.hbase.TestFullLogReconstruction
Tests run: 1, Failures: 0, Errors: 0, Skipped: 0, Time elapsed: 184.395 sec
Running org.apache.hadoop.hbase.TestSerialization
Tests run: 18, Failures: 0, Errors: 0, Skipped: 0, Time elapsed: 10.949 sec
Running org.apache.hadoop.hbase.TestZooKeeper
Tests run: 4, Failures: 0, Errors: 0, Skipped: 0, Time elapsed: 107.217 sec
Running org.apache.hadoop.hbase.regionserver.wal.TestLogRolling
Tests run: 1, Failures: 0, Errors: 0, Skipped: 0, Time elapsed: 78.324 sec
Running org.apache.hadoop.hbase.io.hfile.TestCachedBlockQueue
Tests run: 2, Failures: 0, Errors: 0, Skipped: 0, Time elapsed: 0.092 sec
Running org.apache.hadoop.hbase.regionserver.TestKeyValueHeap
Tests run: 3, Failures: 0, Errors: 0, Skipped: 0, Time elapsed: 0.451 sec
Running org.apache.hadoop.hbase.regionserver.TestStoreScanner
Tests run: 13, Failures: 0, Errors: 0, Skipped: 0, Time elapsed: 0.116 sec
Running org.apache.hadoop.hbase.TestHMsg
Tests run: 2, Failures: 0, Errors: 0, Skipped: 0, Time elapsed: 0.061 sec
Running org.apache.hadoop.hbase.filter.TestPrefixFilter
Tests run: 3, Failures: 0, Errors: 0, Skipped: 0, Time elapsed: 0.043 sec
Running org.apache.hadoop.hbase.util.TestKeying
Tests run: 1, Failures: 0, Errors: 0, Skipped: 0, Time elapsed: 0.038 sec
Running org.apache.hadoop.hbase.regionserver.TestScanner
Tests run: 5, Failures: 0, Errors: 0, Skipped: 0, Time elapsed: 29.338 sec
Running org.apache.hadoop.hbase.regionserver.TestHRegionInfo
Tests run: 1, Failures: 0, Errors: 0, Skipped: 0, Time elapsed: 0.377 sec
Running org.apache.hadoop.hbase.io.TestHeapSize
Tests run: 2, Failures: 1, Errors: 0, Skipped: 0, Time elapsed: 0.143 sec <<< FAILURE!
Running org.apache.hadoop.hbase.regionserver.TestMinorCompactingStoreScanner
Tests run: 2, Failures: 0, Errors: 0, Skipped: 0, Time elapsed: 0.101 sec
Running org.apache.hadoop.hbase.TestInfoServers
Tests run: 1, Failures: 0, Errors: 0, Skipped: 0, Time elapsed: 11.576 sec
Running org.apache.hadoop.hbase.io.hfile.TestHFileSeek
Tests run: 1, Failures: 0, Errors: 0, Skipped: 0, Time elapsed: 4.588 sec
Running org.apache.hadoop.hbase.regionserver.TestStore
Tests run: 5, Failures: 0, Errors: 0, Skipped: 0, Time elapsed: 1.085 sec
Running org.apache.hadoop.hbase.zookeeper.TestHQuorumPeer
Tests run: 2, Failures: 0, Errors: 0, Skipped: 0, Time elapsed: 0.488 sec
Running org.apache.hadoop.hbase.io.hfile.TestHFilePerformance
Tests run: 1, Failures: 0, Errors: 0, Skipped: 0, Time elapsed: 5.843 sec
Running org.apache.hadoop.hbase.io.TestHbaseObjectWritable
Tests run: 1, Failures: 0, Errors: 0, Skipped: 0, Time elapsed: 0.221 sec
Running org.apache.hadoop.hbase.master.TestOldLogsCleaner
Tests run: 1, Failures: 0, Errors: 0, Skipped: 0, Time elapsed: 0.76 sec
Running org.apache.hadoop.hbase.thrift.TestThriftServer
Tests run: 1, Failures: 0, Errors: 0, Skipped: 0, Time elapsed: 66.244 sec
Running org.apache.hadoop.hbase.regionserver.TestQueryMatcher
Tests run: 4, Failures: 0, Errors: 0, Skipped: 0, Time elapsed: 0.489 sec
Running org.apache.hadoop.hbase.client.TestAdmin
Tests run: 14, Failures: 0, Errors: 0, Skipped: 0, Time elapsed: 162.392 sec
Running org.apache.hadoop.hbase.util.TestMergeTool
Tests run: 1, Failures: 0, Errors: 0, Skipped: 0, Time elapsed: 25.831 sec
Running org.apache.hadoop.hbase.TestCompare
Tests run: 1, Failures: 0, Errors: 0, Skipped: 0, Time elapsed: 0.053 sec
Running org.apache.hadoop.hbase.regionserver.TestExplicitColumnTracker
Tests run: 3, Failures: 0, Errors: 0, Skipped: 0, Time elapsed: 0.851 sec
Running org.apache.hadoop.hbase.regionserver.TestStoreReconstruction
Tests run: 1, Failures: 0, Errors: 0, Skipped: 0, Time elapsed: 23.6 sec
Running org.apache.hadoop.hbase.TestEmptyMetaInfo
Tests run: 1, Failures: 0, Errors: 0, Skipped: 0, Time elapsed: 45.628 sec
Running org.apache.hadoop.hbase.util.TestBase64
Tests run: 1, Failures: 0, Errors: 0, Skipped: 0, Time elapsed: 0.093 sec
Running org.apache.hadoop.hbase.regionserver.TestMemStore
Tests run: 17, Failures: 0, Errors: 0, Skipped: 0, Time elapsed: 0.306 sec
Running org.apache.hadoop.hbase.io.hfile.TestLruBlockCache
Tests run: 7, Failures: 0, Errors: 0, Skipped: 0, Time elapsed: 1.147 sec
Running org.apache.hadoop.hbase.regionserver.TestDeleteCompare
Tests run: 4, Failures: 0, Errors: 0, Skipped: 0, Time elapsed: 0.102 sec
Running org.apache.hadoop.hbase.regionserver.TestScanWildcardColumnTracker
Tests run: 2, Failures: 0, Errors: 0, Skipped: 0, Time elapsed: 0.447 sec
Running org.apache.hadoop.hbase.regionserver.TestKeyValueSkipListSet
Tests run: 4, Failures: 0, Errors: 0, Skipped: 0, Time elapsed: 0.103 sec
Running org.apache.hadoop.hbase.io.hfile.TestSeekTo
Tests run: 3, Failures: 0, Errors: 0, Skipped: 0, Time elapsed: 0.519 sec
Running org.apache.hadoop.hbase.filter.TestPageFilter
Tests run: 2, Failures: 0, Errors: 0, Skipped: 0, Time elapsed: 0.037 sec
Running org.apache.hadoop.hbase.TestMergeMeta
Tests run: 1, Failures: 0, Errors: 0, Skipped: 0, Time elapsed: 36.722 sec
Running org.apache.hadoop.hbase.TestKeyValue
Tests run: 7, Failures: 0, Errors: 0, Skipped: 0, Time elapsed: 0.108 sec
Running org.apache.hadoop.hbase.mapreduce.TestTableMapReduce
Tests run: 1, Failures: 0, Errors: 0, Skipped: 0, Time elapsed: 60.632 sec
Running org.apache.hadoop.hbase.client.TestFromClientSide
Tests run: 33, Failures: 0, Errors: 0, Skipped: 4, Time elapsed: 244.661 sec
Running org.apache.hadoop.hbase.regionserver.TestCompaction
Tests run: 2, Failures: 0, Errors: 0, Skipped: 0, Time elapsed: 40.948 sec
Running org.apache.hadoop.hbase.client.TestHTablePool
Tests run: 4, Failures: 0, Errors: 0, Skipped: 0, Time elapsed: 0.484 sec
Running org.apache.hadoop.hbase.TestMultiParallelPut
Tests run: 1, Failures: 0, Errors: 0, Skipped: 0, Time elapsed: 31.817 sec
Running org.apache.hadoop.hbase.master.TestRegionManager
Tests run: 1, Failures: 0, Errors: 0, Skipped: 0, Time elapsed: 41.793 sec
Running org.apache.hadoop.hbase.mapreduce.TestTimeRangeMapRed
Tests run: 1, Failures: 0, Errors: 0, Skipped: 0, Time elapsed: 29.563 sec
Running org.apache.hadoop.hbase.filter.TestSingleColumnValueFilter
Tests run: 2, Failures: 0, Errors: 0, Skipped: 0, Time elapsed: 0.137 sec
Running org.apache.hadoop.hbase.master.TestMinimumServerCount
Tests run: 1, Failures: 0, Errors: 0, Skipped: 0, Time elapsed: 42.786 sec
Running org.apache.hadoop.hbase.mapreduce.TestSimpleTotalOrderPartitioner
Tests run: 1, Failures: 0, Errors: 0, Skipped: 0, Time elapsed: 0.332 sec
Running org.apache.hadoop.hbase.regionserver.TestGetDeleteTracker
Tests run: 7, Failures: 0, Errors: 0, Skipped: 0, Time elapsed: 0.619 sec
Running org.apache.hadoop.hbase.mapreduce.TestHFileOutputFormat
Tests run: 1, Failures: 0, Errors: 0, Skipped: 0, Time elapsed: 5.719 sec
Running org.apache.hadoop.hbase.regionserver.TestScanDeleteTracker
Tests run: 6, Failures: 0, Errors: 0, Skipped: 0, Time elapsed: 0.577 sec
Running org.apache.hadoop.hbase.metrics.TestMetricsMBeanBase
Tests run: 2, Failures: 0, Errors: 0, Skipped: 0, Time elapsed: 0.106 sec
Running org.apache.hadoop.hbase.mapreduce.TestTableInputFormatScan
Tests run: 11, Failures: 0, Errors: 0, Skipped: 0, Time elapsed: 95.294 sec
Running org.apache.hadoop.hbase.filter.TestFilterList
Tests run: 4, Failures: 0, Errors: 0, Skipped: 0, Time elapsed: 0.156 sec
Running org.apache.hadoop.hbase.regionserver.TestHRegion
Tests run: 37, Failures: 0, Errors: 0, Skipped: 0, Time elapsed: 7.917 sec
Running org.apache.hadoop.hbase.TestRegionRebalancing
Tests run: 1, Failures: 0, Errors: 0, Skipped: 0, Time elapsed: 79.336 sec
Running org.apache.hadoop.hbase.filter.TestInclusiveStopFilter
Tests run: 2, Failures: 0, Errors: 0, Skipped: 0, Time elapsed: 0.042 sec
Running org.apache.hadoop.hbase.filter.TestSingleColumnValueExcludeFilter
Tests run: 1, Failures: 0, Errors: 0, Skipped: 0, Time elapsed: 0.104 sec
Running org.apache.hadoop.hbase.util.TestRootPath
Tests run: 1, Failures: 0, Errors: 0, Skipped: 0, Time elapsed: 0.1 sec
Running org.apache.hadoop.hbase.mapred.TestTableMapReduce
Tests run: 1, Failures: 0, Errors: 0, Skipped: 0, Time elapsed: 54.243 sec
Running org.apache.hadoop.hbase.regionserver.TestKeyValueScanFixture
Tests run: 1, Failures: 0, Errors: 0, Skipped: 0, Time elapsed: 0.097 sec
Running org.apache.hadoop.hbase.util.TestBytes
Tests run: 8, Failures: 0, Errors: 0, Skipped: 0, Time elapsed: 0.048 sec
Running org.apache.hadoop.hbase.regionserver.TestWildcardColumnTracker
Tests run: 6, Failures: 0, Errors: 0, Skipped: 0, Time elapsed: 0.876 sec
Running org.apache.hadoop.hbase.regionserver.TestStoreFile
Tests run: 2, Failures: 0, Errors: 0, Skipped: 0, Time elapsed: 6.644 sec
Running org.apache.hadoop.hbase.client.TestGetRowVersions
Tests run: 1, Failures: 0, Errors: 0, Skipped: 0, Time elapsed: 70.314 sec
Running org.apache.hadoop.hbase.io.hfile.TestHFile
Tests run: 7, Failures: 0, Errors: 0, Skipped: 0, Time elapsed: 0.842 sec
Running org.apache.hadoop.hbase.filter.TestFilter
Tests run: 14, Failures: 0, Errors: 0, Skipped: 0, Time elapsed: 3.078 sec
Running org.apache.hadoop.hbase.regionserver.TestWideScanner
Tests run: 1, Failures: 0, Errors: 0, Skipped: 0, Time elapsed: 5.915 sec
Running org.apache.hadoop.hbase.regionserver.wal.TestHLog
Tests run: 4, Failures: 0, Errors: 0, Skipped: 0, Time elapsed: 46.021 sec
Running org.apache.hadoop.hbase.client.TestTimestamp
Tests run: 1, Failures: 0, Errors: 0, Skipped: 0, Time elapsed: 17.487 sec
Running org.apache.hadoop.hbase.TestScanMultipleVersions
Tests run: 1, Failures: 0, Errors: 0, Skipped: 0, Time elapsed: 22.349 sec
Running org.apache.hadoop.hbase.TestMergeTable
Tests run: 1, Failures: 0, Errors: 0, Skipped: 0, Time elapsed: 47.688 sec
Running org.apache.hadoop.hbase.regionserver.TestGetClosestAtOrBefore
Tests run: 3, Failures: 0, Errors: 0, Skipped: 0, Time elapsed: 27.114 sec

Results :

Failed tests: 

Tests run: 315, Failures: 1, Errors: 0, Skipped: 4

[INFO] ------------------------------------------------------------------------
[ERROR] BUILD FAILURE
[INFO] ------------------------------------------------------------------------
[INFO] There are test failures.

Please refer to <http://hudson.zones.apache.org/hudson/job/HBase-Patch/ws/trunk/core/target/surefire-reports>
for the individual test results.
[INFO] ------------------------------------------------------------------------
[INFO] For more information, run Maven with the -e switch
[INFO] ------------------------------------------------------------------------
[INFO] Total time: 30 minutes 25 seconds
[INFO] Finished at: Tue Mar 09 22:39:11 UTC 2010
[INFO] Final Memory: 37M/87M
[INFO] ------------------------------------------------------------------------
[locks-and-latches] Releasing all the locks
[locks-and-latches] All the locks released
Archiving artifacts
Recording test results


Mime
View raw message