hbase-dev mailing list archives

Site index · List index
Message view « Date » · « Thread »
Top « Date » · « Thread »
From Apache Hudson Server <hud...@hudson.zones.apache.org>
Subject Build failed in Hudson: HBase-Patch #1138
Date Thu, 04 Mar 2010 18:34:39 GMT
See <http://hudson.zones.apache.org/hudson/job/HBase-Patch/1138/changes>

Changes:

[stack] HBASE-2267 More improvements to the Maven build

[stack] HBASE-2282 More directories should be ignored when using git for development

[stack] HBASE-2281  Hbase shell does not work when started from the build dir

[apurtell] HBASE-2274 [stargate] filter support: JSON descriptors

[stack] HBASE-2063 For hfileoutputformat, on timeout/failure/kill clean up half-written hfile

------------------------------------------
[...truncated 468 lines...]

[WARNING] <http://hudson.zones.apache.org/hudson/job/HBase-Patch/ws/trunk/core/src/test/java/org/apache/hadoop/hbase/regionserver/TestStore.java>:[115,27]
[deprecation] HBaseConfiguration() in org.apache.hadoop.hbase.HBaseConfiguration has been
deprecated

[WARNING] <http://hudson.zones.apache.org/hudson/job/HBase-Patch/ws/trunk/core/src/test/java/org/apache/hadoop/hbase/mapreduce/TestTimeRangeMapRed.java>:[132,27]
[deprecation] HBaseConfiguration(org.apache.hadoop.conf.Configuration) in org.apache.hadoop.hbase.HBaseConfiguration
has been deprecated

[WARNING] <http://hudson.zones.apache.org/hudson/job/HBase-Patch/ws/trunk/core/src/test/java/org/apache/hadoop/hbase/mapreduce/TestTimeRangeMapRed.java>:[161,12]
[deprecation] Job(org.apache.hadoop.conf.Configuration,java.lang.String) in org.apache.hadoop.mapreduce.Job
has been deprecated

[WARNING] <http://hudson.zones.apache.org/hudson/job/HBase-Patch/ws/trunk/core/src/test/java/org/apache/hadoop/hbase/io/hfile/KVGenerator.java>:[67,33]
[deprecation] get() in org.apache.hadoop.io.BytesWritable has been deprecated

[WARNING] <http://hudson.zones.apache.org/hudson/job/HBase-Patch/ws/trunk/core/src/test/java/org/apache/hadoop/hbase/io/hfile/KVGenerator.java>:[71,50]
[deprecation] get() in org.apache.hadoop.io.BytesWritable has been deprecated

[WARNING] <http://hudson.zones.apache.org/hudson/job/HBase-Patch/ws/trunk/core/src/test/java/org/apache/hadoop/hbase/io/hfile/KVGenerator.java>:[72,12]
[deprecation] getSize() in org.apache.hadoop.io.BytesWritable has been deprecated

[WARNING] <http://hudson.zones.apache.org/hudson/job/HBase-Patch/ws/trunk/core/src/test/java/org/apache/hadoop/hbase/io/hfile/KVGenerator.java>:[73,28]
[deprecation] get() in org.apache.hadoop.io.BytesWritable has been deprecated

[WARNING] <http://hudson.zones.apache.org/hudson/job/HBase-Patch/ws/trunk/core/src/test/java/org/apache/hadoop/hbase/io/hfile/KVGenerator.java>:[73,50]
[deprecation] getSize() in org.apache.hadoop.io.BytesWritable has been deprecated

[WARNING] <http://hudson.zones.apache.org/hudson/job/HBase-Patch/ws/trunk/core/src/test/java/org/apache/hadoop/hbase/io/hfile/KVGenerator.java>:[77,33]
[deprecation] get() in org.apache.hadoop.io.BytesWritable has been deprecated

[WARNING] <http://hudson.zones.apache.org/hudson/job/HBase-Patch/ws/trunk/core/src/test/java/org/apache/hadoop/hbase/io/hfile/KVGenerator.java>:[88,33]
[deprecation] get() in org.apache.hadoop.io.BytesWritable has been deprecated

[WARNING] <http://hudson.zones.apache.org/hudson/job/HBase-Patch/ws/trunk/core/src/test/java/org/apache/hadoop/hbase/mapred/TestTableMapReduce.java>:[126,4]
[deprecation] org.apache.hadoop.mapred.JobConf in org.apache.hadoop.mapred has been deprecated

[WARNING] <http://hudson.zones.apache.org/hudson/job/HBase-Patch/ws/trunk/core/src/test/java/org/apache/hadoop/hbase/mapred/TestTableMapReduce.java>:[129,20]
[deprecation] org.apache.hadoop.mapred.JobConf in org.apache.hadoop.mapred has been deprecated

[WARNING] <http://hudson.zones.apache.org/hudson/job/HBase-Patch/ws/trunk/core/src/test/java/org/apache/hadoop/hbase/mapred/TestTableMapReduce.java>:[132,6]
[deprecation] org.apache.hadoop.hbase.mapred.TableMapReduceUtil in org.apache.hadoop.hbase.mapred
has been deprecated

[WARNING] <http://hudson.zones.apache.org/hudson/job/HBase-Patch/ws/trunk/core/src/test/java/org/apache/hadoop/hbase/mapred/TestTableMapReduce.java>:[136,8]
[deprecation] org.apache.hadoop.hbase.mapred.IdentityTableReduce in org.apache.hadoop.hbase.mapred
has been deprecated

[WARNING] <http://hudson.zones.apache.org/hudson/job/HBase-Patch/ws/trunk/core/src/test/java/org/apache/hadoop/hbase/mapred/TestTableMapReduce.java>:[135,6]
[deprecation] org.apache.hadoop.hbase.mapred.TableMapReduceUtil in org.apache.hadoop.hbase.mapred
has been deprecated

[INFO] [surefire:test {execution: default-test}]
[INFO] Surefire report directory: <http://hudson.zones.apache.org/hudson/job/HBase-Patch/ws/trunk/core/target/surefire-reports>

-------------------------------------------------------
 T E S T S
-------------------------------------------------------
Running org.apache.hadoop.hbase.TestFullLogReconstruction
Tests run: 1, Failures: 0, Errors: 0, Skipped: 0, Time elapsed: 161.792 sec
Running org.apache.hadoop.hbase.TestSerialization
Tests run: 18, Failures: 0, Errors: 0, Skipped: 0, Time elapsed: 10.963 sec
Running org.apache.hadoop.hbase.TestZooKeeper
Tests run: 4, Failures: 0, Errors: 0, Skipped: 0, Time elapsed: 109.464 sec
Running org.apache.hadoop.hbase.regionserver.wal.TestLogRolling
Tests run: 1, Failures: 0, Errors: 0, Skipped: 0, Time elapsed: 73.958 sec
Running org.apache.hadoop.hbase.io.hfile.TestCachedBlockQueue
Tests run: 2, Failures: 0, Errors: 0, Skipped: 0, Time elapsed: 0.092 sec
Running org.apache.hadoop.hbase.regionserver.TestKeyValueHeap
Tests run: 3, Failures: 0, Errors: 0, Skipped: 0, Time elapsed: 0.453 sec
Running org.apache.hadoop.hbase.regionserver.TestStoreScanner
Tests run: 13, Failures: 0, Errors: 0, Skipped: 0, Time elapsed: 0.118 sec
Running org.apache.hadoop.hbase.TestHMsg
Tests run: 2, Failures: 0, Errors: 0, Skipped: 0, Time elapsed: 0.066 sec
Running org.apache.hadoop.hbase.filter.TestPrefixFilter
Tests run: 3, Failures: 0, Errors: 0, Skipped: 0, Time elapsed: 0.043 sec
Running org.apache.hadoop.hbase.util.TestKeying
Tests run: 1, Failures: 0, Errors: 0, Skipped: 0, Time elapsed: 0.038 sec
Running org.apache.hadoop.hbase.regionserver.TestScanner
Tests run: 5, Failures: 0, Errors: 0, Skipped: 0, Time elapsed: 15.224 sec
Running org.apache.hadoop.hbase.regionserver.TestHRegionInfo
Tests run: 1, Failures: 0, Errors: 0, Skipped: 0, Time elapsed: 0.326 sec
Running org.apache.hadoop.hbase.io.TestHeapSize
Tests run: 2, Failures: 0, Errors: 0, Skipped: 0, Time elapsed: 0.122 sec
Running org.apache.hadoop.hbase.regionserver.TestMinorCompactingStoreScanner
Tests run: 2, Failures: 0, Errors: 0, Skipped: 0, Time elapsed: 0.102 sec
Running org.apache.hadoop.hbase.TestInfoServers
Tests run: 1, Failures: 0, Errors: 0, Skipped: 0, Time elapsed: 11.514 sec
Running org.apache.hadoop.hbase.io.hfile.TestHFileSeek
Tests run: 1, Failures: 0, Errors: 0, Skipped: 0, Time elapsed: 4.689 sec
Running org.apache.hadoop.hbase.regionserver.TestStore
Tests run: 5, Failures: 0, Errors: 0, Skipped: 0, Time elapsed: 1.054 sec
Running org.apache.hadoop.hbase.zookeeper.TestHQuorumPeer
Tests run: 2, Failures: 0, Errors: 0, Skipped: 0, Time elapsed: 0.541 sec
Running org.apache.hadoop.hbase.io.hfile.TestHFilePerformance
Tests run: 1, Failures: 0, Errors: 0, Skipped: 0, Time elapsed: 6.107 sec
Running org.apache.hadoop.hbase.io.TestHbaseObjectWritable
Tests run: 1, Failures: 0, Errors: 0, Skipped: 0, Time elapsed: 0.215 sec
Running org.apache.hadoop.hbase.master.TestOldLogsCleaner
Tests run: 1, Failures: 0, Errors: 0, Skipped: 0, Time elapsed: 1.297 sec
Running org.apache.hadoop.hbase.thrift.TestThriftServer
Tests run: 1, Failures: 0, Errors: 0, Skipped: 0, Time elapsed: 82.169 sec
Running org.apache.hadoop.hbase.regionserver.TestQueryMatcher
Tests run: 4, Failures: 0, Errors: 0, Skipped: 0, Time elapsed: 0.495 sec
Running org.apache.hadoop.hbase.client.TestAdmin
Tests run: 14, Failures: 0, Errors: 0, Skipped: 0, Time elapsed: 146.99 sec
Running org.apache.hadoop.hbase.util.TestMergeTool
Tests run: 1, Failures: 0, Errors: 0, Skipped: 0, Time elapsed: 33.227 sec
Running org.apache.hadoop.hbase.TestCompare
Tests run: 1, Failures: 0, Errors: 0, Skipped: 0, Time elapsed: 0.057 sec
Running org.apache.hadoop.hbase.regionserver.TestExplicitColumnTracker
Tests run: 3, Failures: 0, Errors: 0, Skipped: 0, Time elapsed: 0.885 sec
Running org.apache.hadoop.hbase.regionserver.TestStoreReconstruction
Tests run: 1, Failures: 0, Errors: 0, Skipped: 0, Time elapsed: 23.935 sec
Running org.apache.hadoop.hbase.TestEmptyMetaInfo
Tests run: 1, Failures: 0, Errors: 0, Skipped: 0, Time elapsed: 58.561 sec
Running org.apache.hadoop.hbase.util.TestBase64
Tests run: 1, Failures: 0, Errors: 0, Skipped: 0, Time elapsed: 0.091 sec
Running org.apache.hadoop.hbase.regionserver.TestMemStore
Tests run: 17, Failures: 0, Errors: 0, Skipped: 0, Time elapsed: 0.307 sec
Running org.apache.hadoop.hbase.io.hfile.TestLruBlockCache
Tests run: 7, Failures: 0, Errors: 0, Skipped: 0, Time elapsed: 1.141 sec
Running org.apache.hadoop.hbase.regionserver.TestDeleteCompare
Tests run: 4, Failures: 0, Errors: 0, Skipped: 0, Time elapsed: 0.105 sec
Running org.apache.hadoop.hbase.regionserver.TestScanWildcardColumnTracker
Tests run: 2, Failures: 0, Errors: 0, Skipped: 0, Time elapsed: 0.391 sec
Running org.apache.hadoop.hbase.regionserver.TestKeyValueSkipListSet
Tests run: 4, Failures: 0, Errors: 0, Skipped: 0, Time elapsed: 0.105 sec
Running org.apache.hadoop.hbase.io.hfile.TestSeekTo
Tests run: 3, Failures: 0, Errors: 0, Skipped: 0, Time elapsed: 0.527 sec
Running org.apache.hadoop.hbase.filter.TestPageFilter
Tests run: 2, Failures: 0, Errors: 0, Skipped: 0, Time elapsed: 0.039 sec
Running org.apache.hadoop.hbase.TestMergeMeta
Tests run: 1, Failures: 0, Errors: 0, Skipped: 0, Time elapsed: 57.216 sec
Running org.apache.hadoop.hbase.TestKeyValue
Tests run: 7, Failures: 0, Errors: 0, Skipped: 0, Time elapsed: 0.11 sec
Running org.apache.hadoop.hbase.mapreduce.TestTableMapReduce
Tests run: 1, Failures: 0, Errors: 0, Skipped: 0, Time elapsed: 120.198 sec
Running org.apache.hadoop.hbase.client.TestFromClientSide
Tests run: 33, Failures: 0, Errors: 0, Skipped: 4, Time elapsed: 264.738 sec
Running org.apache.hadoop.hbase.regionserver.TestCompaction
Tests run: 2, Failures: 0, Errors: 0, Skipped: 0, Time elapsed: 16.464 sec
Running org.apache.hadoop.hbase.client.TestHTablePool
Tests run: 4, Failures: 0, Errors: 0, Skipped: 0, Time elapsed: 0.489 sec
Running org.apache.hadoop.hbase.TestMultiParallelPut
Tests run: 1, Failures: 0, Errors: 0, Skipped: 0, Time elapsed: 32.62 sec
Running org.apache.hadoop.hbase.master.TestRegionManager
Tests run: 1, Failures: 0, Errors: 0, Skipped: 0, Time elapsed: 30.131 sec
Running org.apache.hadoop.hbase.mapreduce.TestTimeRangeMapRed
Tests run: 1, Failures: 0, Errors: 0, Skipped: 0, Time elapsed: 55.463 sec
Running org.apache.hadoop.hbase.filter.TestSingleColumnValueFilter
Tests run: 2, Failures: 0, Errors: 0, Skipped: 0, Time elapsed: 0.137 sec
Running org.apache.hadoop.hbase.master.TestMinimumServerCount
Tests run: 1, Failures: 0, Errors: 0, Skipped: 0, Time elapsed: 42.486 sec
Running org.apache.hadoop.hbase.mapreduce.TestSimpleTotalOrderPartitioner
Tests run: 1, Failures: 0, Errors: 0, Skipped: 0, Time elapsed: 0.334 sec
Running org.apache.hadoop.hbase.regionserver.TestGetDeleteTracker
Tests run: 7, Failures: 0, Errors: 0, Skipped: 0, Time elapsed: 0.62 sec
Running org.apache.hadoop.hbase.mapreduce.TestHFileOutputFormat
Tests run: 1, Failures: 0, Errors: 0, Skipped: 0, Time elapsed: 5.612 sec
Running org.apache.hadoop.hbase.regionserver.TestScanDeleteTracker
Tests run: 6, Failures: 0, Errors: 0, Skipped: 0, Time elapsed: 0.585 sec
Running org.apache.hadoop.hbase.metrics.TestMetricsMBeanBase
Tests run: 2, Failures: 0, Errors: 0, Skipped: 0, Time elapsed: 0.11 sec
Running org.apache.hadoop.hbase.mapreduce.TestTableInputFormatScan
Tests run: 11, Failures: 0, Errors: 0, Skipped: 0, Time elapsed: 95.007 sec
Running org.apache.hadoop.hbase.filter.TestFilterList
Tests run: 4, Failures: 0, Errors: 0, Skipped: 0, Time elapsed: 0.151 sec
Running org.apache.hadoop.hbase.regionserver.TestHRegion
Tests run: 37, Failures: 0, Errors: 0, Skipped: 0, Time elapsed: 8.3 sec
Running org.apache.hadoop.hbase.TestRegionRebalancing
Tests run: 1, Failures: 0, Errors: 0, Skipped: 0, Time elapsed: 66.05 sec
Running org.apache.hadoop.hbase.filter.TestInclusiveStopFilter
Tests run: 2, Failures: 0, Errors: 0, Skipped: 0, Time elapsed: 0.041 sec
Running org.apache.hadoop.hbase.filter.TestSingleColumnValueExcludeFilter
Tests run: 1, Failures: 0, Errors: 0, Skipped: 0, Time elapsed: 0.102 sec
Running org.apache.hadoop.hbase.util.TestRootPath
Tests run: 1, Failures: 0, Errors: 0, Skipped: 0, Time elapsed: 0.095 sec
Running org.apache.hadoop.hbase.mapred.TestTableMapReduce
Tests run: 1, Failures: 0, Errors: 0, Skipped: 0, Time elapsed: 53.933 sec
Running org.apache.hadoop.hbase.regionserver.TestKeyValueScanFixture
Tests run: 1, Failures: 0, Errors: 0, Skipped: 0, Time elapsed: 0.102 sec
Running org.apache.hadoop.hbase.util.TestBytes
Tests run: 8, Failures: 0, Errors: 0, Skipped: 0, Time elapsed: 0.045 sec
Running org.apache.hadoop.hbase.regionserver.TestWildcardColumnTracker
Tests run: 6, Failures: 0, Errors: 0, Skipped: 0, Time elapsed: 0.873 sec
Running org.apache.hadoop.hbase.regionserver.TestStoreFile
Tests run: 2, Failures: 0, Errors: 0, Skipped: 0, Time elapsed: 21.286 sec
Running org.apache.hadoop.hbase.client.TestGetRowVersions
Tests run: 1, Failures: 0, Errors: 0, Skipped: 0, Time elapsed: 67.844 sec
Running org.apache.hadoop.hbase.io.hfile.TestHFile
Tests run: 7, Failures: 0, Errors: 0, Skipped: 0, Time elapsed: 0.847 sec
Running org.apache.hadoop.hbase.filter.TestFilter
Tests run: 14, Failures: 0, Errors: 0, Skipped: 0, Time elapsed: 2.977 sec
Running org.apache.hadoop.hbase.regionserver.TestWideScanner
Tests run: 1, Failures: 0, Errors: 0, Skipped: 0, Time elapsed: 21.523 sec
Running org.apache.hadoop.hbase.regionserver.wal.TestHLog
Tests run: 4, Failures: 0, Errors: 0, Skipped: 0, Time elapsed: 47.616 sec
Running org.apache.hadoop.hbase.client.TestTimestamp
Tests run: 1, Failures: 0, Errors: 0, Skipped: 0, Time elapsed: 17.4 sec
Running org.apache.hadoop.hbase.TestScanMultipleVersions
Tests run: 1, Failures: 0, Errors: 0, Skipped: 0, Time elapsed: 36.87 sec
Running org.apache.hadoop.hbase.TestMergeTable
Tests run: 1, Failures: 0, Errors: 0, Skipped: 0, Time elapsed: 69.728 sec
Running org.apache.hadoop.hbase.regionserver.TestGetClosestAtOrBefore
Tests run: 3, Failures: 0, Errors: 0, Skipped: 0, Time elapsed: 26.378 sec

Results :

Tests run: 315, Failures: 0, Errors: 0, Skipped: 4

[INFO] [jar:jar {execution: default-jar}]
[INFO] Building jar: <http://hudson.zones.apache.org/hudson/job/HBase-Patch/ws/trunk/core/target/hbase-core-0.21.0-SNAPSHOT.jar>
[INFO] [jar:test-jar {execution: default}]
[INFO] Building jar: <http://hudson.zones.apache.org/hudson/job/HBase-Patch/ws/trunk/core/target/hbase-core-0.21.0-SNAPSHOT-tests.jar>
[INFO] [source:jar-no-fork {execution: attach-sources}]
[INFO] Building jar: <http://hudson.zones.apache.org/hudson/job/HBase-Patch/ws/trunk/core/target/hbase-core-0.21.0-SNAPSHOT-sources.jar>
[INFO] [install:install {execution: default-install}]
[INFO] Installing <http://hudson.zones.apache.org/hudson/job/HBase-Patch/ws/trunk/core/target/hbase-core-0.21.0-SNAPSHOT.jar>
to /home/hudson/.m2/repository/org/apache/hbase/hbase-core/0.21.0-SNAPSHOT/hbase-core-0.21.0-SNAPSHOT.jar
[INFO] Installing <http://hudson.zones.apache.org/hudson/job/HBase-Patch/ws/trunk/core/target/hbase-core-0.21.0-SNAPSHOT-tests.jar>
to /home/hudson/.m2/repository/org/apache/hbase/hbase-core/0.21.0-SNAPSHOT/hbase-core-0.21.0-SNAPSHOT-tests.jar
[INFO] Installing <http://hudson.zones.apache.org/hudson/job/HBase-Patch/ws/trunk/core/target/hbase-core-0.21.0-SNAPSHOT-sources.jar>
to /home/hudson/.m2/repository/org/apache/hbase/hbase-core/0.21.0-SNAPSHOT/hbase-core-0.21.0-SNAPSHOT-sources.jar
[INFO] ------------------------------------------------------------------------
[INFO] Building HBase Contrib
[INFO]    task-segment: [clean, install]
[INFO] ------------------------------------------------------------------------
[INFO] [clean:clean {execution: default-clean}]
[INFO] [site:attach-descriptor {execution: default-attach-descriptor}]
[INFO] [install:install {execution: default-install}]
[INFO] Installing <http://hudson.zones.apache.org/hudson/job/HBase-Patch/ws/trunk/contrib/pom.xml>
to /home/hudson/.m2/repository/org/apache/hbase/hbase-contrib/0.21.0-SNAPSHOT/hbase-contrib-0.21.0-SNAPSHOT.pom
[INFO] ------------------------------------------------------------------------
[INFO] Building HBase Contrib - Multi Datacenter Replication
[INFO]    task-segment: [clean, install]
[INFO] ------------------------------------------------------------------------
[INFO] [clean:clean {execution: default-clean}]
[INFO] Deleting <http://hudson.zones.apache.org/hudson/job/HBase-Patch/ws/trunk/contrib/mdc_replication/target>
[INFO] [resources:resources {execution: default-resources}]
[INFO] Using 'UTF-8' encoding to copy filtered resources.
[INFO] skip non existing resourceDirectory <http://hudson.zones.apache.org/hudson/job/HBase-Patch/ws/trunk/contrib/mdc_replication/src/main/resources>
[INFO] [compiler:compile {execution: default-compile}]
[INFO] Compiling 8 source files to <http://hudson.zones.apache.org/hudson/job/HBase-Patch/ws/trunk/contrib/mdc_replication/target/classes>
[INFO] -------------------------------------------------------------
[ERROR] COMPILATION ERROR : 
[INFO] -------------------------------------------------------------
[ERROR] <http://hudson.zones.apache.org/hudson/job/HBase-Patch/ws/trunk/contrib/mdc_replication/src/main/java/org/apache/hadoop/hbase/regionserver/wal/replication/ReplicationHLog.java>:[73,9]
doWrite(org.apache.hadoop.hbase.HRegionInfo,org.apache.hadoop.hbase.regionserver.wal.HLogKey,org.apache.hadoop.hbase.KeyValue)
in org.apache.hadoop.hbase.regionserver.wal.HLog cannot be applied to (org.apache.hadoop.hbase.HRegionInfo,org.apache.hadoop.hbase.regionserver.wal.HLogKey,org.apache.hadoop.hbase.KeyValue,long)

[ERROR] <http://hudson.zones.apache.org/hudson/job/HBase-Patch/ws/trunk/contrib/mdc_replication/src/main/java/org/apache/hadoop/hbase/regionserver/wal/replication/ReplicationHLog.java>:[68,2]
method does not override or implement a method from a supertype

[INFO] 2 errors 
[INFO] -------------------------------------------------------------
[INFO] ------------------------------------------------------------------------
[ERROR] BUILD FAILURE
[INFO] ------------------------------------------------------------------------
[INFO] Compilation failure

<http://hudson.zones.apache.org/hudson/job/HBase-Patch/ws/trunk/contrib/mdc_replication/src/main/java/org/apache/hadoop/hbase/regionserver/wal/replication/ReplicationHLog.java>:[73,9]
doWrite(org.apache.hadoop.hbase.HRegionInfo,org.apache.hadoop.hbase.regionserver.wal.HLogKey,org.apache.hadoop.hbase.KeyValue)
in org.apache.hadoop.hbase.regionserver.wal.HLog cannot be applied to (org.apache.hadoop.hbase.HRegionInfo,org.apache.hadoop.hbase.regionserver.wal.HLogKey,org.apache.hadoop.hbase.KeyValue,long)

<http://hudson.zones.apache.org/hudson/job/HBase-Patch/ws/trunk/contrib/mdc_replication/src/main/java/org/apache/hadoop/hbase/regionserver/wal/replication/ReplicationHLog.java>:[68,2]
method does not override or implement a method from a supertype


[INFO] ------------------------------------------------------------------------
[INFO] For more information, run Maven with the -e switch
[INFO] ------------------------------------------------------------------------
[INFO] Total time: 32 minutes 39 seconds
[INFO] Finished at: Thu Mar 04 18:34:38 UTC 2010
[INFO] Final Memory: 43M/90M
[INFO] ------------------------------------------------------------------------
[locks-and-latches] Releasing all the locks
[locks-and-latches] All the locks released
Archiving artifacts
Recording test results


Mime
View raw message