hbase-dev mailing list archives

Site index · List index
Message view « Date » · « Thread »
Top « Date » · « Thread »
From Apache Hudson Server <hud...@hudson.zones.apache.org>
Subject Build failed in Hudson: HBase-Patch #1161
Date Mon, 15 Mar 2010 21:26:22 GMT
See <http://hudson.zones.apache.org/hudson/job/HBase-Patch/1161/changes>

Changes:

[stack] HBASE-2324 Refactoring of TableRecordReader (mapred / mapreduce) for reuse outside
the scope of InputSplit / RecordReader

[stack] HBASE-2323 filter.RegexStringComparator does not work with certain bytes

[stack] HBASE-2305 Client port for ZK has no default

------------------------------------------
[...truncated 587 lines...]
Running org.apache.hadoop.hbase.mapreduce.TestHFileOutputFormat
Tests run: 1, Failures: 0, Errors: 0, Skipped: 0, Time elapsed: 5.614 sec
Running org.apache.hadoop.hbase.regionserver.TestScanDeleteTracker
Tests run: 6, Failures: 0, Errors: 0, Skipped: 0, Time elapsed: 0.573 sec
Running org.apache.hadoop.hbase.metrics.TestMetricsMBeanBase
Tests run: 2, Failures: 0, Errors: 0, Skipped: 0, Time elapsed: 0.108 sec
Running org.apache.hadoop.hbase.mapreduce.TestTableInputFormatScan
Tests run: 11, Failures: 0, Errors: 0, Skipped: 0, Time elapsed: 95.346 sec
Running org.apache.hadoop.hbase.filter.TestFilterList
Tests run: 4, Failures: 0, Errors: 0, Skipped: 0, Time elapsed: 0.153 sec
Running org.apache.hadoop.hbase.regionserver.TestHRegion
Tests run: 37, Failures: 0, Errors: 0, Skipped: 0, Time elapsed: 8.547 sec
Running org.apache.hadoop.hbase.TestRegionRebalancing
Tests run: 1, Failures: 0, Errors: 0, Skipped: 0, Time elapsed: 65.929 sec
Running org.apache.hadoop.hbase.filter.TestInclusiveStopFilter
Tests run: 2, Failures: 0, Errors: 0, Skipped: 0, Time elapsed: 0.043 sec
Running org.apache.hadoop.hbase.filter.TestSingleColumnValueExcludeFilter
Tests run: 1, Failures: 0, Errors: 0, Skipped: 0, Time elapsed: 0.102 sec
Running org.apache.hadoop.hbase.util.TestRootPath
Tests run: 1, Failures: 0, Errors: 0, Skipped: 0, Time elapsed: 0.096 sec
Running org.apache.hadoop.hbase.mapred.TestTableMapReduce
Tests run: 1, Failures: 0, Errors: 0, Skipped: 0, Time elapsed: 53.709 sec
Running org.apache.hadoop.hbase.regionserver.TestKeyValueScanFixture
Tests run: 1, Failures: 0, Errors: 0, Skipped: 0, Time elapsed: 0.098 sec
Running org.apache.hadoop.hbase.util.TestBytes
Tests run: 8, Failures: 0, Errors: 0, Skipped: 0, Time elapsed: 0.05 sec
Running org.apache.hadoop.hbase.regionserver.TestWildcardColumnTracker
Tests run: 6, Failures: 0, Errors: 0, Skipped: 0, Time elapsed: 0.878 sec
Running org.apache.hadoop.hbase.regionserver.TestStoreFile
Tests run: 2, Failures: 0, Errors: 0, Skipped: 0, Time elapsed: 6.37 sec
Running org.apache.hadoop.hbase.client.TestGetRowVersions
Tests run: 1, Failures: 0, Errors: 0, Skipped: 0, Time elapsed: 50.49 sec
Running org.apache.hadoop.hbase.io.hfile.TestHFile
Tests run: 7, Failures: 0, Errors: 0, Skipped: 0, Time elapsed: 0.863 sec
Running org.apache.hadoop.hbase.filter.TestFilter
Tests run: 14, Failures: 0, Errors: 0, Skipped: 0, Time elapsed: 3.198 sec
Running org.apache.hadoop.hbase.regionserver.TestWideScanner
Tests run: 1, Failures: 0, Errors: 0, Skipped: 0, Time elapsed: 42.25 sec
Running org.apache.hadoop.hbase.regionserver.wal.TestHLog
Tests run: 4, Failures: 0, Errors: 0, Skipped: 0, Time elapsed: 19.382 sec
Running org.apache.hadoop.hbase.client.TestTimestamp
Tests run: 1, Failures: 0, Errors: 0, Skipped: 0, Time elapsed: 17.46 sec
Running org.apache.hadoop.hbase.TestScanMultipleVersions
Tests run: 1, Failures: 0, Errors: 0, Skipped: 0, Time elapsed: 48.186 sec
Running org.apache.hadoop.hbase.TestMergeTable
Tests run: 1, Failures: 0, Errors: 0, Skipped: 0, Time elapsed: 66.004 sec
Running org.apache.hadoop.hbase.regionserver.TestGetClosestAtOrBefore
Tests run: 3, Failures: 0, Errors: 0, Skipped: 0, Time elapsed: 35.045 sec

Results :

Tests run: 317, Failures: 0, Errors: 0, Skipped: 4

[INFO] [jar:jar {execution: default-jar}]
[INFO] Building jar: <http://hudson.zones.apache.org/hudson/job/HBase-Patch/ws/trunk/core/target/hbase-core-0.21.0-SNAPSHOT.jar>
[INFO] [jar:test-jar {execution: default}]
[INFO] Building jar: <http://hudson.zones.apache.org/hudson/job/HBase-Patch/ws/trunk/core/target/hbase-core-0.21.0-SNAPSHOT-tests.jar>
[INFO] [source:jar-no-fork {execution: attach-sources}]
[INFO] Building jar: <http://hudson.zones.apache.org/hudson/job/HBase-Patch/ws/trunk/core/target/hbase-core-0.21.0-SNAPSHOT-sources.jar>
[INFO] [install:install {execution: default-install}]
[INFO] Installing <http://hudson.zones.apache.org/hudson/job/HBase-Patch/ws/trunk/core/target/hbase-core-0.21.0-SNAPSHOT.jar>
to /home/hudson/.m2/repository/org/apache/hbase/hbase-core/0.21.0-SNAPSHOT/hbase-core-0.21.0-SNAPSHOT.jar
[INFO] Installing <http://hudson.zones.apache.org/hudson/job/HBase-Patch/ws/trunk/core/target/hbase-core-0.21.0-SNAPSHOT-tests.jar>
to /home/hudson/.m2/repository/org/apache/hbase/hbase-core/0.21.0-SNAPSHOT/hbase-core-0.21.0-SNAPSHOT-tests.jar
[INFO] Installing <http://hudson.zones.apache.org/hudson/job/HBase-Patch/ws/trunk/core/target/hbase-core-0.21.0-SNAPSHOT-sources.jar>
to /home/hudson/.m2/repository/org/apache/hbase/hbase-core/0.21.0-SNAPSHOT/hbase-core-0.21.0-SNAPSHOT-sources.jar
[INFO] ------------------------------------------------------------------------
[INFO] Building HBase Contrib
[INFO]    task-segment: [clean, install]
[INFO] ------------------------------------------------------------------------
[INFO] [clean:clean {execution: default-clean}]
[INFO] [site:attach-descriptor {execution: default-attach-descriptor}]
[INFO] [install:install {execution: default-install}]
[INFO] Installing <http://hudson.zones.apache.org/hudson/job/HBase-Patch/ws/trunk/contrib/pom.xml>
to /home/hudson/.m2/repository/org/apache/hbase/hbase-contrib/0.21.0-SNAPSHOT/hbase-contrib-0.21.0-SNAPSHOT.pom
[INFO] ------------------------------------------------------------------------
[INFO] Building HBase Contrib - Multi Datacenter Replication
[INFO]    task-segment: [clean, install]
[INFO] ------------------------------------------------------------------------
[INFO] [clean:clean {execution: default-clean}]
[INFO] Deleting <http://hudson.zones.apache.org/hudson/job/HBase-Patch/ws/trunk/contrib/mdc_replication/target>
[INFO] [resources:resources {execution: default-resources}]
[INFO] Using 'UTF-8' encoding to copy filtered resources.
[INFO] skip non existing resourceDirectory <http://hudson.zones.apache.org/hudson/job/HBase-Patch/ws/trunk/contrib/mdc_replication/src/main/resources>
[INFO] [compiler:compile {execution: default-compile}]
[INFO] Compiling 8 source files to <http://hudson.zones.apache.org/hudson/job/HBase-Patch/ws/trunk/contrib/mdc_replication/target/classes>
[INFO] [resources:testResources {execution: default-testResources}]
[INFO] Using 'UTF-8' encoding to copy filtered resources.
[INFO] skip non existing resourceDirectory <http://hudson.zones.apache.org/hudson/job/HBase-Patch/ws/trunk/contrib/mdc_replication/src/test/resources>
[INFO] [compiler:testCompile {execution: default-testCompile}]
[INFO] Compiling 2 source files to <http://hudson.zones.apache.org/hudson/job/HBase-Patch/ws/trunk/contrib/mdc_replication/target/test-classes>
[INFO] [surefire:test {execution: default-test}]
[INFO] Surefire report directory: <http://hudson.zones.apache.org/hudson/job/HBase-Patch/ws/trunk/contrib/mdc_replication/target/surefire-reports>

-------------------------------------------------------
 T E S T S
-------------------------------------------------------
Running org.apache.hadoop.hbase.replication.TestReplication
Tests run: 2, Failures: 0, Errors: 0, Skipped: 0, Time elapsed: 61.094 sec
Running org.apache.hadoop.hbase.regionserver.replication.TestReplicationSink
Tests run: 5, Failures: 0, Errors: 0, Skipped: 0, Time elapsed: 31.776 sec

Results :

Tests run: 7, Failures: 0, Errors: 0, Skipped: 0

[INFO] [jar:jar {execution: default-jar}]
[INFO] Building jar: <http://hudson.zones.apache.org/hudson/job/HBase-Patch/ws/trunk/contrib/mdc_replication/target/hbase-contrib-mdc_replication-0.21.0-SNAPSHOT.jar>
[INFO] [install:install {execution: default-install}]
[INFO] Installing <http://hudson.zones.apache.org/hudson/job/HBase-Patch/ws/trunk/contrib/mdc_replication/target/hbase-contrib-mdc_replication-0.21.0-SNAPSHOT.jar>
to /home/hudson/.m2/repository/org/apache/hbase/hbase-contrib-mdc_replication/0.21.0-SNAPSHOT/hbase-contrib-mdc_replication-0.21.0-SNAPSHOT.jar
[INFO] ------------------------------------------------------------------------
[INFO] Building HBase Contrib - Stargate
[INFO]    task-segment: [clean, install]
[INFO] ------------------------------------------------------------------------
[INFO] [clean:clean {execution: default-clean}]
[INFO] Deleting <http://hudson.zones.apache.org/hudson/job/HBase-Patch/ws/trunk/contrib/stargate/target>
[INFO] [resources:resources {execution: default-resources}]
[INFO] Using 'UTF-8' encoding to copy filtered resources.
[INFO] Copying 10 resources
[INFO] [compiler:compile {execution: default-compile}]
[INFO] Compiling 56 source files to <http://hudson.zones.apache.org/hudson/job/HBase-Patch/ws/trunk/contrib/stargate/target/classes>
[INFO] [resources:testResources {execution: default-testResources}]
[INFO] Using 'UTF-8' encoding to copy filtered resources.
[INFO] skip non existing resourceDirectory <http://hudson.zones.apache.org/hudson/job/HBase-Patch/ws/trunk/contrib/stargate/src/test/resources>
[INFO] [compiler:testCompile {execution: default-testCompile}]
[INFO] Compiling 25 source files to <http://hudson.zones.apache.org/hudson/job/HBase-Patch/ws/trunk/contrib/stargate/target/test-classes>
[INFO] [surefire:test {execution: default-test}]
[INFO] Surefire report directory: <http://hudson.zones.apache.org/hudson/job/HBase-Patch/ws/trunk/contrib/stargate/target/surefire-reports>

-------------------------------------------------------
 T E S T S
-------------------------------------------------------
Running org.apache.hadoop.hbase.stargate.model.TestScannerModel
Tests run: 3, Failures: 0, Errors: 0, Skipped: 0, Time elapsed: 0.67 sec
Running org.apache.hadoop.hbase.stargate.model.TestTableSchemaModel
Tests run: 3, Failures: 0, Errors: 0, Skipped: 0, Time elapsed: 0.038 sec
Running org.apache.hadoop.hbase.stargate.model.TestStorageClusterVersionModel
Tests run: 2, Failures: 0, Errors: 0, Skipped: 0, Time elapsed: 0.012 sec
Running org.apache.hadoop.hbase.stargate.TestRowResource
Tests run: 8, Failures: 0, Errors: 8, Skipped: 0, Time elapsed: 11.725 sec <<< FAILURE!
Running org.apache.hadoop.hbase.stargate.model.TestTableInfoModel
Tests run: 3, Failures: 0, Errors: 0, Skipped: 0, Time elapsed: 0.029 sec
Running org.apache.hadoop.hbase.stargate.TestStatusResource
Tests run: 2, Failures: 0, Errors: 2, Skipped: 0, Time elapsed: 0.039 sec <<< FAILURE!
Running org.apache.hadoop.hbase.stargate.auth.TestHTableAuthenticator
Tests run: 4, Failures: 0, Errors: 4, Skipped: 0, Time elapsed: 0.012 sec <<< FAILURE!
Running org.apache.hadoop.hbase.stargate.TestSchemaResource
Tests run: 2, Failures: 0, Errors: 2, Skipped: 0, Time elapsed: 0.104 sec <<< FAILURE!
Running org.apache.hadoop.hbase.stargate.auth.TestJDBCAuthenticator
Tests run: 4, Failures: 0, Errors: 0, Skipped: 0, Time elapsed: 0.303 sec
Running org.apache.hadoop.hbase.stargate.auth.TestZooKeeperAuthenticator
Tests run: 4, Failures: 0, Errors: 4, Skipped: 0, Time elapsed: 6.833 sec <<< FAILURE!
Running org.apache.hadoop.hbase.stargate.Test00MiniCluster
Tests run: 4, Failures: 0, Errors: 4, Skipped: 0, Time elapsed: 0.012 sec <<< FAILURE!
Running org.apache.hadoop.hbase.stargate.TestVersionResource
Tests run: 7, Failures: 0, Errors: 7, Skipped: 0, Time elapsed: 0.062 sec <<< FAILURE!
Running org.apache.hadoop.hbase.stargate.model.TestTableListModel
Tests run: 3, Failures: 0, Errors: 0, Skipped: 0, Time elapsed: 0.025 sec
Running org.apache.hadoop.hbase.stargate.model.TestVersionModel
Tests run: 3, Failures: 0, Errors: 0, Skipped: 0, Time elapsed: 0.014 sec
Running org.apache.hadoop.hbase.stargate.auth.TestHBCAuthenticator
Tests run: 4, Failures: 0, Errors: 0, Skipped: 0, Time elapsed: 0.039 sec
Running org.apache.hadoop.hbase.stargate.TestScannersWithFilters
Tests run: 10, Failures: 0, Errors: 10, Skipped: 0, Time elapsed: 0.201 sec <<< FAILURE!
Running org.apache.hadoop.hbase.stargate.model.TestStorageClusterStatusModel
Tests run: 3, Failures: 0, Errors: 0, Skipped: 0, Time elapsed: 0.064 sec
Running org.apache.hadoop.hbase.stargate.model.TestCellModel
Tests run: 3, Failures: 0, Errors: 0, Skipped: 0, Time elapsed: 0.016 sec
Running org.apache.hadoop.hbase.stargate.TestScannerResource
Tests run: 4, Failures: 0, Errors: 4, Skipped: 0, Time elapsed: 0.057 sec <<< FAILURE!
Running org.apache.hadoop.hbase.stargate.model.TestCellSetModel
Tests run: 3, Failures: 0, Errors: 0, Skipped: 0, Time elapsed: 0.024 sec
Running org.apache.hadoop.hbase.stargate.model.TestTableRegionModel
Tests run: 2, Failures: 0, Errors: 0, Skipped: 0, Time elapsed: 0.012 sec
Running org.apache.hadoop.hbase.stargate.model.TestColumnSchemaModel
Tests run: 2, Failures: 0, Errors: 0, Skipped: 0, Time elapsed: 0.006 sec
Running org.apache.hadoop.hbase.stargate.model.TestRowModel
Tests run: 2, Failures: 0, Errors: 0, Skipped: 0, Time elapsed: 0.067 sec
Running org.apache.hadoop.hbase.stargate.TestTableResource
Tests run: 4, Failures: 0, Errors: 4, Skipped: 0, Time elapsed: 0.047 sec <<< FAILURE!

Results :

Tests in error: 
  testDelete(org.apache.hadoop.hbase.stargate.TestRowResource)
  testSingleCellGetPutXML(org.apache.hadoop.hbase.stargate.TestRowResource)
  testSingleCellGetPutPB(org.apache.hadoop.hbase.stargate.TestRowResource)
  testSingleCellGetPutBinary(org.apache.hadoop.hbase.stargate.TestRowResource)
  testSingleCellGetJSON(org.apache.hadoop.hbase.stargate.TestRowResource)
  testURLEncodedKey(org.apache.hadoop.hbase.stargate.TestRowResource)
  testMultiCellGetPutXML(org.apache.hadoop.hbase.stargate.TestRowResource)
  testMultiCellGetPutPB(org.apache.hadoop.hbase.stargate.TestRowResource)
  testGetClusterStatusXML(org.apache.hadoop.hbase.stargate.TestStatusResource)
  testGetClusterStatusPB(org.apache.hadoop.hbase.stargate.TestStatusResource)
  testGetUserUnknown(org.apache.hadoop.hbase.stargate.auth.TestHTableAuthenticator)
  testGetAdminUser(org.apache.hadoop.hbase.stargate.auth.TestHTableAuthenticator)
  testGetPlainUser(org.apache.hadoop.hbase.stargate.auth.TestHTableAuthenticator)
  testGetDisabledUser(org.apache.hadoop.hbase.stargate.auth.TestHTableAuthenticator)
  testTableCreateAndDeleteXML(org.apache.hadoop.hbase.stargate.TestSchemaResource)
  testTableCreateAndDeletePB(org.apache.hadoop.hbase.stargate.TestSchemaResource)
  testGetUserUnknown(org.apache.hadoop.hbase.stargate.auth.TestZooKeeperAuthenticator)
  testGetAdminUser(org.apache.hadoop.hbase.stargate.auth.TestZooKeeperAuthenticator)
  testGetPlainUser(org.apache.hadoop.hbase.stargate.auth.TestZooKeeperAuthenticator)
  testGetDisabledUser(org.apache.hadoop.hbase.stargate.auth.TestZooKeeperAuthenticator)
  testDFSMiniCluster(org.apache.hadoop.hbase.stargate.Test00MiniCluster)
  testZooKeeperMiniCluster(org.apache.hadoop.hbase.stargate.Test00MiniCluster)
  testHBaseMiniCluster(org.apache.hadoop.hbase.stargate.Test00MiniCluster)
  testStargateServlet(org.apache.hadoop.hbase.stargate.Test00MiniCluster)
  testGetStargateVersionText(org.apache.hadoop.hbase.stargate.TestVersionResource)
  testGetStargateVersionXML(org.apache.hadoop.hbase.stargate.TestVersionResource)
  testGetStargateVersionJSON(org.apache.hadoop.hbase.stargate.TestVersionResource)
  testGetStargateVersionPB(org.apache.hadoop.hbase.stargate.TestVersionResource)
  testGetStorageClusterVersionText(org.apache.hadoop.hbase.stargate.TestVersionResource)
  testGetStorageClusterVersionXML(org.apache.hadoop.hbase.stargate.TestVersionResource)
  testGetStorageClusterVersionJSON(org.apache.hadoop.hbase.stargate.TestVersionResource)
  testNoFilter(org.apache.hadoop.hbase.stargate.TestScannersWithFilters)
  testPrefixFilter(org.apache.hadoop.hbase.stargate.TestScannersWithFilters)
  testPageFilter(org.apache.hadoop.hbase.stargate.TestScannersWithFilters)
  testInclusiveStopFilter(org.apache.hadoop.hbase.stargate.TestScannersWithFilters)
  testQualifierFilter(org.apache.hadoop.hbase.stargate.TestScannersWithFilters)
  testRowFilter(org.apache.hadoop.hbase.stargate.TestScannersWithFilters)
  testValueFilter(org.apache.hadoop.hbase.stargate.TestScannersWithFilters)
  testSkipFilter(org.apache.hadoop.hbase.stargate.TestScannersWithFilters)
  testFilterList(org.apache.hadoop.hbase.stargate.TestScannersWithFilters)
  testFirstKeyOnlyFilter(org.apache.hadoop.hbase.stargate.TestScannersWithFilters)
  testSimpleScannerXML(org.apache.hadoop.hbase.stargate.TestScannerResource)
  testSimpleScannerPB(org.apache.hadoop.hbase.stargate.TestScannerResource)
  testSimpleScannerBinary(org.apache.hadoop.hbase.stargate.TestScannerResource)
  testFullTableScan(org.apache.hadoop.hbase.stargate.TestScannerResource)
  testTableListText(org.apache.hadoop.hbase.stargate.TestTableResource)
  testTableListXML(org.apache.hadoop.hbase.stargate.TestTableResource)
  testTableListJSON(org.apache.hadoop.hbase.stargate.TestTableResource)
  testTableListPB(org.apache.hadoop.hbase.stargate.TestTableResource)

Tests run: 89, Failures: 0, Errors: 49, Skipped: 0

[INFO] ------------------------------------------------------------------------
[ERROR] BUILD FAILURE
[INFO] ------------------------------------------------------------------------
[INFO] There are test failures.

Please refer to <http://hudson.zones.apache.org/hudson/job/HBase-Patch/ws/trunk/contrib/stargate/target/surefire-reports>
for the individual test results.
[INFO] ------------------------------------------------------------------------
[INFO] For more information, run Maven with the -e switch
[INFO] ------------------------------------------------------------------------
[INFO] Total time: 34 minutes 38 seconds
[INFO] Finished at: Mon Mar 15 21:26:13 UTC 2010
[INFO] Final Memory: 59M/126M
[INFO] ------------------------------------------------------------------------
[locks-and-latches] Releasing all the locks
[locks-and-latches] All the locks released
Archiving artifacts
Recording test results


Mime
View raw message