hbase-dev mailing list archives

Site index · List index
Message view « Date » · « Thread »
Top « Date » · « Thread »
From Apache Hudson Server <hud...@hudson.zones.apache.org>
Subject Build failed in Hudson: hbase-020-branch #4
Date Thu, 11 Mar 2010 04:57:06 GMT
See <http://hudson.zones.apache.org/hudson/job/hbase-020-branch/4/changes>

Changes:

[stack] HBASE-2307 hbase-2295 changed hregion size, testheapsize broke... fix it

[apurtell] [EC2] increase namenode heap to 3000m

------------------------------------------
[...truncated 292 lines...]
    [junit] Tests run: 2, Failures: 0, Errors: 0, Time elapsed: 36.561 sec
    [junit] Running org.apache.hadoop.hbase.client.TestGetRowVersions
    [junit] Tests run: 1, Failures: 0, Errors: 0, Time elapsed: 44.566 sec
    [junit] Running org.apache.hadoop.hbase.client.TestHBaseAdmin
    [junit] Tests run: 3, Failures: 0, Errors: 0, Time elapsed: 99.156 sec
    [junit] Running org.apache.hadoop.hbase.client.TestHTable
    [junit] Tests run: 6, Failures: 0, Errors: 0, Time elapsed: 109.54 sec
    [junit] Running org.apache.hadoop.hbase.client.TestHTablePool
    [junit] Tests run: 4, Failures: 0, Errors: 0, Time elapsed: 0.197 sec
    [junit] Running org.apache.hadoop.hbase.client.TestListTables
    [junit] Tests run: 1, Failures: 0, Errors: 0, Time elapsed: 30.381 sec
    [junit] Running org.apache.hadoop.hbase.client.TestOldAPIGetRowVersions
    [junit] Tests run: 1, Failures: 0, Errors: 0, Time elapsed: 18.442 sec
    [junit] Running org.apache.hadoop.hbase.client.TestOldAPIHTable
    [junit] Tests run: 5, Failures: 0, Errors: 0, Time elapsed: 99.477 sec
    [junit] Running org.apache.hadoop.hbase.client.TestOldAPITimestamp
    [junit] Tests run: 1, Failures: 0, Errors: 0, Time elapsed: 27.862 sec
    [junit] Running org.apache.hadoop.hbase.client.TestPut
    [junit] Tests run: 5, Failures: 0, Errors: 0, Time elapsed: 94.507 sec
    [junit] Running org.apache.hadoop.hbase.client.TestScannerTimes
    [junit] Tests run: 1, Failures: 0, Errors: 0, Time elapsed: 23.448 sec
    [junit] Running org.apache.hadoop.hbase.client.TestTimestamp
    [junit] Tests run: 1, Failures: 0, Errors: 0, Time elapsed: 20.19 sec
    [junit] Running org.apache.hadoop.hbase.filter.TestFilter
    [junit] Tests run: 14, Failures: 0, Errors: 0, Time elapsed: 2.029 sec
    [junit] Running org.apache.hadoop.hbase.filter.TestFilterAcrossRegions
    [junit] Tests run: 1, Failures: 0, Errors: 0, Time elapsed: 0.42 sec
    [junit] Running org.apache.hadoop.hbase.filter.TestFilterList
    [junit] Tests run: 4, Failures: 0, Errors: 0, Time elapsed: 0.211 sec
    [junit] Running org.apache.hadoop.hbase.filter.TestInclusiveStopFilter
    [junit] Tests run: 2, Failures: 0, Errors: 0, Time elapsed: 0.006 sec
    [junit] Running org.apache.hadoop.hbase.filter.TestPageFilter
    [junit] Tests run: 2, Failures: 0, Errors: 0, Time elapsed: 0.005 sec
    [junit] Running org.apache.hadoop.hbase.filter.TestPrefixFilter
    [junit] Tests run: 3, Failures: 0, Errors: 0, Time elapsed: 0.009 sec
    [junit] Running org.apache.hadoop.hbase.filter.TestSingleColumnValueFilter
    [junit] Tests run: 2, Failures: 0, Errors: 0, Time elapsed: 0.122 sec
    [junit] Running org.apache.hadoop.hbase.io.TestHbaseObjectWritable
    [junit] Tests run: 1, Failures: 0, Errors: 0, Time elapsed: 0.17 sec
    [junit] Running org.apache.hadoop.hbase.io.TestHeapSize
    [junit] Tests run: 2, Failures: 0, Errors: 0, Time elapsed: 0.047 sec
    [junit] Running org.apache.hadoop.hbase.io.hfile.TestCachedBlockQueue
    [junit] Tests run: 2, Failures: 0, Errors: 0, Time elapsed: 0.073 sec
    [junit] Running org.apache.hadoop.hbase.io.hfile.TestHFile
    [junit] Tests run: 7, Failures: 0, Errors: 0, Time elapsed: 0.419 sec
    [junit] Running org.apache.hadoop.hbase.io.hfile.TestHFilePerformance
    [junit] Tests run: 1, Failures: 0, Errors: 0, Time elapsed: 5.952 sec
    [junit] Running org.apache.hadoop.hbase.io.hfile.TestHFileSeek
    [junit] Tests run: 1, Failures: 0, Errors: 0, Time elapsed: 5.392 sec
    [junit] Running org.apache.hadoop.hbase.io.hfile.TestLruBlockCache
    [junit] Tests run: 7, Failures: 0, Errors: 0, Time elapsed: 1.114 sec
    [junit] Running org.apache.hadoop.hbase.io.hfile.TestSeekTo
    [junit] Tests run: 3, Failures: 0, Errors: 0, Time elapsed: 0.25 sec
    [junit] Running org.apache.hadoop.hbase.mapred.TestTableIndex
    [junit] Tests run: 1, Failures: 0, Errors: 0, Time elapsed: 59.504 sec
    [junit] Running org.apache.hadoop.hbase.mapred.TestTableMapReduce
    [junit] Tests run: 1, Failures: 0, Errors: 0, Time elapsed: 61.934 sec
    [junit] Running org.apache.hadoop.hbase.mapreduce.TestHFileOutputFormat
    [junit] Tests run: 1, Failures: 0, Errors: 0, Time elapsed: 5.616 sec
    [junit] Running org.apache.hadoop.hbase.mapreduce.TestTableIndex
    [junit] Tests run: 1, Failures: 0, Errors: 0, Time elapsed: 68.919 sec
    [junit] Running org.apache.hadoop.hbase.mapreduce.TestTableMapReduce
    [junit] Tests run: 1, Failures: 0, Errors: 0, Time elapsed: 60.629 sec
    [junit] Running org.apache.hadoop.hbase.mapreduce.TestTimeRangeMapRed
    [junit] Tests run: 1, Failures: 0, Errors: 0, Time elapsed: 31.146 sec
    [junit] Running org.apache.hadoop.hbase.master.TestMinimumServerCount
    [junit] Tests run: 1, Failures: 0, Errors: 0, Time elapsed: 49.372 sec
    [junit] Running org.apache.hadoop.hbase.master.TestRegionManager
    [junit] Tests run: 1, Failures: 0, Errors: 0, Time elapsed: 14.372 sec
    [junit] Running org.apache.hadoop.hbase.metrics.TestMetricsMBeanBase
    [junit] Tests run: 2, Failures: 0, Errors: 0, Time elapsed: 0.087 sec
    [junit] Running org.apache.hadoop.hbase.regionserver.TestCompaction
    [junit] Tests run: 2, Failures: 0, Errors: 0, Time elapsed: 34.743 sec
    [junit] Running org.apache.hadoop.hbase.regionserver.TestDeleteCompare
    [junit] Tests run: 4, Failures: 0, Errors: 0, Time elapsed: 0.089 sec
    [junit] Running org.apache.hadoop.hbase.regionserver.TestExplicitColumnTracker
    [junit] Tests run: 3, Failures: 0, Errors: 0, Time elapsed: 0.621 sec
    [junit] Running org.apache.hadoop.hbase.regionserver.TestGetClosestAtOrBefore
    [junit] Tests run: 3, Failures: 0, Errors: 0, Time elapsed: 13.186 sec
    [junit] Running org.apache.hadoop.hbase.regionserver.TestGetDeleteTracker
    [junit] Tests run: 7, Failures: 0, Errors: 0, Time elapsed: 0.026 sec
    [junit] Running org.apache.hadoop.hbase.regionserver.TestHLog
    [junit] Tests run: 3, Failures: 0, Errors: 0, Time elapsed: 14.693 sec
    [junit] Running org.apache.hadoop.hbase.regionserver.TestHRegion
    [junit] Tests run: 41, Failures: 0, Errors: 0, Time elapsed: 29.543 sec
    [junit] Running org.apache.hadoop.hbase.regionserver.TestHRegionInfo
    [junit] Tests run: 1, Failures: 0, Errors: 0, Time elapsed: 0.196 sec
    [junit] Running org.apache.hadoop.hbase.regionserver.TestKeyValueHeap
    [junit] Tests run: 3, Failures: 0, Errors: 0, Time elapsed: 0.014 sec
    [junit] Running org.apache.hadoop.hbase.regionserver.TestKeyValueScanFixture
    [junit] Tests run: 1, Failures: 0, Errors: 0, Time elapsed: 0.08 sec
    [junit] Running org.apache.hadoop.hbase.regionserver.TestKeyValueSkipListSet
    [junit] Tests run: 4, Failures: 0, Errors: 0, Time elapsed: 0.009 sec
    [junit] Running org.apache.hadoop.hbase.regionserver.TestLogRolling
    [junit] Tests run: 2, Failures: 0, Errors: 0, Time elapsed: 144.958 sec
    [junit] Running org.apache.hadoop.hbase.regionserver.TestLruHashMap
    [junit] Tests run: 9, Failures: 0, Errors: 0, Time elapsed: 1.605 sec
    [junit] Running org.apache.hadoop.hbase.regionserver.TestMemStore
    [junit] Tests run: 17, Failures: 0, Errors: 0, Time elapsed: 0.215 sec
    [junit] Running org.apache.hadoop.hbase.regionserver.TestMinorCompactingStoreScanner
    [junit] Tests run: 2, Failures: 0, Errors: 0, Time elapsed: 0.083 sec
    [junit] Running org.apache.hadoop.hbase.regionserver.TestQueryMatcher
    [junit] Tests run: 4, Failures: 0, Errors: 0, Time elapsed: 0.019 sec
    [junit] Running org.apache.hadoop.hbase.regionserver.TestScanDeleteTracker
    [junit] Tests run: 6, Failures: 0, Errors: 0, Time elapsed: 0.008 sec
    [junit] Running org.apache.hadoop.hbase.regionserver.TestScanWildcardColumnTracker
    [junit] Tests run: 2, Failures: 0, Errors: 0, Time elapsed: 0.152 sec
    [junit] Running org.apache.hadoop.hbase.regionserver.TestScanner
    [junit] Tests run: 6, Failures: 0, Errors: 0, Time elapsed: 29.656 sec
    [junit] Running org.apache.hadoop.hbase.regionserver.TestStore
    [junit] Tests run: 5, Failures: 0, Errors: 0, Time elapsed: 0.831 sec
    [junit] Running org.apache.hadoop.hbase.regionserver.TestStoreFile
    [junit] Tests run: 2, Failures: 0, Errors: 0, Time elapsed: 11.524 sec
    [junit] Running org.apache.hadoop.hbase.regionserver.TestStoreScanner
    [junit] Tests run: 13, Failures: 0, Errors: 0, Time elapsed: 0.095 sec
    [junit] Running org.apache.hadoop.hbase.regionserver.TestWildcardColumnTracker
    [junit] Tests run: 6, Failures: 0, Errors: 0, Time elapsed: 0.377 sec
    [junit] Running org.apache.hadoop.hbase.thrift.TestThriftServer
    [junit] Tests run: 1, Failures: 0, Errors: 0, Time elapsed: 87.024 sec
    [junit] Running org.apache.hadoop.hbase.util.TestBase64
    [junit] Tests run: 1, Failures: 0, Errors: 0, Time elapsed: 0.074 sec
    [junit] Running org.apache.hadoop.hbase.util.TestBytes
    [junit] Tests run: 11, Failures: 0, Errors: 0, Time elapsed: 0.037 sec
    [junit] Running org.apache.hadoop.hbase.util.TestKeying
    [junit] Tests run: 1, Failures: 0, Errors: 0, Time elapsed: 0.006 sec
    [junit] Running org.apache.hadoop.hbase.util.TestMergeTool
    [junit] Tests run: 1, Failures: 0, Errors: 0, Time elapsed: 12.668 sec
    [junit] Running org.apache.hadoop.hbase.util.TestMigration
    [junit] Tests run: 1, Failures: 0, Errors: 0, Time elapsed: 19.102 sec
    [junit] Running org.apache.hadoop.hbase.util.TestPair
    [junit] Tests run: 9, Failures: 0, Errors: 0, Time elapsed: 0.243 sec
    [junit] Running org.apache.hadoop.hbase.util.TestRootPath
    [junit] Tests run: 1, Failures: 0, Errors: 0, Time elapsed: 0.013 sec

test-contrib:

test:

compile:

compile-examples:

compile-test:

test:

clover.setup:

clover.info:
     [echo] 
     [echo]       Clover not found. Code coverage reports disabled.
     [echo]     

clover:

check-contrib:

init:
     [echo] contrib: indexed

init-contrib:

compile:
     [echo] contrib: indexed

compile-examples:

compile-test:
     [echo] contrib: indexed
    [javac] Compiling 32 source files to <http://hudson.zones.apache.org/hudson/job/hbase-020-branch/ws/trunk/build/contrib/indexed/test>
    [javac] Note: <http://hudson.zones.apache.org/hudson/job/hbase-020-branch/ws/trunk/src/contrib/indexed/src/test/org/apache/hadoop/hbase/regionserver/TestIdxRegion.java>
uses unchecked or unsafe operations.
    [javac] Note: Recompile with -Xlint:unchecked for details.

test:
     [echo] contrib: indexed
   [delete] Deleting directory <http://hudson.zones.apache.org/hudson/job/hbase-020-branch/ws/trunk/build/contrib/indexed/test/logs>
    [mkdir] Created dir: <http://hudson.zones.apache.org/hudson/job/hbase-020-branch/ws/trunk/build/contrib/indexed/test/logs>
    [junit] Running org.apache.hadoop.hbase.TestIdxHBaseCluster
    [junit] Tests run: 2, Failures: 0, Errors: 0, Time elapsed: 117.784 sec
    [junit] Running org.apache.hadoop.hbase.TestIdxMasterAdmin
    [junit] Tests run: 1, Failures: 0, Errors: 0, Time elapsed: 26.364 sec
    [junit] Running org.apache.hadoop.hbase.TestWritableHelper
    [junit] Tests run: 6, Failures: 0, Errors: 0, Time elapsed: 0.022 sec
    [junit] Running org.apache.hadoop.hbase.client.idx.TestIdxColumnDescriptor
    [junit] Tests run: 8, Failures: 0, Errors: 0, Time elapsed: 0.104 sec
    [junit] Running org.apache.hadoop.hbase.client.idx.TestIdxIndexDescriptor
    [junit] Tests run: 2, Failures: 0, Errors: 0, Time elapsed: 0.083 sec
    [junit] Running org.apache.hadoop.hbase.client.idx.TestIdxScan
    [junit] Tests run: 2, Failures: 0, Errors: 0, Time elapsed: 0.023 sec
    [junit] Running org.apache.hadoop.hbase.client.idx.exp.TestComparison
    [junit] Tests run: 4, Failures: 0, Errors: 0, Time elapsed: 0.017 sec
    [junit] Running org.apache.hadoop.hbase.client.idx.exp.TestExpression
    [junit] Tests run: 2, Failures: 0, Errors: 0, Time elapsed: 0.019 sec
    [junit] Running org.apache.hadoop.hbase.regionserver.TestCompleteIndex
    [junit] Tests run: 5, Failures: 1, Errors: 0, Time elapsed: 0.207 sec
    [junit] Test org.apache.hadoop.hbase.regionserver.TestCompleteIndex FAILED
    [junit] Running org.apache.hadoop.hbase.regionserver.TestHRegionWithIdxRegion
    [junit] Tests run: 41, Failures: 0, Errors: 0, Time elapsed: 22.495 sec
    [junit] Running org.apache.hadoop.hbase.regionserver.TestHRegionWithIdxRegionNoIndexes
    [junit] Tests run: 41, Failures: 0, Errors: 0, Time elapsed: 22.987 sec
    [junit] Running org.apache.hadoop.hbase.regionserver.TestIdxExpressionEvaluator
    [junit] Tests run: 12, Failures: 0, Errors: 0, Time elapsed: 0.147 sec
    [junit] Running org.apache.hadoop.hbase.regionserver.TestIdxRegion
    [junit] Tests run: 13, Failures: 0, Errors: 0, Time elapsed: 9.595 sec
    [junit] Running org.apache.hadoop.hbase.regionserver.TestIdxRegionIndexManager
    [junit] Tests run: 1, Failures: 0, Errors: 0, Time elapsed: 0.144 sec
    [junit] Running org.apache.hadoop.hbase.regionserver.TestIdxRegionMBeanImpl
    [junit] Tests run: 2, Failures: 0, Errors: 0, Time elapsed: 0.098 sec
    [junit] Running org.apache.hadoop.hbase.regionserver.TestIdxRegionPerformance
    [junit] Tests run: 1, Failures: 0, Errors: 0, Time elapsed: 2.036 sec
    [junit] Running org.apache.hadoop.hbase.regionserver.idx.support.TestBits
    [junit] Tests run: 4, Failures: 0, Errors: 0, Time elapsed: 1.637 sec
    [junit] Running org.apache.hadoop.hbase.regionserver.idx.support.TestIdxClassSize
    [junit] Tests run: 1, Failures: 0, Errors: 0, Time elapsed: 0.141 sec
    [junit] Running org.apache.hadoop.hbase.regionserver.idx.support.arrays.TestBigDecimalArrayList
    [junit] Tests run: 13, Failures: 0, Errors: 0, Time elapsed: 0.271 sec
    [junit] Running org.apache.hadoop.hbase.regionserver.idx.support.arrays.TestByteArrayArrayList
    [junit] Tests run: 13, Failures: 0, Errors: 0, Time elapsed: 0.279 sec
    [junit] Running org.apache.hadoop.hbase.regionserver.idx.support.arrays.TestByteArrayList
    [junit] Tests run: 13, Failures: 0, Errors: 0, Time elapsed: 0.325 sec
    [junit] Running org.apache.hadoop.hbase.regionserver.idx.support.arrays.TestCharArrayArrayList
    [junit] Tests run: 13, Failures: 0, Errors: 0, Time elapsed: 0.286 sec
    [junit] Running org.apache.hadoop.hbase.regionserver.idx.support.arrays.TestCharArrayList
    [junit] Tests run: 13, Failures: 0, Errors: 0, Time elapsed: 0.275 sec
    [junit] Running org.apache.hadoop.hbase.regionserver.idx.support.arrays.TestDoubleArrayList
    [junit] Tests run: 13, Failures: 0, Errors: 0, Time elapsed: 0.274 sec
    [junit] Running org.apache.hadoop.hbase.regionserver.idx.support.arrays.TestFloatArrayList
    [junit] Tests run: 13, Failures: 0, Errors: 0, Time elapsed: 0.295 sec
    [junit] Running org.apache.hadoop.hbase.regionserver.idx.support.arrays.TestIntegerArrayList
    [junit] Tests run: 13, Failures: 0, Errors: 0, Time elapsed: 0.289 sec
    [junit] Running org.apache.hadoop.hbase.regionserver.idx.support.arrays.TestLongArrayList
    [junit] Tests run: 13, Failures: 0, Errors: 0, Time elapsed: 0.27 sec
    [junit] Running org.apache.hadoop.hbase.regionserver.idx.support.arrays.TestShortArrayList
    [junit] Tests run: 13, Failures: 0, Errors: 0, Time elapsed: 0.327 sec
    [junit] Running org.apache.hadoop.hbase.regionserver.idx.support.sets.TestBitSet
    [junit] Tests run: 11, Failures: 1, Errors: 0, Time elapsed: 0.268 sec
    [junit] Test org.apache.hadoop.hbase.regionserver.idx.support.sets.TestBitSet FAILED
    [junit] Running org.apache.hadoop.hbase.regionserver.idx.support.sets.TestSparseBitSet
    [junit] Tests run: 11, Failures: 0, Errors: 0, Time elapsed: 0.283 sec

BUILD FAILED
<http://hudson.zones.apache.org/hudson/job/hbase-020-branch/ws/trunk/build.xml>:522:
The following error occurred while executing this line:
<http://hudson.zones.apache.org/hudson/job/hbase-020-branch/ws/trunk/src/contrib/build.xml>:54:
The following error occurred while executing this line:
<http://hudson.zones.apache.org/hudson/job/hbase-020-branch/ws/trunk/src/contrib/build-contrib.xml>:284:
Tests failed!

Total time: 44 minutes 38 seconds
[locks-and-latches] Releasing all the locks
[locks-and-latches] All the locks released
Recording test results


Mime
View raw message