hbase-dev mailing list archives

Site index · List index
Message view « Date » · « Thread »
Top « Date » · « Thread »
From Apache Hudson Server <hud...@hudson.zones.apache.org>
Subject Build failed in Hudson: HBase-Patch #1131
Date Fri, 26 Feb 2010 04:33:36 GMT
See <http://hudson.zones.apache.org/hudson/job/HBase-Patch/1131/changes>

Changes:

[apurtell] HBASE-2263 [stargate] multiuser mode: authenticator for zookeeper

[apurtell] stargate needs org.json

------------------------------------------
[...truncated 718 lines...]
7973/?
8486/?
8645/?
9157/?
9669/?
10181/?
10692/?
11287/?
11799/?
12311/?
12823/?
13335/?
13848/?
14400/?
15008/?
15519/?
16031/?
16543/?
16815/?
16839/?
17293/?
17805/?
18317/?
18830/?
19342/?
19854/?
20365/?
20381/?
20893/?
21405/?
21916/?
22429/?
22941/?
23571/?
24129/?
24641/?
25153/?
25665/?
26177/?
26735/?
27247/?
27760/?
28311/?
28824/?
29378/?
29890/?
30403/?
30914/?
31427/?
31938/?
32449/?
32961/?
33474/?
33913/?
34425/?
34936/?
35446/?
35956/?
36469/?
36987/?
37503/?
38016/?
38529/?
39082/?
39593/?
40103/?
40616/?
41128/?
41639/?
42203/?
42714/?
43225/?
43736/?
43864/?
44376/?
45879/?
45944/?
       
[INFO] [compiler:compile {execution: default-compile}]
[INFO] Compiling 54 source files to <http://hudson.zones.apache.org/hudson/job/HBase-Patch/ws/trunk/contrib/stargate/target/classes>
[INFO] [resources:testResources {execution: default-testResources}]
[INFO] Using 'UTF-8' encoding to copy filtered resources.
[INFO] skip non existing resourceDirectory <http://hudson.zones.apache.org/hudson/job/HBase-Patch/ws/trunk/contrib/stargate/src/test/resources>
[INFO] [compiler:testCompile {execution: default-testCompile}]
[INFO] Compiling 24 source files to <http://hudson.zones.apache.org/hudson/job/HBase-Patch/ws/trunk/contrib/stargate/target/test-classes>
[INFO] [surefire:test {execution: default-test}]
[INFO] Surefire report directory: <http://hudson.zones.apache.org/hudson/job/HBase-Patch/ws/trunk/contrib/stargate/target/surefire-reports>

-------------------------------------------------------
 T E S T S
-------------------------------------------------------
Running org.apache.hadoop.hbase.stargate.model.TestScannerModel
Tests run: 3, Failures: 0, Errors: 0, Skipped: 0, Time elapsed: 0.467 sec
Running org.apache.hadoop.hbase.stargate.model.TestTableSchemaModel
Tests run: 3, Failures: 0, Errors: 0, Skipped: 0, Time elapsed: 0.038 sec
Running org.apache.hadoop.hbase.stargate.model.TestStorageClusterVersionModel
Tests run: 2, Failures: 0, Errors: 0, Skipped: 0, Time elapsed: 0.012 sec
Running org.apache.hadoop.hbase.stargate.TestRowResource
Tests run: 8, Failures: 0, Errors: 0, Skipped: 0, Time elapsed: 15.99 sec
Running org.apache.hadoop.hbase.stargate.model.TestTableInfoModel
Tests run: 3, Failures: 0, Errors: 0, Skipped: 0, Time elapsed: 0.028 sec
Running org.apache.hadoop.hbase.stargate.TestStatusResource
Tests run: 2, Failures: 0, Errors: 0, Skipped: 0, Time elapsed: 0.094 sec
Running org.apache.hadoop.hbase.stargate.auth.TestHTableAuthenticator
Tests run: 4, Failures: 0, Errors: 0, Skipped: 0, Time elapsed: 5.3 sec
Running org.apache.hadoop.hbase.stargate.TestSchemaResource
Tests run: 2, Failures: 0, Errors: 0, Skipped: 0, Time elapsed: 20.772 sec
Running org.apache.hadoop.hbase.stargate.auth.TestJDBCAuthenticator
Tests run: 4, Failures: 0, Errors: 0, Skipped: 0, Time elapsed: 0.123 sec
Running org.apache.hadoop.hbase.stargate.auth.TestZooKeeperAuthenticator
Tests run: 4, Failures: 0, Errors: 0, Skipped: 0, Time elapsed: 0.401 sec
Running org.apache.hadoop.hbase.stargate.Test00MiniCluster
Tests run: 4, Failures: 0, Errors: 0, Skipped: 0, Time elapsed: 0.003 sec
Running org.apache.hadoop.hbase.stargate.TestVersionResource
Tests run: 7, Failures: 0, Errors: 0, Skipped: 0, Time elapsed: 0.069 sec
Running org.apache.hadoop.hbase.stargate.model.TestTableListModel
Tests run: 3, Failures: 0, Errors: 0, Skipped: 0, Time elapsed: 0.015 sec
Running org.apache.hadoop.hbase.stargate.model.TestVersionModel
Tests run: 3, Failures: 0, Errors: 0, Skipped: 0, Time elapsed: 0.015 sec
Running org.apache.hadoop.hbase.stargate.auth.TestHBCAuthenticator
Tests run: 4, Failures: 0, Errors: 0, Skipped: 0, Time elapsed: 0.016 sec
Running org.apache.hadoop.hbase.stargate.model.TestStorageClusterStatusModel
Tests run: 3, Failures: 0, Errors: 0, Skipped: 0, Time elapsed: 0.059 sec
Running org.apache.hadoop.hbase.stargate.model.TestCellModel
Tests run: 3, Failures: 0, Errors: 0, Skipped: 0, Time elapsed: 0.012 sec
Running org.apache.hadoop.hbase.stargate.TestScannerResource
Tests run: 4, Failures: 0, Errors: 0, Skipped: 0, Time elapsed: 21.11 sec
Running org.apache.hadoop.hbase.stargate.model.TestCellSetModel
Tests run: 3, Failures: 0, Errors: 0, Skipped: 0, Time elapsed: 0.02 sec
Running org.apache.hadoop.hbase.stargate.model.TestTableRegionModel
Tests run: 2, Failures: 0, Errors: 0, Skipped: 0, Time elapsed: 0.011 sec
Running org.apache.hadoop.hbase.stargate.model.TestColumnSchemaModel
Tests run: 2, Failures: 0, Errors: 0, Skipped: 0, Time elapsed: 0.005 sec
Running org.apache.hadoop.hbase.stargate.model.TestRowModel
Tests run: 2, Failures: 0, Errors: 0, Skipped: 0, Time elapsed: 0.013 sec
Running org.apache.hadoop.hbase.stargate.TestTableResource
Tests run: 4, Failures: 0, Errors: 0, Skipped: 0, Time elapsed: 5.43 sec

Results :

Tests run: 79, Failures: 0, Errors: 0, Skipped: 0

[INFO] [war:war {execution: default-war}]
[INFO] Packaging webapp
[INFO] Assembling webapp[hbase-contrib-stargate] in [<http://hudson.zones.apache.org/hudson/job/HBase-Patch/ws/trunk/contrib/stargate/target/hbase-contrib-stargate-0.21.0-SNAPSHOT]>
[INFO] Processing war project
[INFO] Webapp assembled in[316 msecs]
[INFO] Building war: <http://hudson.zones.apache.org/hudson/job/HBase-Patch/ws/trunk/contrib/stargate/target/hbase-contrib-stargate-0.21.0-SNAPSHOT.war>
[INFO] [install:install {execution: default-install}]
[INFO] Installing <http://hudson.zones.apache.org/hudson/job/HBase-Patch/ws/trunk/contrib/stargate/target/hbase-contrib-stargate-0.21.0-SNAPSHOT.war>
to /home/hudson/.m2/repository/org/apache/hbase/hbase-contrib-stargate/0.21.0-SNAPSHOT/hbase-contrib-stargate-0.21.0-SNAPSHOT.war
[INFO] ------------------------------------------------------------------------
[INFO] Building HBase Contrib - Transactional
[INFO]    task-segment: [clean, install]
[INFO] ------------------------------------------------------------------------
[INFO] [clean:clean {execution: default-clean}]
[INFO] Deleting directory <http://hudson.zones.apache.org/hudson/job/HBase-Patch/ws/trunk/contrib/transactional/target>
[INFO] [resources:resources {execution: default-resources}]
[INFO] Using 'UTF-8' encoding to copy filtered resources.
[INFO] skip non existing resourceDirectory <http://hudson.zones.apache.org/hudson/job/HBase-Patch/ws/trunk/contrib/transactional/src/main/resources>
[INFO] [compiler:compile {execution: default-compile}]
[INFO] Compiling 31 source files to <http://hudson.zones.apache.org/hudson/job/HBase-Patch/ws/trunk/contrib/transactional/target/classes>
[WARNING] <http://hudson.zones.apache.org/hudson/job/HBase-Patch/ws/trunk/contrib/transactional/src/main/java/org/apache/hadoop/hbase/client/transactional/HBaseBackedTransactionLogger.java>:[56,38]
[deprecation] HBaseConfiguration() in org.apache.hadoop.hbase.HBaseConfiguration has been
deprecated

[WARNING] <http://hudson.zones.apache.org/hudson/job/HBase-Patch/ws/trunk/contrib/transactional/src/main/java/org/apache/hadoop/hbase/client/transactional/HBaseBackedTransactionLogger.java>:[68,38]
[deprecation] HBaseConfiguration() in org.apache.hadoop.hbase.HBaseConfiguration has been
deprecated

[WARNING] <http://hudson.zones.apache.org/hudson/job/HBase-Patch/ws/trunk/contrib/transactional/src/main/java/org/apache/hadoop/hbase/client/tableindexed/IndexSpecification.java>:[154,49]
[deprecation] HBaseConfiguration() in org.apache.hadoop.hbase.HBaseConfiguration has been
deprecated

[INFO] [resources:testResources {execution: default-testResources}]
[INFO] Using 'UTF-8' encoding to copy filtered resources.
[INFO] skip non existing resourceDirectory <http://hudson.zones.apache.org/hudson/job/HBase-Patch/ws/trunk/contrib/transactional/src/test/resources>
[INFO] [compiler:testCompile {execution: default-testCompile}]
[INFO] Compiling 7 source files to <http://hudson.zones.apache.org/hudson/job/HBase-Patch/ws/trunk/contrib/transactional/target/test-classes>
[WARNING] <http://hudson.zones.apache.org/hudson/job/HBase-Patch/ws/trunk/contrib/transactional/src/test/java/org/apache/hadoop/hbase/client/tableindexed/TestIndexedTable.java>:[29,30]
[deprecation] org.apache.hadoop.hbase.HBaseClusterTestCase in org.apache.hadoop.hbase has
been deprecated

[WARNING] <http://hudson.zones.apache.org/hudson/job/HBase-Patch/ws/trunk/contrib/transactional/src/test/java/org/apache/hadoop/hbase/client/tableindexed/TestIndexedTable.java>:[43,38]
[deprecation] org.apache.hadoop.hbase.HBaseClusterTestCase in org.apache.hadoop.hbase has
been deprecated

[WARNING] <http://hudson.zones.apache.org/hudson/job/HBase-Patch/ws/trunk/contrib/transactional/src/test/java/org/apache/hadoop/hbase/client/transactional/TestTransactions.java>:[26,30]
[deprecation] org.apache.hadoop.hbase.HBaseClusterTestCase in org.apache.hadoop.hbase has
been deprecated

[WARNING] <http://hudson.zones.apache.org/hudson/job/HBase-Patch/ws/trunk/contrib/transactional/src/test/java/org/apache/hadoop/hbase/client/transactional/TestTransactions.java>:[44,38]
[deprecation] org.apache.hadoop.hbase.HBaseClusterTestCase in org.apache.hadoop.hbase has
been deprecated

[WARNING] <http://hudson.zones.apache.org/hudson/job/HBase-Patch/ws/trunk/contrib/transactional/src/test/java/org/apache/hadoop/hbase/regionserver/transactional/TestTHLogRecovery.java>:[30,30]
[deprecation] org.apache.hadoop.hbase.HBaseClusterTestCase in org.apache.hadoop.hbase has
been deprecated

[WARNING] <http://hudson.zones.apache.org/hudson/job/HBase-Patch/ws/trunk/contrib/transactional/src/test/java/org/apache/hadoop/hbase/regionserver/transactional/TestTHLogRecovery.java>:[51,39]
[deprecation] org.apache.hadoop.hbase.HBaseClusterTestCase in org.apache.hadoop.hbase has
been deprecated

[WARNING] <http://hudson.zones.apache.org/hudson/job/HBase-Patch/ws/trunk/contrib/transactional/src/test/java/org/apache/hadoop/hbase/client/transactional/StressTestTransactions.java>:[32,30]
[deprecation] org.apache.hadoop.hbase.HBaseClusterTestCase in org.apache.hadoop.hbase has
been deprecated

[WARNING] <http://hudson.zones.apache.org/hudson/job/HBase-Patch/ws/trunk/contrib/transactional/src/test/java/org/apache/hadoop/hbase/client/transactional/StressTestTransactions.java>:[53,44]
[deprecation] org.apache.hadoop.hbase.HBaseClusterTestCase in org.apache.hadoop.hbase has
been deprecated

[WARNING] <http://hudson.zones.apache.org/hudson/job/HBase-Patch/ws/trunk/contrib/transactional/src/test/java/org/apache/hadoop/hbase/regionserver/transactional/TestTHLog.java>:[27,30]
[deprecation] org.apache.hadoop.hbase.HBaseTestCase in org.apache.hadoop.hbase has been deprecated

[WARNING] <http://hudson.zones.apache.org/hudson/job/HBase-Patch/ws/trunk/contrib/transactional/src/test/java/org/apache/hadoop/hbase/regionserver/transactional/TestTHLog.java>:[37,31]
[deprecation] org.apache.hadoop.hbase.HBaseTestCase in org.apache.hadoop.hbase has been deprecated

[INFO] [surefire:test {execution: default-test}]
[INFO] Surefire report directory: <http://hudson.zones.apache.org/hudson/job/HBase-Patch/ws/trunk/contrib/transactional/target/surefire-reports>

-------------------------------------------------------
 T E S T S
-------------------------------------------------------
Running org.apache.hadoop.hbase.client.tableindexed.TestIndexedTable
Tests run: 7, Failures: 0, Errors: 7, Skipped: 0, Time elapsed: 4.372 sec <<< FAILURE!
Running org.apache.hadoop.hbase.regionserver.transactional.TestTHLog
Tests run: 5, Failures: 0, Errors: 5, Skipped: 0, Time elapsed: 1.608 sec <<< FAILURE!
Running org.apache.hadoop.hbase.client.transactional.TestTransactions
Tests run: 7, Failures: 0, Errors: 7, Skipped: 0, Time elapsed: 2.319 sec <<< FAILURE!
Running org.apache.hadoop.hbase.regionserver.transactional.TestTHLogRecovery
Tests run: 2, Failures: 0, Errors: 0, Skipped: 0, Time elapsed: 514.135 sec

Results :

Tests in error: 
  testInitialWrites(org.apache.hadoop.hbase.client.tableindexed.TestIndexedTable)
  testMultipleWrites(org.apache.hadoop.hbase.client.tableindexed.TestIndexedTable)
  testDelete(org.apache.hadoop.hbase.client.tableindexed.TestIndexedTable)
  testRowUpdate(org.apache.hadoop.hbase.client.tableindexed.TestIndexedTable)
  testLockedRowUpdate(org.apache.hadoop.hbase.client.tableindexed.TestIndexedTable)
  testLockedRowUpdateNoAutoFlush(org.apache.hadoop.hbase.client.tableindexed.TestIndexedTable)
  testLockedRowDelete(org.apache.hadoop.hbase.client.tableindexed.TestIndexedTable)
  testSingleCommit(org.apache.hadoop.hbase.regionserver.transactional.TestTHLog)
  testSingleAbort(org.apache.hadoop.hbase.regionserver.transactional.TestTHLog)
  testInterlievedCommits(org.apache.hadoop.hbase.regionserver.transactional.TestTHLog)
  testInterlievedAbortCommit(org.apache.hadoop.hbase.regionserver.transactional.TestTHLog)
  testInterlievedCommitAbort(org.apache.hadoop.hbase.regionserver.transactional.TestTHLog)
  testSimpleTransaction(org.apache.hadoop.hbase.client.transactional.TestTransactions)
  testTwoTransactionsWithoutConflict(org.apache.hadoop.hbase.client.transactional.TestTransactions)
  testTwoTransactionsWithConflict(org.apache.hadoop.hbase.client.transactional.TestTransactions)
  testGetAfterPut(org.apache.hadoop.hbase.client.transactional.TestTransactions)
  testScanAfterUpdatePut(org.apache.hadoop.hbase.client.transactional.TestTransactions)
  testScanAfterNewPut(org.apache.hadoop.hbase.client.transactional.TestTransactions)
  testPutPutScan(org.apache.hadoop.hbase.client.transactional.TestTransactions)

Tests run: 21, Failures: 0, Errors: 19, Skipped: 0

[INFO] ------------------------------------------------------------------------
[ERROR] BUILD FAILURE
[INFO] ------------------------------------------------------------------------
[INFO] There are test failures.

Please refer to <http://hudson.zones.apache.org/hudson/job/HBase-Patch/ws/trunk/contrib/transactional/target/surefire-reports>
for the individual test results.
[INFO] ------------------------------------------------------------------------
[INFO] For more information, run Maven with the -e switch
[INFO] ------------------------------------------------------------------------
[INFO] Total time: 42 minutes 34 seconds
[INFO] Finished at: Fri Feb 26 04:33:24 UTC 2010
[INFO] Final Memory: 71M/136M
[INFO] ------------------------------------------------------------------------
[locks-and-latches] Releasing all the locks
[locks-and-latches] All the locks released
Archiving artifacts
Recording test results


Mime
View raw message