hbase-dev mailing list archives

Site index · List index
Message view « Date » · « Thread »
Top « Date » · « Thread »
From Apache Hudson Server <hud...@hudson.zones.apache.org>
Subject Build failed in Hudson: HBase-Patch #182
Date Thu, 19 Jun 2008 04:05:03 GMT
See http://hudson.zones.apache.org/hudson/job/HBase-Patch/182/changes

Changes:

[stack] Forgot to accredit HBASE-683 to Rong-En

[stack] HBASE-683 can not get svn revision # at build time if locale is not english

[stack] HBASE-465 Fix javadoc for all public declarations; some work toward this goal

------------------------------------------
[...truncated 3033 lines...]
    [junit]   Waited count: 13
    [junit]   Waiting on java.lang.ref.ReferenceQueue$Lock@1743ff4
    [junit]   Stack:
    [junit]     java.lang.Object.wait(Native Method)
    [junit]     java.lang.ref.ReferenceQueue.remove(ReferenceQueue.java:116)
    [junit]     java.lang.ref.ReferenceQueue.remove(ReferenceQueue.java:132)
    [junit]     java.lang.ref.Finalizer$FinalizerThread.run(Finalizer.java:159)
    [junit] Thread 2 (Reference Handler):
    [junit]   State: WAITING
    [junit]   Blocked count: 2
    [junit]   Waited count: 15
    [junit]   Waiting on java.lang.ref.Reference$Lock@14c0275
    [junit]   Stack:
    [junit]     java.lang.Object.wait(Native Method)
    [junit]     java.lang.Object.wait(Object.java:485)
    [junit]     java.lang.ref.Reference$ReferenceHandler.run(Reference.java:116)
    [junit] Thread 1 (main):
    [junit]   State: RUNNABLE
    [junit]   Blocked count: 3
    [junit]   Waited count: 581
    [junit]   Stack:
    [junit]     sun.management.ThreadImpl.getThreadInfo0(Native Method)
    [junit]     sun.management.ThreadImpl.getThreadInfo(ThreadImpl.java:147)
    [junit]     sun.management.ThreadImpl.getThreadInfo(ThreadImpl.java:123)
    [junit]     org.apache.hadoop.util.ReflectionUtils.printThreadInfo(ReflectionUtils.java:114)
    [junit]     org.apache.hadoop.hbase.LocalHBaseCluster.threadDumpingJoin(LocalHBaseCluster.java:296)
    [junit]     org.apache.hadoop.hbase.LocalHBaseCluster.shutdown(LocalHBaseCluster.java:276)
    [junit]     org.apache.hadoop.hbase.MiniHBaseCluster.shutdown(MiniHBaseCluster.java:141)
    [junit]     org.apache.hadoop.hbase.HBaseClusterTestCase.setUp(HBaseClusterTestCase.java:135)
    [junit]     junit.framework.TestCase.runBare(TestCase.java:125)
    [junit]     junit.framework.TestResult$1.protect(TestResult.java:106)
    [junit]     junit.framework.TestResult.runProtected(TestResult.java:124)
    [junit]     junit.framework.TestResult.run(TestResult.java:109)
    [junit]     junit.framework.TestCase.run(TestCase.java:118)
    [junit]     junit.framework.TestSuite.runTest(TestSuite.java:208)
    [junit]     junit.framework.TestSuite.run(TestSuite.java:203)
    [junit]     org.apache.tools.ant.taskdefs.optional.junit.JUnitTestRunner.run(JUnitTestRunner.java:421)
    [junit]     org.apache.tools.ant.taskdefs.optional.junit.JUnitTestRunner.launch(JUnitTestRunner.java:912)
    [junit]     org.apache.tools.ant.taskdefs.optional.junit.JUnitTestRunner.main(JUnitTestRunner.java:766)
    [junit] 2008-06-19 04:03:53,153 WARN  [org.apache.hadoop.dfs.DataBlockScanner@b890dc]
dfs.DataBlockScanner(410): First Verification failed for blk_2812665077780489716. Exception
: java.io.IOException: Block blk_2812665077780489716 is not valid.
    [junit] 	at org.apache.hadoop.dfs.FSDataset.getLength(FSDataset.java:601)
    [junit] 	at org.apache.hadoop.dfs.DataNode$BlockSender.<init>(DataNode.java:1601)
    [junit] 	at org.apache.hadoop.dfs.DataBlockScanner.verifyBlock(DataBlockScanner.java:379)
    [junit] 	at org.apache.hadoop.dfs.DataBlockScanner.verifyFirstBlock(DataBlockScanner.java:445)
    [junit] 	at org.apache.hadoop.dfs.DataBlockScanner.run(DataBlockScanner.java:548)
    [junit] 	at java.lang.Thread.run(Thread.java:619)
    [junit] 
    [junit] 2008-06-19 04:03:53,153 WARN  [org.apache.hadoop.dfs.DataBlockScanner@b890dc]
dfs.DataBlockScanner(410): Second Verification failed for blk_2812665077780489716. Exception
: java.io.IOException: Block blk_2812665077780489716 is not valid.
    [junit] 	at org.apache.hadoop.dfs.FSDataset.getLength(FSDataset.java:601)
    [junit] 	at org.apache.hadoop.dfs.DataNode$BlockSender.<init>(DataNode.java:1601)
    [junit] 	at org.apache.hadoop.dfs.DataBlockScanner.verifyBlock(DataBlockScanner.java:379)
    [junit] 	at org.apache.hadoop.dfs.DataBlockScanner.verifyFirstBlock(DataBlockScanner.java:445)
    [junit] 	at org.apache.hadoop.dfs.DataBlockScanner.run(DataBlockScanner.java:548)
    [junit] 	at java.lang.Thread.run(Thread.java:619)
    [junit] 
    [junit] 2008-06-19 04:04:00,613 WARN  [DataNode: [/zonestorage/hudson/home/hudson/hudson/jobs/HBase-Patch/workspace/trunk/build/test/data/dfs/data/data1,/zonestorage/hudson/home/hudson/hudson/jobs/HBase-Patch/workspace/trunk/build/test/data/dfs/data/data2]]
dfs.FSDataset(908): Unexpected error trying to delete block blk_2812665077780489716 at file
/zonestorage/hudson/home/hudson/hudson/jobs/HBase-Patch/workspace/trunk/build/test/data/dfs/data/data2/current/blk_2812665077780489716
    [junit] 2008-06-19 04:04:00,614 WARN  [DataNode: [/zonestorage/hudson/home/hudson/hudson/jobs/HBase-Patch/workspace/trunk/build/test/data/dfs/data/data1,/zonestorage/hudson/home/hudson/hudson/jobs/HBase-Patch/workspace/trunk/build/test/data/dfs/data/data2]]
dfs.DataNode(715): java.io.IOException: Error in deleting blocks.
    [junit] 	at org.apache.hadoop.dfs.FSDataset.invalidate(FSDataset.java:924)
    [junit] 	at org.apache.hadoop.dfs.DataNode.processCommand(DataNode.java:747)
    [junit] 	at org.apache.hadoop.dfs.DataNode.offerService(DataNode.java:626)
    [junit] 	at org.apache.hadoop.dfs.DataNode.run(DataNode.java:2667)
    [junit] 	at java.lang.Thread.run(Thread.java:619)
    [junit] 
    [junit] 2008-06-19 04:04:10,264 WARN  [DataNode: [/zonestorage/hudson/home/hudson/hudson/jobs/HBase-Patch/workspace/trunk/build/test/data/dfs/data/data3,/zonestorage/hudson/home/hudson/hudson/jobs/HBase-Patch/workspace/trunk/build/test/data/dfs/data/data4]]
dfs.DataNode(715): java.io.IOException: Expecting a line not the end of stream
    [junit] 	at org.apache.hadoop.fs.DF.parseExecResult(DF.java:109)
    [junit] 	at org.apache.hadoop.util.Shell.runCommand(Shell.java:179)
    [junit] 	at org.apache.hadoop.util.Shell.run(Shell.java:134)
    [junit] 	at org.apache.hadoop.fs.DF.getCapacity(DF.java:63)
    [junit] 	at org.apache.hadoop.dfs.FSDataset$FSVolume.getCapacity(FSDataset.java:305)
    [junit] 	at org.apache.hadoop.dfs.FSDataset$FSVolumeSet.getCapacity(FSDataset.java:460)
    [junit] 	at org.apache.hadoop.dfs.FSDataset.getCapacity(FSDataset.java:585)
    [junit] 	at org.apache.hadoop.dfs.DataNode.offerService(DataNode.java:617)
    [junit] 	at org.apache.hadoop.dfs.DataNode.run(DataNode.java:2667)
    [junit] 	at java.lang.Thread.run(Thread.java:619)
    [junit] 
    [junit] 2008-06-19 04:04:10,314 WARN  [DataNode: [/zonestorage/hudson/home/hudson/hudson/jobs/HBase-Patch/workspace/trunk/build/test/data/dfs/data/data3,/zonestorage/hudson/home/hudson/hudson/jobs/HBase-Patch/workspace/trunk/build/test/data/dfs/data/data4]]
dfs.DataNode(715): java.io.IOException: Expecting a line not the end of stream
    [junit] 	at org.apache.hadoop.fs.DF.parseExecResult(DF.java:109)
    [junit] 	at org.apache.hadoop.util.Shell.runCommand(Shell.java:179)
    [junit] 	at org.apache.hadoop.util.Shell.run(Shell.java:134)
    [junit] 	at org.apache.hadoop.fs.DF.getCapacity(DF.java:63)
    [junit] 	at org.apache.hadoop.dfs.FSDataset$FSVolume.getCapacity(FSDataset.java:305)
    [junit] 	at org.apache.hadoop.dfs.FSDataset$FSVolumeSet.getCapacity(FSDataset.java:460)
    [junit] 	at org.apache.hadoop.dfs.FSDataset.getCapacity(FSDataset.java:585)
    [junit] 	at org.apache.hadoop.dfs.DataNode.offerService(DataNode.java:617)
    [junit] 	at org.apache.hadoop.dfs.DataNode.run(DataNode.java:2667)
    [junit] 	at java.lang.Thread.run(Thread.java:619)
    [junit] 
    [junit] Running org.apache.hadoop.hbase.TestBloomFilters
    [junit] Tests run: 1, Failures: 0, Errors: 1, Time elapsed: 0 sec
    [junit] Test org.apache.hadoop.hbase.TestBloomFilters FAILED (crashed)
    [junit] Running org.apache.hadoop.hbase.TestClassMigration
    [junit] Tests run: 1, Failures: 0, Errors: 1, Time elapsed: 0 sec
    [junit] Test org.apache.hadoop.hbase.TestClassMigration FAILED
    [junit] Running org.apache.hadoop.hbase.TestCompare
    [junit] Tests run: 1, Failures: 0, Errors: 1, Time elapsed: 0 sec
    [junit] Test org.apache.hadoop.hbase.TestCompare FAILED
    [junit] Running org.apache.hadoop.hbase.TestEmptyMetaInfo
    [junit] Tests run: 1, Failures: 0, Errors: 1, Time elapsed: 0 sec
    [junit] Test org.apache.hadoop.hbase.TestEmptyMetaInfo FAILED
    [junit] Running org.apache.hadoop.hbase.TestGlobalMemcacheLimit
    [junit] Tests run: 1, Failures: 0, Errors: 1, Time elapsed: 0 sec
    [junit] Test org.apache.hadoop.hbase.TestGlobalMemcacheLimit FAILED
    [junit] Running org.apache.hadoop.hbase.TestHBaseCluster
    [junit] Tests run: 1, Failures: 0, Errors: 1, Time elapsed: 0 sec
    [junit] Test org.apache.hadoop.hbase.TestHBaseCluster FAILED
    [junit] Running org.apache.hadoop.hbase.TestInfoServers
    [junit] Tests run: 1, Failures: 0, Errors: 1, Time elapsed: 0 sec
    [junit] Test org.apache.hadoop.hbase.TestInfoServers FAILED
    [junit] Running org.apache.hadoop.hbase.TestMasterAdmin
    [junit] Tests run: 1, Failures: 0, Errors: 1, Time elapsed: 0 sec
    [junit] Test org.apache.hadoop.hbase.TestMasterAdmin FAILED
    [junit] Running org.apache.hadoop.hbase.TestMergeMeta
    [junit] Tests run: 1, Failures: 0, Errors: 1, Time elapsed: 0 sec
    [junit] Test org.apache.hadoop.hbase.TestMergeMeta FAILED
    [junit] Running org.apache.hadoop.hbase.TestMergeTable
    [junit] Tests run: 1, Failures: 0, Errors: 1, Time elapsed: 0 sec
    [junit] Test org.apache.hadoop.hbase.TestMergeTable FAILED
    [junit] Running org.apache.hadoop.hbase.TestRegionRebalancing
    [junit] Tests run: 1, Failures: 0, Errors: 1, Time elapsed: 0 sec
    [junit] Test org.apache.hadoop.hbase.TestRegionRebalancing FAILED
    [junit] Running org.apache.hadoop.hbase.TestScannerAPI
    [junit] Tests run: 1, Failures: 0, Errors: 1, Time elapsed: 0 sec
    [junit] Test org.apache.hadoop.hbase.TestScannerAPI FAILED
    [junit] Running org.apache.hadoop.hbase.TestSerialization
    [junit] Tests run: 1, Failures: 0, Errors: 1, Time elapsed: 0 sec
    [junit] Test org.apache.hadoop.hbase.TestSerialization FAILED
    [junit] Running org.apache.hadoop.hbase.TestTable
    [junit] Tests run: 1, Failures: 0, Errors: 1, Time elapsed: 0 sec
    [junit] Test org.apache.hadoop.hbase.TestTable FAILED
    [junit] Running org.apache.hadoop.hbase.TestToString
    [junit] Tests run: 1, Failures: 0, Errors: 1, Time elapsed: 0 sec
    [junit] Test org.apache.hadoop.hbase.TestToString FAILED
    [junit] Running org.apache.hadoop.hbase.client.TestBatchUpdate
    [junit] Tests run: 1, Failures: 0, Errors: 1, Time elapsed: 0 sec
    [junit] Test org.apache.hadoop.hbase.client.TestBatchUpdate FAILED
    [junit] Running org.apache.hadoop.hbase.client.TestHTable
    [junit] Tests run: 1, Failures: 0, Errors: 1, Time elapsed: 0 sec
    [junit] Test org.apache.hadoop.hbase.client.TestHTable FAILED
    [junit] Running org.apache.hadoop.hbase.client.TestListTables
    [junit] Tests run: 1, Failures: 0, Errors: 1, Time elapsed: 0 sec
    [junit] Test org.apache.hadoop.hbase.client.TestListTables FAILED
    [junit] Running org.apache.hadoop.hbase.client.TestTimestamp
    [junit] Tests run: 1, Failures: 0, Errors: 1, Time elapsed: 0 sec
    [junit] Test org.apache.hadoop.hbase.client.TestTimestamp FAILED
    [junit] Running org.apache.hadoop.hbase.filter.TestInclusiveStopRowFilter
    [junit] Tests run: 1, Failures: 0, Errors: 1, Time elapsed: 0 sec
    [junit] Test org.apache.hadoop.hbase.filter.TestInclusiveStopRowFilter FAILED
    [junit] Running org.apache.hadoop.hbase.filter.TestPageRowFilter
    [junit] Tests run: 1, Failures: 0, Errors: 1, Time elapsed: 0 sec
    [junit] Test org.apache.hadoop.hbase.filter.TestPageRowFilter FAILED
    [junit] Running org.apache.hadoop.hbase.filter.TestRegExpRowFilter
    [junit] Tests run: 1, Failures: 0, Errors: 1, Time elapsed: 0 sec
    [junit] Test org.apache.hadoop.hbase.filter.TestRegExpRowFilter FAILED
    [junit] Running org.apache.hadoop.hbase.filter.TestRowFilterAfterWrite
    [junit] Tests run: 1, Failures: 0, Errors: 1, Time elapsed: 0 sec
    [junit] Test org.apache.hadoop.hbase.filter.TestRowFilterAfterWrite FAILED
    [junit] Running org.apache.hadoop.hbase.filter.TestRowFilterOnMultipleFamilies
    [junit] Tests run: 1, Failures: 0, Errors: 1, Time elapsed: 0 sec
    [junit] Test org.apache.hadoop.hbase.filter.TestRowFilterOnMultipleFamilies FAILED
    [junit] Running org.apache.hadoop.hbase.filter.TestRowFilterSet
    [junit] Tests run: 1, Failures: 0, Errors: 1, Time elapsed: 0 sec
    [junit] Test org.apache.hadoop.hbase.filter.TestRowFilterSet FAILED
    [junit] Running org.apache.hadoop.hbase.filter.TestStopRowFilter
    [junit] Tests run: 1, Failures: 0, Errors: 1, Time elapsed: 0 sec
    [junit] Test org.apache.hadoop.hbase.filter.TestStopRowFilter FAILED
    [junit] Running org.apache.hadoop.hbase.filter.TestWhileMatchRowFilter
    [junit] Tests run: 1, Failures: 0, Errors: 1, Time elapsed: 0 sec
    [junit] Test org.apache.hadoop.hbase.filter.TestWhileMatchRowFilter FAILED
    [junit] Running org.apache.hadoop.hbase.io.TestHbaseObjectWritable
    [junit] Tests run: 1, Failures: 0, Errors: 1, Time elapsed: 0 sec
    [junit] Test org.apache.hadoop.hbase.io.TestHbaseObjectWritable FAILED
    [junit] Running org.apache.hadoop.hbase.mapred.TestTableIndex
    [junit] Tests run: 1, Failures: 0, Errors: 1, Time elapsed: 0 sec
    [junit] Test org.apache.hadoop.hbase.mapred.TestTableIndex FAILED
    [junit] Running org.apache.hadoop.hbase.mapred.TestTableMapReduce
    [junit] Tests run: 1, Failures: 0, Errors: 1, Time elapsed: 0 sec
    [junit] Test org.apache.hadoop.hbase.mapred.TestTableMapReduce FAILED
    [junit] Running org.apache.hadoop.hbase.regionserver.TestCompaction
    [junit] Tests run: 1, Failures: 0, Errors: 1, Time elapsed: 0 sec
    [junit] Test org.apache.hadoop.hbase.regionserver.TestCompaction FAILED
    [junit] Running org.apache.hadoop.hbase.regionserver.TestDeleteAll
    [junit] Tests run: 1, Failures: 0, Errors: 1, Time elapsed: 0 sec
    [junit] Test org.apache.hadoop.hbase.regionserver.TestDeleteAll FAILED
    [junit] Running org.apache.hadoop.hbase.regionserver.TestDeleteFamily
    [junit] Tests run: 1, Failures: 0, Errors: 1, Time elapsed: 0 sec
    [junit] Test org.apache.hadoop.hbase.regionserver.TestDeleteFamily FAILED
    [junit] Running org.apache.hadoop.hbase.regionserver.TestGet
    [junit] Tests run: 1, Failures: 0, Errors: 1, Time elapsed: 0 sec
    [junit] Test org.apache.hadoop.hbase.regionserver.TestGet FAILED
    [junit] Running org.apache.hadoop.hbase.regionserver.TestGet2
    [junit] Tests run: 1, Failures: 0, Errors: 1, Time elapsed: 0 sec
    [junit] Test org.apache.hadoop.hbase.regionserver.TestGet2 FAILED
    [junit] Running org.apache.hadoop.hbase.regionserver.TestHLog
    [junit] Tests run: 1, Failures: 0, Errors: 1, Time elapsed: 0 sec
    [junit] Test org.apache.hadoop.hbase.regionserver.TestHLog FAILED
    [junit] Running org.apache.hadoop.hbase.regionserver.TestHMemcache
    [junit] Tests run: 1, Failures: 0, Errors: 1, Time elapsed: 0 sec
    [junit] Test org.apache.hadoop.hbase.regionserver.TestHMemcache FAILED
    [junit] Running org.apache.hadoop.hbase.regionserver.TestHRegion
    [junit] Tests run: 1, Failures: 0, Errors: 1, Time elapsed: 0 sec
    [junit] Test org.apache.hadoop.hbase.regionserver.TestHRegion FAILED
    [junit] Running org.apache.hadoop.hbase.regionserver.TestHRegionInfo
    [junit] Tests run: 1, Failures: 0, Errors: 1, Time elapsed: 0 sec
    [junit] Test org.apache.hadoop.hbase.regionserver.TestHRegionInfo FAILED
    [junit] Running org.apache.hadoop.hbase.regionserver.TestHStoreFile
    [junit] Tests run: 1, Failures: 0, Errors: 1, Time elapsed: 0 sec
    [junit] Test org.apache.hadoop.hbase.regionserver.TestHStoreFile FAILED
    [junit] Running org.apache.hadoop.hbase.regionserver.TestLogRolling
    [junit] Tests run: 1, Failures: 0, Errors: 1, Time elapsed: 0 sec
    [junit] Test org.apache.hadoop.hbase.regionserver.TestLogRolling FAILED
    [junit] Running org.apache.hadoop.hbase.regionserver.TestRegionServerExit
    [junit] Tests run: 1, Failures: 0, Errors: 1, Time elapsed: 0 sec
    [junit] Test org.apache.hadoop.hbase.regionserver.TestRegionServerExit FAILED
    [junit] Running org.apache.hadoop.hbase.regionserver.TestScanner
    [junit] Tests run: 1, Failures: 0, Errors: 1, Time elapsed: 0 sec
    [junit] Test org.apache.hadoop.hbase.regionserver.TestScanner FAILED
    [junit] Running org.apache.hadoop.hbase.regionserver.TestSplit
    [junit] Tests run: 1, Failures: 0, Errors: 1, Time elapsed: 0 sec
    [junit] Test org.apache.hadoop.hbase.regionserver.TestSplit FAILED
    [junit] Running org.apache.hadoop.hbase.regionserver.TestTimestamp
    [junit] Tests run: 1, Failures: 0, Errors: 1, Time elapsed: 0 sec
    [junit] Test org.apache.hadoop.hbase.regionserver.TestTimestamp FAILED
    [junit] Running org.apache.hadoop.hbase.util.TestBase64
    [junit] Tests run: 1, Failures: 0, Errors: 1, Time elapsed: 0 sec
    [junit] Test org.apache.hadoop.hbase.util.TestBase64 FAILED
    [junit] Running org.apache.hadoop.hbase.util.TestKeying
    [junit] Tests run: 1, Failures: 0, Errors: 1, Time elapsed: 0 sec
    [junit] Test org.apache.hadoop.hbase.util.TestKeying FAILED
    [junit] Running org.apache.hadoop.hbase.util.TestMergeTool
    [junit] Tests run: 1, Failures: 0, Errors: 1, Time elapsed: 0 sec
    [junit] Test org.apache.hadoop.hbase.util.TestMergeTool FAILED
    [junit] Running org.apache.hadoop.hbase.util.TestMetaUtils
    [junit] Tests run: 1, Failures: 0, Errors: 1, Time elapsed: 0 sec
    [junit] Test org.apache.hadoop.hbase.util.TestMetaUtils FAILED
    [junit] Running org.apache.hadoop.hbase.util.TestMigrate
    [junit] Tests run: 1, Failures: 0, Errors: 1, Time elapsed: 0 sec
    [junit] Test org.apache.hadoop.hbase.util.TestMigrate FAILED
    [junit] Running org.apache.hadoop.hbase.util.TestRootPath
    [junit] Tests run: 1, Failures: 0, Errors: 1, Time elapsed: 0 sec
    [junit] Test org.apache.hadoop.hbase.util.TestRootPath FAILED
    [junit] Running org.onelab.test.TestFilter
    [junit] Tests run: 1, Failures: 0, Errors: 1, Time elapsed: 0 sec
    [junit] Test org.onelab.test.TestFilter FAILED

BUILD FAILED
/zonestorage/hudson/home/hudson/hudson/jobs/HBase-Patch/workspace/trunk/build.xml:389: Tests
failed!

Total time: 7 minutes 4 seconds
Recording test results


Mime
View raw message