hbase-dev mailing list archives

Site index · List index
Message view « Date » · « Thread »
Top « Date » · « Thread »
From Jim Kellerman <...@powerset.com>
Subject RE: test failures on trunk
Date Fri, 02 May 2008 00:15:09 GMT
Works for me:

$ svn up
At revision 652718.
$ ant test -Dtest.output=yes -l build.log
$ tail -3 build.log
BUILD SUCCESSFUL
Total time: 33 minutes 10 seconds

$

---
Jim Kellerman, Senior Engineer; Powerset


> -----Original Message-----
> From: Andrew Purtell [mailto:apurtell@yahoo.com]
> Sent: Thursday, May 01, 2008 3:43 PM
> To: hbase-dev@hadoop.apache.org
> Subject: test failures on trunk
>
> I'm trying to test out the latest rev of the column family
> TTL patch I'm working on but am seeing failures on vanilla trunk:
>
> [hadoop@nashua hbase.orig]$ svn up
> At revision 652697.
>
> [hadoop@nashua hbase.orig]$ ant test
>   ...
>   [junit] Running org.apache.hadoop.hbase.mapred.TestTableIndex
>   [junit] Tests run: 1, Failures: 0, Errors: 1, Time elapsed:
> 110.871 sec
>   [junit] Test org.apache.hadoop.hbase.mapred.TestTableIndex FAILED
>   ...
>   [junit] Running org.apache.hadoop.hbase.regionserver.TestTimestamp
>   [junit] Tests run: 2, Failures: 0, Errors: 2, Time elapsed:
> 8.868 sec
>   [junit] Test
> org.apache.hadoop.hbase.regionserver.TestTimestamp FAILED
>   ...
>   [junit] Running org.apache.hadoop.hbase.util.TestMergeTool
>   [junit] Tests run: 1, Failures: 1, Errors: 0, Time elapsed:
> 5.279 sec
>   [junit] Test org.apache.hadoop.hbase.util.TestMergeTool FAILED
>   ...
>   [junit] Tests run: 3, Failures: 0, Errors: 0, Time elapsed:
> 0.014 sec
>   BUILD FAILED
>   /var/tmp/hbase.orig/build.xml:388: Tests failed!
>   Total time: 20 minutes 19 seconds
>
> Just wanted to let you know,
>
> Andrew Purtell
>
>
>
>
> ______________________________________________________________
> ______________________
> Be a better friend, newshound, and
> know-it-all with Yahoo! Mobile.  Try it now.
> http://mobile.yahoo.com/;_ylt=Ahu06i62sR8HDtDypao8Wcj9tAcJ
>
> No virus found in this incoming message.
> Checked by AVG.
> Version: 7.5.524 / Virus Database: 269.23.7/1409 - Release
> Date: 5/1/2008 8:39 AM
>
>

No virus found in this outgoing message.
Checked by AVG.
Version: 7.5.524 / Virus Database: 269.23.7/1409 - Release Date: 5/1/2008 8:39 AM


Mime
View raw message