hbase-builds mailing list archives

Site index · List index
Message view « Date » · « Thread »
Top « Date » · « Thread »
From Apache Jenkins Server <jenk...@builds.apache.org>
Subject Build failed in Jenkins: HBase-Trunk_matrix » JDK 1.8 (latest),Hadoop #4022
Date Thu, 09 Nov 2017 05:13:22 GMT
See <https://builds.apache.org/job/HBase-Trunk_matrix/jdk=JDK%201.8%20(latest),label=Hadoop/4022/display/redirect?page=changes>

Changes:

[tedyu] HBASE-19211 B&R: update configuration string in BackupRestoreConstants

[tedyu] HBASE-19211 B&R: update configuration string in BackupRestoreConstants

------------------------------------------
[...truncated 1.31 MB...]
[INFO] --- maven-archetype-plugin:2.4:jar (default-jar) @ hbase-shaded-client-project-archetype
---
[INFO] Building archetype jar: <https://builds.apache.org/job/HBase-Trunk_matrix/jdk=JDK%201.8%20(latest),label=Hadoop/ws/hbase-archetypes/hbase-shaded-client-project/target/build-archetype/target/generated-sources/archetype/target/hbase-shaded-client-project-archetype-3.0.0-SNAPSHOT>
[INFO] 
[INFO] --- maven-archetype-plugin:2.4:integration-test (default-integration-test) @ hbase-shaded-client-project-archetype
---
[INFO] Processing Archetype IT project: basic
[INFO] ----------------------------------------------------------------------------
[INFO] Using following parameters for creating project from Archetype: hbase-shaded-client-project-archetype:3.0.0-SNAPSHOT
[INFO] ----------------------------------------------------------------------------
[INFO] Parameter: groupId, Value: archetype.it
[INFO] Parameter: artifactId, Value: basic
[INFO] Parameter: version, Value: 0.1-SNAPSHOT
[INFO] Parameter: package, Value: it.pkg
[INFO] Parameter: packageInPathFormat, Value: it/pkg
[INFO] Parameter: version, Value: 0.1-SNAPSHOT
[INFO] Parameter: package, Value: it.pkg
[INFO] Parameter: groupId, Value: archetype.it
[INFO] Parameter: artifactId, Value: basic
[INFO] project created from Archetype in dir: <https://builds.apache.org/job/HBase-Trunk_matrix/jdk=JDK%201.8%20(latest),label=Hadoop/ws/hbase-archetypes/hbase-shaded-client-project/target/build-archetype/target/generated-sources/archetype/target/test-classes/projects/basic/project/basic>
[INFO] 
[INFO] --- maven-install-plugin:2.5.2:install (default-install) @ hbase-shaded-client-project-archetype
---
[INFO] Installing <https://builds.apache.org/job/HBase-Trunk_matrix/jdk=JDK%201.8%20(latest),label=Hadoop/ws/hbase-archetypes/hbase-shaded-client-project/target/build-archetype/target/generated-sources/archetype/target/hbase-shaded-client-project-archetype-3.0.0-SNAPSHOT.jar>
to /home/jenkins/.m2/repository/org/apache/hbase/hbase-shaded-client-project-archetype/3.0.0-SNAPSHOT/hbase-shaded-client-project-archetype-3.0.0-SNAPSHOT.jar
[INFO] Installing <https://builds.apache.org/job/HBase-Trunk_matrix/jdk=JDK%201.8%20(latest),label=Hadoop/4022/artifact/hbase-archetypes/hbase-shaded-client-project/target/build-archetype/target/generated-sources/archetype/pom.xml>
to /home/jenkins/.m2/repository/org/apache/hbase/hbase-shaded-client-project-archetype/3.0.0-SNAPSHOT/hbase-shaded-client-project-archetype-3.0.0-SNAPSHOT.pom
[INFO] 
[INFO] --- maven-archetype-plugin:2.4:update-local-catalog (default-update-local-catalog)
@ hbase-shaded-client-project-archetype ---
[INFO] ------------------------------------------------------------------------
[INFO] BUILD SUCCESS
[INFO] ------------------------------------------------------------------------
[INFO] Total time: 2.245s
[INFO] Finished at: Thu Nov 09 05:07:51 UTC 2017
[INFO] Final Memory: 21M/724M
[INFO] ------------------------------------------------------------------------
[INFO] ------------------------------------------------------------------------
[INFO] Reactor Summary:
[INFO] 
[INFO] Apache HBase ...................................... SUCCESS [4.316s]
[INFO] Apache HBase - Checkstyle ......................... SUCCESS [0.778s]
[INFO] Apache HBase - Build Support ...................... SUCCESS [0.170s]
[INFO] Apache HBase - Error Prone Rules .................. SUCCESS [0.349s]
[INFO] Apache HBase - Annotations ........................ SUCCESS [0.659s]
[INFO] Apache HBase - Build Configuration ................ SUCCESS [0.119s]
[INFO] Apache HBase - Shaded Protocol .................... SUCCESS [35.322s]
[INFO] Apache HBase - Common ............................. SUCCESS [2:46.069s]
[INFO] Apache HBase - Metrics API ........................ SUCCESS [3.299s]
[INFO] Apache HBase - Hadoop Compatibility ............... SUCCESS [16.756s]
[INFO] Apache HBase - Metrics Implementation ............. SUCCESS [10.339s]
[INFO] Apache HBase - Hadoop Two Compatibility ........... SUCCESS [20.416s]
[INFO] Apache HBase - Protocol ........................... SUCCESS [9.710s]
[INFO] Apache HBase - Client ............................. SUCCESS [2:50.904s]
[INFO] Apache HBase - Replication ........................ SUCCESS [1.524s]
[INFO] Apache HBase - Resource Bundle .................... SUCCESS [0.308s]
[INFO] Apache HBase - HTTP ............................... SUCCESS [44.449s]
[INFO] Apache HBase - Procedure .......................... SUCCESS [3:10.366s]
[INFO] Apache HBase - Server ............................. FAILURE [2:55:16.680s]
[INFO] Apache HBase - MapReduce .......................... SKIPPED
[INFO] Apache HBase - Testing Util ....................... SKIPPED
[INFO] Apache HBase - Thrift ............................. SKIPPED
[INFO] Apache HBase - RSGroup ............................ SKIPPED
[INFO] Apache HBase - Shell .............................. SKIPPED
[INFO] Apache HBase - Coprocessor Endpoint ............... SKIPPED
[INFO] Apache HBase - Backup ............................. SKIPPED
[INFO] Apache HBase - Integration Tests .................. SKIPPED
[INFO] Apache HBase - Examples ........................... SKIPPED
[INFO] Apache HBase - Rest ............................... SKIPPED
[INFO] Apache HBase - External Block Cache ............... SKIPPED
[INFO] Apache HBase - Spark .............................. SKIPPED
[INFO] Apache HBase - Spark Integration Tests ............ SKIPPED
[INFO] Apache HBase - Assembly ........................... SKIPPED
[INFO] Apache HBase - Shaded ............................. SUCCESS [0.551s]
[INFO] Apache HBase - Shaded - Client .................... SUCCESS [1.516s]
[INFO] Apache HBase - Shaded - MapReduce ................. SKIPPED
[INFO] Apache HBase Shaded Packaging Invariants .......... SKIPPED
[INFO] Apache HBase - Archetypes ......................... SUCCESS [0.120s]
[INFO] Apache HBase - Exemplar for hbase-client archetype  SKIPPED
[INFO] Apache HBase - Exemplar for hbase-shaded-client archetype  SKIPPED
[INFO] Apache HBase - Archetype builder .................. SUCCESS [24.309s]
[INFO] ------------------------------------------------------------------------
[INFO] BUILD FAILURE
[INFO] ------------------------------------------------------------------------
[INFO] Total time: 3:07:01.526s
[INFO] Finished at: Thu Nov 09 05:07:52 UTC 2017
[INFO] Final Memory: 99M/4558M
[INFO] ------------------------------------------------------------------------
[ERROR] Failed to execute goal org.apache.maven.plugins:maven-surefire-plugin:2.20.1:test
(secondPartTestsExecution) on project hbase-server: There are test failures.
[ERROR] 
[ERROR] Please refer to <https://builds.apache.org/job/HBase-Trunk_matrix/jdk=JDK%201.8%20(latest),label=Hadoop/ws/hbase-server/target/surefire-reports>
for the individual test results.
[ERROR] Please refer to dump files (if any exist) [date]-jvmRun[N].dump, [date].dumpstream
and [date]-jvmRun[N].dumpstream.
[ERROR] ExecutionException The forked VM terminated without properly saying goodbye. VM crash
or System.exit called?
[ERROR] Command was /bin/sh -c cd <https://builds.apache.org/job/HBase-Trunk_matrix/jdk=JDK%201.8%20(latest),label=Hadoop/ws/hbase-server>
&& /usr/local/asfpackages/java/jdk1.8.0_152/jre/bin/java -enableassertions -Dhbase.build.id=4022
-Xmx2800m -Djava.security.egd=file:/dev/./urandom -Djava.net.preferIPv4Stack=true -Djava.awt.headless=true
-jar <https://builds.apache.org/job/HBase-Trunk_matrix/jdk=JDK%201.8%20(latest),label=Hadoop/ws/hbase-server/target/surefire/surefirebooter6930789923754200286.jar>
<https://builds.apache.org/job/HBase-Trunk_matrix/jdk=JDK%201.8%20(latest),label=Hadoop/ws/hbase-server/target/surefire>
2017-11-09T02-00-57_703-jvmRun2 surefire7115774334413936850tmp surefire_11778906467416824404627tmp
[ERROR] Error occurred in starting fork, check output in log
[ERROR] Process Exit Code: 1
[ERROR] Crashed tests:
[ERROR] org.apache.hadoop.hbase.client.TestAdmin1
[ERROR] ExecutionException The forked VM terminated without properly saying goodbye. VM crash
or System.exit called?
[ERROR] Command was /bin/sh -c cd <https://builds.apache.org/job/HBase-Trunk_matrix/jdk=JDK%201.8%20(latest),label=Hadoop/ws/hbase-server>
&& /usr/local/asfpackages/java/jdk1.8.0_152/jre/bin/java -enableassertions -Dhbase.build.id=4022
-Xmx2800m -Djava.security.egd=file:/dev/./urandom -Djava.net.preferIPv4Stack=true -Djava.awt.headless=true
-jar <https://builds.apache.org/job/HBase-Trunk_matrix/jdk=JDK%201.8%20(latest),label=Hadoop/ws/hbase-server/target/surefire/surefirebooter1851737892134918774.jar>
<https://builds.apache.org/job/HBase-Trunk_matrix/jdk=JDK%201.8%20(latest),label=Hadoop/ws/hbase-server/target/surefire>
2017-11-09T02-00-57_703-jvmRun4 surefire2292873737285898002tmp surefire_11801829878078479848117tmp
[ERROR] Error occurred in starting fork, check output in log
[ERROR] Process Exit Code: 1
[ERROR] Crashed tests:
[ERROR] org.apache.hadoop.hbase.client.TestCloneSnapshotFromClientWithRegionReplicas
[ERROR] ExecutionException The forked VM terminated without properly saying goodbye. VM crash
or System.exit called?
[ERROR] Command was /bin/sh -c cd <https://builds.apache.org/job/HBase-Trunk_matrix/jdk=JDK%201.8%20(latest),label=Hadoop/ws/hbase-server>
&& /usr/local/asfpackages/java/jdk1.8.0_152/jre/bin/java -enableassertions -Dhbase.build.id=4022
-Xmx2800m -Djava.security.egd=file:/dev/./urandom -Djava.net.preferIPv4Stack=true -Djava.awt.headless=true
-jar <https://builds.apache.org/job/HBase-Trunk_matrix/jdk=JDK%201.8%20(latest),label=Hadoop/ws/hbase-server/target/surefire/surefirebooter8119004138108706591.jar>
<https://builds.apache.org/job/HBase-Trunk_matrix/jdk=JDK%201.8%20(latest),label=Hadoop/ws/hbase-server/target/surefire>
2017-11-09T02-00-57_703-jvmRun1 surefire563637934296798020tmp surefire_1186145571856866795679tmp
[ERROR] Error occurred in starting fork, check output in log
[ERROR] Process Exit Code: 1
[ERROR] Crashed tests:
[ERROR] org.apache.hadoop.hbase.client.TestAsyncTableScanAll
[ERROR] ExecutionException The forked VM terminated without properly saying goodbye. VM crash
or System.exit called?
[ERROR] Command was /bin/sh -c cd <https://builds.apache.org/job/HBase-Trunk_matrix/jdk=JDK%201.8%20(latest),label=Hadoop/ws/hbase-server>
&& /usr/local/asfpackages/java/jdk1.8.0_152/jre/bin/java -enableassertions -Dhbase.build.id=4022
-Xmx2800m -Djava.security.egd=file:/dev/./urandom -Djava.net.preferIPv4Stack=true -Djava.awt.headless=true
-jar <https://builds.apache.org/job/HBase-Trunk_matrix/jdk=JDK%201.8%20(latest),label=Hadoop/ws/hbase-server/target/surefire/surefirebooter6780084881101846097.jar>
<https://builds.apache.org/job/HBase-Trunk_matrix/jdk=JDK%201.8%20(latest),label=Hadoop/ws/hbase-server/target/surefire>
2017-11-09T02-00-57_703-jvmRun3 surefire3315948978697718875tmp surefire_11871644463293462313740tmp
[ERROR] Error occurred in starting fork, check output in log
[ERROR] Process Exit Code: 1
[ERROR] ExecutionException The forked VM terminated without properly saying goodbye. VM crash
or System.exit called?
[ERROR] Command was /bin/sh -c cd <https://builds.apache.org/job/HBase-Trunk_matrix/jdk=JDK%201.8%20(latest),label=Hadoop/ws/hbase-server>
&& /usr/local/asfpackages/java/jdk1.8.0_152/jre/bin/java -enableassertions -Dhbase.build.id=4022
-Xmx2800m -Djava.security.egd=file:/dev/./urandom -Djava.net.preferIPv4Stack=true -Djava.awt.headless=true
-jar <https://builds.apache.org/job/HBase-Trunk_matrix/jdk=JDK%201.8%20(latest),label=Hadoop/ws/hbase-server/target/surefire/surefirebooter6450043457795676762.jar>
<https://builds.apache.org/job/HBase-Trunk_matrix/jdk=JDK%201.8%20(latest),label=Hadoop/ws/hbase-server/target/surefire>
2017-11-09T02-00-57_703-jvmRun5 surefire6181747391979996830tmp surefire_15848803645859881463918tmp
[ERROR] Error occurred in starting fork, check output in log
[ERROR] Process Exit Code: 1
[ERROR] Crashed tests:
[ERROR] org.apache.hadoop.hbase.master.TestSplitLogManager
[ERROR] ExecutionException The forked VM terminated without properly saying goodbye. VM crash
or System.exit called?
[ERROR] Command was /bin/sh -c cd <https://builds.apache.org/job/HBase-Trunk_matrix/jdk=JDK%201.8%20(latest),label=Hadoop/ws/hbase-server>
&& /usr/local/asfpackages/java/jdk1.8.0_152/jre/bin/java -enableassertions -Dhbase.build.id=4022
-Xmx2800m -Djava.security.egd=file:/dev/./urandom -Djava.net.preferIPv4Stack=true -Djava.awt.headless=true
-jar <https://builds.apache.org/job/HBase-Trunk_matrix/jdk=JDK%201.8%20(latest),label=Hadoop/ws/hbase-server/target/surefire/surefirebooter3916060467725794903.jar>
<https://builds.apache.org/job/HBase-Trunk_matrix/jdk=JDK%201.8%20(latest),label=Hadoop/ws/hbase-server/target/surefire>
2017-11-09T02-00-57_703-jvmRun4 surefire3104793553205557211tmp surefire_15917215881764007194923tmp
[ERROR] Error occurred in starting fork, check output in log
[ERROR] Process Exit Code: 1
[ERROR] Crashed tests:
[ERROR] org.apache.hadoop.hbase.master.cleaner.TestSnapshotFromMaster
[ERROR] ExecutionException The forked VM terminated without properly saying goodbye. VM crash
or System.exit called?
[ERROR] Command was /bin/sh -c cd <https://builds.apache.org/job/HBase-Trunk_matrix/jdk=JDK%201.8%20(latest),label=Hadoop/ws/hbase-server>
&& /usr/local/asfpackages/java/jdk1.8.0_152/jre/bin/java -enableassertions -Dhbase.build.id=4022
-Xmx2800m -Djava.security.egd=file:/dev/./urandom -Djava.net.preferIPv4Stack=true -Djava.awt.headless=true
-jar <https://builds.apache.org/job/HBase-Trunk_matrix/jdk=JDK%201.8%20(latest),label=Hadoop/ws/hbase-server/target/surefire/surefirebooter4260355022459049439.jar>
<https://builds.apache.org/job/HBase-Trunk_matrix/jdk=JDK%201.8%20(latest),label=Hadoop/ws/hbase-server/target/surefire>
2017-11-09T02-00-57_703-jvmRun3 surefire2772560730673014954tmp surefire_15924303741983012031740tmp
[ERROR] Error occurred in starting fork, check output in log
[ERROR] Process Exit Code: 1
[ERROR] Crashed tests:
[ERROR] org.apache.hadoop.hbase.master.balancer.TestFavoredNodeTableImport
[ERROR] ExecutionException The forked VM terminated without properly saying goodbye. VM crash
or System.exit called?
[ERROR] Command was /bin/sh -c cd <https://builds.apache.org/job/HBase-Trunk_matrix/jdk=JDK%201.8%20(latest),label=Hadoop/ws/hbase-server>
&& /usr/local/asfpackages/java/jdk1.8.0_152/jre/bin/java -enableassertions -Dhbase.build.id=4022
-Xmx2800m -Djava.security.egd=file:/dev/./urandom -Djava.net.preferIPv4Stack=true -Djava.awt.headless=true
-jar <https://builds.apache.org/job/HBase-Trunk_matrix/jdk=JDK%201.8%20(latest),label=Hadoop/ws/hbase-server/target/surefire/surefirebooter434358043541253883.jar>
<https://builds.apache.org/job/HBase-Trunk_matrix/jdk=JDK%201.8%20(latest),label=Hadoop/ws/hbase-server/target/surefire>
2017-11-09T02-00-57_703-jvmRun2 surefire4969781910004420050tmp surefire_15962611088604654310273tmp
[ERROR] Error occurred in starting fork, check output in log
[ERROR] Process Exit Code: 1
[ERROR] Crashed tests:
[ERROR] org.apache.hadoop.hbase.master.balancer.TestStochasticLoadBalancer
[ERROR] org.apache.maven.surefire.booter.SurefireBooterForkException: ExecutionException The
forked VM terminated without properly saying goodbye. VM crash or System.exit called?
[ERROR] Command was /bin/sh -c cd <https://builds.apache.org/job/HBase-Trunk_matrix/jdk=JDK%201.8%20(latest),label=Hadoop/ws/hbase-server>
&& /usr/local/asfpackages/java/jdk1.8.0_152/jre/bin/java -enableassertions -Dhbase.build.id=4022
-Xmx2800m -Djava.security.egd=file:/dev/./urandom -Djava.net.preferIPv4Stack=true -Djava.awt.headless=true
-jar <https://builds.apache.org/job/HBase-Trunk_matrix/jdk=JDK%201.8%20(latest),label=Hadoop/ws/hbase-server/target/surefire/surefirebooter6930789923754200286.jar>
<https://builds.apache.org/job/HBase-Trunk_matrix/jdk=JDK%201.8%20(latest),label=Hadoop/ws/hbase-server/target/surefire>
2017-11-09T02-00-57_703-jvmRun2 surefire7115774334413936850tmp surefire_11778906467416824404627tmp
[ERROR] Error occurred in starting fork, check output in log
[ERROR] Process Exit Code: 1
[ERROR] Crashed tests:
[ERROR] org.apache.hadoop.hbase.client.TestAdmin1
[ERROR] ExecutionException The forked VM terminated without properly saying goodbye. VM crash
or System.exit called?
[ERROR] Command was /bin/sh -c cd <https://builds.apache.org/job/HBase-Trunk_matrix/jdk=JDK%201.8%20(latest),label=Hadoop/ws/hbase-server>
&& /usr/local/asfpackages/java/jdk1.8.0_152/jre/bin/java -enableassertions -Dhbase.build.id=4022
-Xmx2800m -Djava.security.egd=file:/dev/./urandom -Djava.net.preferIPv4Stack=true -Djava.awt.headless=true
-jar <https://builds.apache.org/job/HBase-Trunk_matrix/jdk=JDK%201.8%20(latest),label=Hadoop/ws/hbase-server/target/surefire/surefirebooter1851737892134918774.jar>
<https://builds.apache.org/job/HBase-Trunk_matrix/jdk=JDK%201.8%20(latest),label=Hadoop/ws/hbase-server/target/surefire>
2017-11-09T02-00-57_703-jvmRun4 surefire2292873737285898002tmp surefire_11801829878078479848117tmp
[ERROR] Error occurred in starting fork, check output in log
[ERROR] Process Exit Code: 1
[ERROR] Crashed tests:
[ERROR] org.apache.hadoop.hbase.client.TestCloneSnapshotFromClientWithRegionReplicas
[ERROR] ExecutionException The forked VM terminated without properly saying goodbye. VM crash
or System.exit called?
[ERROR] Command was /bin/sh -c cd <https://builds.apache.org/job/HBase-Trunk_matrix/jdk=JDK%201.8%20(latest),label=Hadoop/ws/hbase-server>
&& /usr/local/asfpackages/java/jdk1.8.0_152/jre/bin/java -enableassertions -Dhbase.build.id=4022
-Xmx2800m -Djava.security.egd=file:/dev/./urandom -Djava.net.preferIPv4Stack=true -Djava.awt.headless=true
-jar <https://builds.apache.org/job/HBase-Trunk_matrix/jdk=JDK%201.8%20(latest),label=Hadoop/ws/hbase-server/target/surefire/surefirebooter8119004138108706591.jar>
<https://builds.apache.org/job/HBase-Trunk_matrix/jdk=JDK%201.8%20(latest),label=Hadoop/ws/hbase-server/target/surefire>
2017-11-09T02-00-57_703-jvmRun1 surefire563637934296798020tmp surefire_1186145571856866795679tmp
[ERROR] Error occurred in starting fork, check output in log
[ERROR] Process Exit Code: 1
[ERROR] Crashed tests:
[ERROR] org.apache.hadoop.hbase.client.TestAsyncTableScanAll
[ERROR] ExecutionException The forked VM terminated without properly saying goodbye. VM crash
or System.exit called?
[ERROR] Command was /bin/sh -c cd <https://builds.apache.org/job/HBase-Trunk_matrix/jdk=JDK%201.8%20(latest),label=Hadoop/ws/hbase-server>
&& /usr/local/asfpackages/java/jdk1.8.0_152/jre/bin/java -enableassertions -Dhbase.build.id=4022
-Xmx2800m -Djava.security.egd=file:/dev/./urandom -Djava.net.preferIPv4Stack=true -Djava.awt.headless=true
-jar <https://builds.apache.org/job/HBase-Trunk_matrix/jdk=JDK%201.8%20(latest),label=Hadoop/ws/hbase-server/target/surefire/surefirebooter6780084881101846097.jar>
<https://builds.apache.org/job/HBase-Trunk_matrix/jdk=JDK%201.8%20(latest),label=Hadoop/ws/hbase-server/target/surefire>
2017-11-09T02-00-57_703-jvmRun3 surefire3315948978697718875tmp surefire_11871644463293462313740tmp
[ERROR] Error occurred in starting fork, check output in log
[ERROR] Process Exit Code: 1
[ERROR] ExecutionException The forked VM terminated without properly saying goodbye. VM crash
or System.exit called?
[ERROR] Command was /bin/sh -c cd <https://builds.apache.org/job/HBase-Trunk_matrix/jdk=JDK%201.8%20(latest),label=Hadoop/ws/hbase-server>
&& /usr/local/asfpackages/java/jdk1.8.0_152/jre/bin/java -enableassertions -Dhbase.build.id=4022
-Xmx2800m -Djava.security.egd=file:/dev/./urandom -Djava.net.preferIPv4Stack=true -Djava.awt.headless=true
-jar <https://builds.apache.org/job/HBase-Trunk_matrix/jdk=JDK%201.8%20(latest),label=Hadoop/ws/hbase-server/target/surefire/surefirebooter6450043457795676762.jar>
<https://builds.apache.org/job/HBase-Trunk_matrix/jdk=JDK%201.8%20(latest),label=Hadoop/ws/hbase-server/target/surefire>
2017-11-09T02-00-57_703-jvmRun5 surefire6181747391979996830tmp surefire_15848803645859881463918tmp
[ERROR] Error occurred in starting fork, check output in log
[ERROR] Process Exit Code: 1
[ERROR] Crashed tests:
[ERROR] org.apache.hadoop.hbase.master.TestSplitLogManager
[ERROR] ExecutionException The forked VM terminated without properly saying goodbye. VM crash
or System.exit called?
[ERROR] Command was /bin/sh -c cd <https://builds.apache.org/job/HBase-Trunk_matrix/jdk=JDK%201.8%20(latest),label=Hadoop/ws/hbase-server>
&& /usr/local/asfpackages/java/jdk1.8.0_152/jre/bin/java -enableassertions -Dhbase.build.id=4022
-Xmx2800m -Djava.security.egd=file:/dev/./urandom -Djava.net.preferIPv4Stack=true -Djava.awt.headless=true
-jar <https://builds.apache.org/job/HBase-Trunk_matrix/jdk=JDK%201.8%20(latest),label=Hadoop/ws/hbase-server/target/surefire/surefirebooter3916060467725794903.jar>
<https://builds.apache.org/job/HBase-Trunk_matrix/jdk=JDK%201.8%20(latest),label=Hadoop/ws/hbase-server/target/surefire>
2017-11-09T02-00-57_703-jvmRun4 surefire3104793553205557211tmp surefire_15917215881764007194923tmp
[ERROR] Error occurred in starting fork, check output in log
[ERROR] Process Exit Code: 1
[ERROR] Crashed tests:
[ERROR] org.apache.hadoop.hbase.master.cleaner.TestSnapshotFromMaster
[ERROR] ExecutionException The forked VM terminated without properly saying goodbye. VM crash
or System.exit called?
[ERROR] Command was /bin/sh -c cd <https://builds.apache.org/job/HBase-Trunk_matrix/jdk=JDK%201.8%20(latest),label=Hadoop/ws/hbase-server>
&& /usr/local/asfpackages/java/jdk1.8.0_152/jre/bin/java -enableassertions -Dhbase.build.id=4022
-Xmx2800m -Djava.security.egd=file:/dev/./urandom -Djava.net.preferIPv4Stack=true -Djava.awt.headless=true
-jar <https://builds.apache.org/job/HBase-Trunk_matrix/jdk=JDK%201.8%20(latest),label=Hadoop/ws/hbase-server/target/surefire/surefirebooter4260355022459049439.jar>
<https://builds.apache.org/job/HBase-Trunk_matrix/jdk=JDK%201.8%20(latest),label=Hadoop/ws/hbase-server/target/surefire>
2017-11-09T02-00-57_703-jvmRun3 surefire2772560730673014954tmp surefire_15924303741983012031740tmp
[ERROR] Error occurred in starting fork, check output in log
[ERROR] Process Exit Code: 1
[ERROR] Crashed tests:
[ERROR] org.apache.hadoop.hbase.master.balancer.TestFavoredNodeTableImport
[ERROR] ExecutionException The forked VM terminated without properly saying goodbye. VM crash
or System.exit called?
[ERROR] Command was /bin/sh -c cd <https://builds.apache.org/job/HBase-Trunk_matrix/jdk=JDK%201.8%20(latest),label=Hadoop/ws/hbase-server>
&& /usr/local/asfpackages/java/jdk1.8.0_152/jre/bin/java -enableassertions -Dhbase.build.id=4022
-Xmx2800m -Djava.security.egd=file:/dev/./urandom -Djava.net.preferIPv4Stack=true -Djava.awt.headless=true
-jar <https://builds.apache.org/job/HBase-Trunk_matrix/jdk=JDK%201.8%20(latest),label=Hadoop/ws/hbase-server/target/surefire/surefirebooter434358043541253883.jar>
<https://builds.apache.org/job/HBase-Trunk_matrix/jdk=JDK%201.8%20(latest),label=Hadoop/ws/hbase-server/target/surefire>
2017-11-09T02-00-57_703-jvmRun2 surefire4969781910004420050tmp surefire_15962611088604654310273tmp
[ERROR] Error occurred in starting fork, check output in log
[ERROR] Process Exit Code: 1
[ERROR] Crashed tests:
[ERROR] org.apache.hadoop.hbase.master.balancer.TestStochasticLoadBalancer
[ERROR] at org.apache.maven.plugin.surefire.booterclient.ForkStarter.awaitResultsDone(ForkStarter.java:496)
[ERROR] at org.apache.maven.plugin.surefire.booterclient.ForkStarter.runSuitesForkPerTestSet(ForkStarter.java:443)
[ERROR] at org.apache.maven.plugin.surefire.booterclient.ForkStarter.run(ForkStarter.java:295)
[ERROR] at org.apache.maven.plugin.surefire.booterclient.ForkStarter.run(ForkStarter.java:246)
[ERROR] at org.apache.maven.plugin.surefire.AbstractSurefireMojo.executeProvider(AbstractSurefireMojo.java:1124)
[ERROR] at org.apache.maven.plugin.surefire.AbstractSurefireMojo.executeAfterPreconditionsChecked(AbstractSurefireMojo.java:954)
[ERROR] at org.apache.maven.plugin.surefire.AbstractSurefireMojo.execute(AbstractSurefireMojo.java:832)
[ERROR] at org.apache.maven.plugin.DefaultBuildPluginManager.executeMojo(DefaultBuildPluginManager.java:101)
[ERROR] at org.apache.maven.lifecycle.internal.MojoExecutor.execute(MojoExecutor.java:209)
[ERROR] at org.apache.maven.lifecycle.internal.MojoExecutor.execute(MojoExecutor.java:153)
[ERROR] at org.apache.maven.lifecycle.internal.MojoExecutor.execute(MojoExecutor.java:145)
[ERROR] at org.apache.maven.lifecycle.internal.LifecycleModuleBuilder.buildProject(LifecycleModuleBuilder.java:84)
[ERROR] at org.apache.maven.lifecycle.internal.LifecycleModuleBuilder.buildProject(LifecycleModuleBuilder.java:59)
[ERROR] at org.apache.maven.lifecycle.internal.LifecycleStarter.singleThreadedBuild(LifecycleStarter.java:183)
[ERROR] at org.apache.maven.lifecycle.internal.LifecycleStarter.execute(LifecycleStarter.java:161)
[ERROR] at org.apache.maven.DefaultMaven.doExecute(DefaultMaven.java:320)
[ERROR] at org.apache.maven.DefaultMaven.execute(DefaultMaven.java:156)
[ERROR] at org.apache.maven.cli.MavenCli.execute(MavenCli.java:537)
[ERROR] at org.apache.maven.cli.MavenCli.doMain(MavenCli.java:196)
[ERROR] at org.apache.maven.cli.MavenCli.main(MavenCli.java:141)
[ERROR] at sun.reflect.NativeMethodAccessorImpl.invoke0(Native Method)
[ERROR] at sun.reflect.NativeMethodAccessorImpl.invoke(NativeMethodAccessorImpl.java:62)
[ERROR] at sun.reflect.DelegatingMethodAccessorImpl.invoke(DelegatingMethodAccessorImpl.java:43)
[ERROR] at java.lang.reflect.Method.invoke(Method.java:498)
[ERROR] at org.codehaus.plexus.classworlds.launcher.Launcher.launchEnhanced(Launcher.java:290)
[ERROR] at org.codehaus.plexus.classworlds.launcher.Launcher.launch(Launcher.java:230)
[ERROR] at org.codehaus.plexus.classworlds.launcher.Launcher.mainWithExitCode(Launcher.java:409)
[ERROR] at org.codehaus.plexus.classworlds.launcher.Launcher.main(Launcher.java:352)
[ERROR] Caused by: org.apache.maven.surefire.booter.SurefireBooterForkException: The forked
VM terminated without properly saying goodbye. VM crash or System.exit called?
[ERROR] Command was /bin/sh -c cd <https://builds.apache.org/job/HBase-Trunk_matrix/jdk=JDK%201.8%20(latest),label=Hadoop/ws/hbase-server>
&& /usr/local/asfpackages/java/jdk1.8.0_152/jre/bin/java -enableassertions -Dhbase.build.id=4022
-Xmx2800m -Djava.security.egd=file:/dev/./urandom -Djava.net.preferIPv4Stack=true -Djava.awt.headless=true
-jar <https://builds.apache.org/job/HBase-Trunk_matrix/jdk=JDK%201.8%20(latest),label=Hadoop/ws/hbase-server/target/surefire/surefirebooter434358043541253883.jar>
<https://builds.apache.org/job/HBase-Trunk_matrix/jdk=JDK%201.8%20(latest),label=Hadoop/ws/hbase-server/target/surefire>
2017-11-09T02-00-57_703-jvmRun2 surefire4969781910004420050tmp surefire_15962611088604654310273tmp
[ERROR] Error occurred in starting fork, check output in log
[ERROR] Process Exit Code: 1
[ERROR] Crashed tests:
[ERROR] org.apache.hadoop.hbase.master.balancer.TestStochasticLoadBalancer
[ERROR] at org.apache.maven.plugin.surefire.booterclient.ForkStarter.fork(ForkStarter.java:686)
[ERROR] at org.apache.maven.plugin.surefire.booterclient.ForkStarter.fork(ForkStarter.java:535)
[ERROR] at org.apache.maven.plugin.surefire.booterclient.ForkStarter.access$700(ForkStarter.java:116)
[ERROR] at org.apache.maven.plugin.surefire.booterclient.ForkStarter$2.call(ForkStarter.java:431)
[ERROR] at org.apache.maven.plugin.surefire.booterclient.ForkStarter$2.call(ForkStarter.java:408)
[ERROR] at java.util.concurrent.FutureTask.run(FutureTask.java:266)
[ERROR] at java.util.concurrent.ThreadPoolExecutor.runWorker(ThreadPoolExecutor.java:1149)
[ERROR] at java.util.concurrent.ThreadPoolExecutor$Worker.run(ThreadPoolExecutor.java:624)
[ERROR] at java.lang.Thread.run(Thread.java:748)
[ERROR] -> [Help 1]
[ERROR] 
[ERROR] To see the full stack trace of the errors, re-run Maven with the -e switch.
[ERROR] Re-run Maven using the -X switch to enable full debug logging.
[ERROR] 
[ERROR] For more information about the errors and possible solutions, please read the following
articles:
[ERROR] [Help 1] http://cwiki.apache.org/confluence/display/MAVEN/MojoExecutionException
[ERROR] 
[ERROR] After correcting the problems, you can resume the build with the command
[ERROR]   mvn <goals> -rf :hbase-server
Build step 'Invoke top-level Maven targets' marked build as failure
Performing Post build task...
Match found for :.* : True
Logical operation result is TRUE
Running script  : # Run zombie detector script
./dev-support/zombie-detector.sh --jenkins ${BUILD_ID}
[a3159d73] $ /bin/bash -xe /tmp/jenkins3847709167031326841.sh
+ ./dev-support/zombie-detector.sh --jenkins 4022
Thu Nov  9 05:07:54 UTC 2017 We're ok: there is no zombie test


    {color:green}+1 zombies{color}. No zombie tests found running at the end of the build.
POST BUILD TASK : SUCCESS
END OF POST BUILD TASK : 0
Archiving artifacts
Recording test results
[FINDBUGS] Skipping publisher since build result is FAILURE
[CHECKSTYLE] Skipping publisher since build result is FAILURE

Mime
View raw message