hbase-builds mailing list archives

Site index · List index
Message view « Date » · « Thread »
Top « Date » · « Thread »
From Apache Jenkins Server <jenk...@builds.apache.org>
Subject Build failed in Jenkins: HBase-1.5 » JDK_1_7,Hadoop&&!H13 #130
Date Thu, 02 Nov 2017 21:48:27 GMT
See <https://builds.apache.org/job/HBase-1.5/jdk=JDK_1_7,label=Hadoop&&!H13/130/display/redirect?page=changes>

Changes:

[elserj] HBASE-19156 Remove vestiges of an unused regions-per-server CLI argument

------------------------------------------
[...truncated 2.44 MB...]
[INFO] Running org.apache.hadoop.hbase.snapshot.TestSnapshotClientRetries
[INFO] Tests run: 5, Failures: 0, Errors: 0, Skipped: 0, Time elapsed: 58.865 s - in org.apache.hadoop.hbase.snapshot.TestRestoreFlushSnapshotFromClient
[INFO] Running org.apache.hadoop.hbase.snapshot.TestSnapshotDescriptionUtils
[INFO] Tests run: 2, Failures: 0, Errors: 0, Skipped: 0, Time elapsed: 0.182 s - in org.apache.hadoop.hbase.snapshot.TestSnapshotDescriptionUtils
[INFO] Running org.apache.hadoop.hbase.TestIOFencing
[INFO] Tests run: 2, Failures: 0, Errors: 0, Skipped: 0, Time elapsed: 21.313 s - in org.apache.hadoop.hbase.snapshot.TestSnapshotClientRetries
[INFO] Running org.apache.hadoop.hbase.coprocessor.TestCoprocessorMetrics
[INFO] Tests run: 10, Failures: 0, Errors: 0, Skipped: 0, Time elapsed: 169.366 s - in org.apache.hadoop.hbase.TestZooKeeper
[INFO] Running org.apache.hadoop.hbase.coprocessor.TestRegionObserverScannerOpenHook
[INFO] Tests run: 9, Failures: 0, Errors: 0, Skipped: 0, Time elapsed: 33.262 s - in org.apache.hadoop.hbase.coprocessor.TestCoprocessorMetrics
[INFO] Running org.apache.hadoop.hbase.coprocessor.TestOpenTableInCoprocessor
[INFO] Tests run: 3, Failures: 0, Errors: 0, Skipped: 0, Time elapsed: 14.167 s - in org.apache.hadoop.hbase.coprocessor.TestRegionObserverScannerOpenHook
[INFO] Tests run: 2, Failures: 0, Errors: 0, Skipped: 0, Time elapsed: 72.004 s - in org.apache.hadoop.hbase.TestIOFencing
[INFO] Running org.apache.hadoop.hbase.coprocessor.TestMasterCoprocessorExceptionWithAbort
[INFO] Tests run: 1, Failures: 0, Errors: 0, Skipped: 0, Time elapsed: 2.047 s - in org.apache.hadoop.hbase.coprocessor.TestMasterCoprocessorExceptionWithAbort
[INFO] Tests run: 2, Failures: 0, Errors: 0, Skipped: 0, Time elapsed: 18.279 s - in org.apache.hadoop.hbase.coprocessor.TestOpenTableInCoprocessor
[INFO] Running org.apache.hadoop.hbase.coprocessor.TestCoprocessorTableEndpoint
[INFO] Running org.apache.hadoop.hbase.coprocessor.TestRegionServerCoprocessorEndpoint
[INFO] Running org.apache.hadoop.hbase.coprocessor.TestIncrementTimeRange
[INFO] Tests run: 2, Failures: 0, Errors: 0, Skipped: 0, Time elapsed: 1.126 s - in org.apache.hadoop.hbase.coprocessor.TestRegionServerCoprocessorEndpoint
[INFO] Tests run: 2, Failures: 0, Errors: 0, Skipped: 0, Time elapsed: 9.441 s - in org.apache.hadoop.hbase.coprocessor.TestCoprocessorTableEndpoint
[INFO] Tests run: 1, Failures: 0, Errors: 0, Skipped: 0, Time elapsed: 6.704 s - in org.apache.hadoop.hbase.coprocessor.TestIncrementTimeRange
[INFO] Running org.apache.hadoop.hbase.coprocessor.TestRegionObserverInterface
[INFO] Running org.apache.hadoop.hbase.coprocessor.TestMasterCoprocessorExceptionWithRemove
[INFO] Tests run: 1, Failures: 0, Errors: 0, Skipped: 0, Time elapsed: 6.046 s - in org.apache.hadoop.hbase.coprocessor.TestMasterCoprocessorExceptionWithRemove
[INFO] Running org.apache.hadoop.hbase.coprocessor.TestAggregateProtocol
[INFO] Tests run: 44, Failures: 0, Errors: 0, Skipped: 0, Time elapsed: 5.185 s - in org.apache.hadoop.hbase.coprocessor.TestAggregateProtocol
[INFO] Running org.apache.hadoop.hbase.coprocessor.TestBatchCoprocessorEndpoint
[INFO] Tests run: 4, Failures: 0, Errors: 0, Skipped: 0, Time elapsed: 1.43 s - in org.apache.hadoop.hbase.coprocessor.TestBatchCoprocessorEndpoint
[INFO] Running org.apache.hadoop.hbase.coprocessor.TestRegionServerObserver
[INFO] Running org.apache.hadoop.hbase.coprocessor.TestHTableWrapper
[INFO] Tests run: 1, Failures: 0, Errors: 0, Skipped: 0, Time elapsed: 6.337 s - in org.apache.hadoop.hbase.coprocessor.TestHTableWrapper
[INFO] Tests run: 1, Failures: 0, Errors: 0, Skipped: 0, Time elapsed: 18.147 s - in org.apache.hadoop.hbase.coprocessor.TestRegionServerObserver
[INFO] Running org.apache.hadoop.hbase.coprocessor.TestNegativeMemstoreSizeWithSlowCoprocessor
[INFO] Tests run: 1, Failures: 0, Errors: 0, Skipped: 0, Time elapsed: 1.544 s - in org.apache.hadoop.hbase.coprocessor.TestNegativeMemstoreSizeWithSlowCoprocessor
[INFO] Running org.apache.hadoop.hbase.coprocessor.TestRegionServerCoprocessorExceptionWithAbort
[INFO] Running org.apache.hadoop.hbase.coprocessor.TestClassLoading
[INFO] Tests run: 2, Failures: 0, Errors: 0, Skipped: 0, Time elapsed: 21.271 s - in org.apache.hadoop.hbase.coprocessor.TestRegionServerCoprocessorExceptionWithAbort
[WARNING] Tests run: 14, Failures: 0, Errors: 0, Skipped: 2, Time elapsed: 71.085 s - in org.apache.hadoop.hbase.coprocessor.TestRegionObserverInterface
[INFO] Running org.apache.hadoop.hbase.coprocessor.TestRegionObserverForAddingMutationsFromCoprocessors
[INFO] Tests run: 9, Failures: 0, Errors: 0, Skipped: 0, Time elapsed: 28.596 s - in org.apache.hadoop.hbase.coprocessor.TestClassLoading
[INFO] Running org.apache.hadoop.hbase.coprocessor.TestDoubleColumnInterpreter
[INFO] Tests run: 38, Failures: 0, Errors: 0, Skipped: 0, Time elapsed: 4.755 s - in org.apache.hadoop.hbase.coprocessor.TestDoubleColumnInterpreter
[INFO] Tests run: 5, Failures: 0, Errors: 0, Skipped: 0, Time elapsed: 10.085 s - in org.apache.hadoop.hbase.coprocessor.TestRegionObserverForAddingMutationsFromCoprocessors
[INFO] Running org.apache.hadoop.hbase.coprocessor.TestRegionObserverBypass
[INFO] Running org.apache.hadoop.hbase.coprocessor.TestRowProcessorEndpoint
[INFO] Running org.apache.hadoop.hbase.coprocessor.TestCoprocessorStop
[INFO] Tests run: 2, Failures: 0, Errors: 0, Skipped: 0, Time elapsed: 6.917 s - in org.apache.hadoop.hbase.coprocessor.TestRegionObserverBypass
[INFO] Tests run: 1, Failures: 0, Errors: 0, Skipped: 0, Time elapsed: 1.434 s - in org.apache.hadoop.hbase.coprocessor.TestCoprocessorStop
[INFO] Running org.apache.hadoop.hbase.coprocessor.TestRegionServerCoprocessorExceptionWithRemove
[INFO] Running org.apache.hadoop.hbase.coprocessor.TestBigDecimalColumnInterpreter
[INFO] Tests run: 4, Failures: 0, Errors: 0, Skipped: 0, Time elapsed: 17.867 s - in org.apache.hadoop.hbase.coprocessor.TestRowProcessorEndpoint
[INFO] Tests run: 38, Failures: 0, Errors: 0, Skipped: 0, Time elapsed: 4.257 s - in org.apache.hadoop.hbase.coprocessor.TestBigDecimalColumnInterpreter
[INFO] Tests run: 1, Failures: 0, Errors: 0, Skipped: 0, Time elapsed: 15.473 s - in org.apache.hadoop.hbase.coprocessor.TestRegionServerCoprocessorExceptionWithRemove
[INFO] Running org.apache.hadoop.hbase.coprocessor.TestMasterObserver
[INFO] Running org.apache.hadoop.hbase.coprocessor.TestCoprocessorEndpoint
[INFO] Tests run: 6, Failures: 0, Errors: 0, Skipped: 0, Time elapsed: 1.775 s - in org.apache.hadoop.hbase.coprocessor.TestCoprocessorEndpoint
[INFO] Running org.apache.hadoop.hbase.TestGlobalMemStoreSize
[INFO] Running org.apache.hadoop.hbase.coprocessor.TestWALObserver
[INFO] Tests run: 9, Failures: 0, Errors: 0, Skipped: 0, Time elapsed: 337.081 s - in org.apache.hadoop.hbase.snapshot.TestExportSnapshot
[INFO] Tests run: 7, Failures: 0, Errors: 0, Skipped: 0, Time elapsed: 9.239 s - in org.apache.hadoop.hbase.coprocessor.TestWALObserver
[INFO] Running org.apache.hadoop.hbase.TestStochasticBalancerJmxMetrics
[WARNING] Tests run: 1, Failures: 0, Errors: 0, Skipped: 1, Time elapsed: 0.003 s - in org.apache.hadoop.hbase.TestStochasticBalancerJmxMetrics
[INFO] Tests run: 1, Failures: 0, Errors: 0, Skipped: 0, Time elapsed: 14.655 s - in org.apache.hadoop.hbase.TestGlobalMemStoreSize
[INFO] Running org.apache.hadoop.hbase.TestMetaTableLocator
[INFO] Running org.apache.hadoop.hbase.TestJMXListener
[INFO] Tests run: 3, Failures: 0, Errors: 0, Skipped: 0, Time elapsed: 1.126 s - in org.apache.hadoop.hbase.TestJMXListener
[INFO] Tests run: 9, Failures: 0, Errors: 0, Skipped: 0, Time elapsed: 336.842 s - in org.apache.hadoop.hbase.snapshot.TestSecureExportSnapshot
[INFO] Tests run: 7, Failures: 0, Errors: 0, Skipped: 0, Time elapsed: 3.829 s - in org.apache.hadoop.hbase.TestMetaTableLocator
[INFO] Running org.apache.hadoop.hbase.zookeeper.TestZKTableStateManager
[INFO] Tests run: 1, Failures: 0, Errors: 0, Skipped: 0, Time elapsed: 1.025 s - in org.apache.hadoop.hbase.zookeeper.TestZKTableStateManager
[INFO] Running org.apache.hadoop.hbase.zookeeper.TestZKMulti
[INFO] Running org.apache.hadoop.hbase.zookeeper.lock.TestZKInterProcessReadWriteLock
[INFO] Tests run: 12, Failures: 0, Errors: 0, Skipped: 0, Time elapsed: 1.602 s - in org.apache.hadoop.hbase.zookeeper.TestZKMulti
[INFO] Running org.apache.hadoop.hbase.zookeeper.TestZKLeaderManager
[INFO] Tests run: 1, Failures: 0, Errors: 0, Skipped: 0, Time elapsed: 0.139 s - in org.apache.hadoop.hbase.zookeeper.TestZKLeaderManager
[INFO] Running org.apache.hadoop.hbase.zookeeper.TestRecoverableZooKeeper
[INFO] Running org.apache.hadoop.hbase.zookeeper.TestZooKeeperNodeTracker
[INFO] Tests run: 3, Failures: 0, Errors: 0, Skipped: 0, Time elapsed: 1.003 s - in org.apache.hadoop.hbase.zookeeper.TestZooKeeperNodeTracker
[INFO] Running org.apache.hadoop.hbase.zookeeper.TestZooKeeperACL
[INFO] Tests run: 1, Failures: 0, Errors: 0, Skipped: 0, Time elapsed: 1.434 s - in org.apache.hadoop.hbase.zookeeper.TestRecoverableZooKeeper
[INFO] Tests run: 7, Failures: 0, Errors: 0, Skipped: 0, Time elapsed: 0.311 s - in org.apache.hadoop.hbase.zookeeper.TestZooKeeperACL
[INFO] Running org.apache.hadoop.hbase.zookeeper.TestHQuorumPeer
[INFO] Running org.apache.hadoop.hbase.TestClusterBootOrder
[INFO] Tests run: 4, Failures: 0, Errors: 0, Skipped: 0, Time elapsed: 1.149 s - in org.apache.hadoop.hbase.zookeeper.TestHQuorumPeer
[INFO] Tests run: 9, Failures: 0, Errors: 0, Skipped: 0, Time elapsed: 38.838 s - in org.apache.hadoop.hbase.coprocessor.TestMasterObserver
[INFO] Running org.apache.hadoop.hbase.TestPartialResultsFromClientSide
[INFO] Running org.apache.hadoop.hbase.TestServerSideScanMetricsFromClientSide
[INFO] Tests run: 2, Failures: 0, Errors: 0, Skipped: 0, Time elapsed: 2.489 s - in org.apache.hadoop.hbase.TestServerSideScanMetricsFromClientSide
[INFO] Tests run: 6, Failures: 0, Errors: 0, Skipped: 0, Time elapsed: 24.493 s - in org.apache.hadoop.hbase.zookeeper.lock.TestZKInterProcessReadWriteLock
[INFO] Tests run: 2, Failures: 0, Errors: 0, Skipped: 0, Time elapsed: 31.397 s - in org.apache.hadoop.hbase.TestClusterBootOrder
[INFO] Tests run: 19, Failures: 0, Errors: 0, Skipped: 0, Time elapsed: 81.435 s - in org.apache.hadoop.hbase.TestPartialResultsFromClientSide
[INFO] 
[INFO] Results:
[INFO] 
[ERROR] Failures: 
[ERROR]   TestHBaseFsck.testContainedRegionOverlap:1163 expected:<[OVERLAP_IN_REGION_CHAIN]>
but was:<[NOT_IN_HDFS, NOT_IN_HDFS, NOT_IN_HDFS, NOT_IN_HDFS, SHOULD_NOT_BE_DEPLOYED, OVERLAP_IN_REGION_CHAIN]>
[ERROR]   TestHBaseFsck.testCorruptLinkDirectory:2629 expected:<[]> but was:<[SHOULD_NOT_BE_DEPLOYED,
NOT_IN_HDFS, NOT_IN_HDFS, NOT_IN_HDFS, NOT_IN_HDFS]>
[ERROR]   TestHBaseFsck.testDupeRegion:1064 expected:<[]> but was:<[NOT_IN_HDFS,
SHOULD_NOT_BE_DEPLOYED, NOT_IN_HDFS, NOT_IN_HDFS, NOT_IN_HDFS]>
[ERROR]   TestHBaseFsck.testDupeStartKey:861 expected:<[]> but was:<[SHOULD_NOT_BE_DEPLOYED,
NOT_IN_HDFS, NOT_IN_HDFS, NOT_IN_HDFS, NOT_IN_HDFS]>
[ERROR]   TestHBaseFsck.testHBaseFsck:240 expected:<[]> but was:<[SHOULD_NOT_BE_DEPLOYED,
NOT_IN_HDFS, NOT_IN_HDFS, NOT_IN_HDFS, NOT_IN_HDFS]>
[ERROR]   TestHBaseFsck.testHbckFixOrphanTable:720 expected:<[NO_TABLEINFO_FILE]> but
was:<[NOT_IN_HDFS, NOT_IN_HDFS, NOT_IN_HDFS, NOT_IN_HDFS, SHOULD_NOT_BE_DEPLOYED, NO_TABLEINFO_FILE]>
[ERROR]   TestHBaseFsck.testNoHdfsTable:1678 expected:<[NOT_IN_HDFS, NOT_IN_HDFS, NOT_IN_HDFS,
NOT_IN_HDFS]> but was:<[NOT_IN_HDFS, NOT_IN_HDFS, NOT_IN_HDFS, NOT_IN_HDFS, SHOULD_NOT_BE_DEPLOYED]>
[ERROR]   TestHBaseFsck.testNotInHdfsWithReplicas:1610 expected:<[NOT_IN_HDFS]> but
was:<[NOT_IN_HDFS, NOT_IN_HDFS, NOT_IN_HDFS, NOT_IN_HDFS, NOT_IN_HDFS, SHOULD_NOT_BE_DEPLOYED]>
[ERROR] Errors: 
[ERROR]   TestHBaseFsck.testSplitAndDupeRegionWithRegionReplica:384->cleanupTable:654->deleteTable:3206
» TestTimedOut
[INFO] 
[ERROR] Tests run: 2866, Failures: 8, Errors: 1, Skipped: 61
[INFO] 
[INFO] ------------------------------------------------------------------------
[INFO] Reactor Summary:
[INFO] 
[INFO] Apache HBase ...................................... SUCCESS [1:47.361s]
[INFO] Apache HBase - Checkstyle ......................... SUCCESS [14.826s]
[INFO] Apache HBase - Resource Bundle .................... SUCCESS [0.300s]
[INFO] Apache HBase - Annotations ........................ SUCCESS [1.667s]
[INFO] Apache HBase - Protocol ........................... SUCCESS [18.565s]
[INFO] Apache HBase - Common ............................. SUCCESS [2:58.015s]
[INFO] Apache HBase - Procedure .......................... SUCCESS [3:35.637s]
[INFO] Apache HBase - Metrics API ........................ SUCCESS [1.852s]
[INFO] Apache HBase - Hadoop Compatibility ............... SUCCESS [14.261s]
[INFO] Apache HBase - Metrics Implementation ............. SUCCESS [8.363s]
[INFO] Apache HBase - Hadoop Two Compatibility ........... SUCCESS [25.169s]
[INFO] Apache HBase - Client ............................. SUCCESS [1:59.974s]
[INFO] Apache HBase - Prefix Tree ........................ SUCCESS [13.968s]
[INFO] Apache HBase - Server ............................. FAILURE [1:50:21.202s]
[INFO] Apache HBase - Testing Util ....................... SKIPPED
[INFO] Apache HBase - Thrift ............................. SKIPPED
[INFO] Apache HBase - Rest ............................... SKIPPED
[INFO] Apache HBase - RSGroup ............................ SKIPPED
[INFO] Apache HBase - Shell .............................. SKIPPED
[INFO] Apache HBase - Integration Tests .................. SKIPPED
[INFO] Apache HBase - Examples ........................... SKIPPED
[INFO] Apache HBase - External Block Cache ............... SKIPPED
[INFO] Apache HBase - Assembly ........................... SKIPPED
[INFO] Apache HBase - Shaded ............................. SKIPPED
[INFO] Apache HBase - Shaded - Client .................... SKIPPED
[INFO] Apache HBase - Shaded - Server .................... SKIPPED
[INFO] Apache HBase Shaded Packaging Invariants .......... SKIPPED
[INFO] Apache HBase - Archetypes ......................... SKIPPED
[INFO] Apache HBase - Exemplar for hbase-client archetype  SKIPPED
[INFO] Apache HBase - Exemplar for hbase-shaded-client archetype  SKIPPED
[INFO] Apache HBase - Archetype builder .................. SKIPPED
[INFO] ------------------------------------------------------------------------
[INFO] BUILD FAILURE
[INFO] ------------------------------------------------------------------------
[INFO] Total time: 2:02:53.815s
[INFO] Finished at: Thu Nov 02 21:44:20 UTC 2017
[INFO] Final Memory: 105M/1563M
[INFO] ------------------------------------------------------------------------
[ERROR] Failed to execute goal org.apache.maven.plugins:maven-surefire-plugin:2.20.1:test
(secondPartTestsExecution) on project hbase-server: There are test failures.
[ERROR] 
[ERROR] Please refer to <https://builds.apache.org/job/HBase-1.5/jdk=JDK_1_7,label=Hadoop&&!H13/ws/hbase-server/target/surefire-reports>
for the individual test results.
[ERROR] Please refer to dump files (if any exist) [date]-jvmRun[N].dump, [date].dumpstream
and [date]-jvmRun[N].dumpstream.
[ERROR] -> [Help 1]
[ERROR] 
[ERROR] To see the full stack trace of the errors, re-run Maven with the -e switch.
[ERROR] Re-run Maven using the -X switch to enable full debug logging.
[ERROR] 
[ERROR] For more information about the errors and possible solutions, please read the following
articles:
[ERROR] [Help 1] http://cwiki.apache.org/confluence/display/MAVEN/MojoFailureException
[ERROR] 
[ERROR] After correcting the problems, you can resume the build with the command
[ERROR]   mvn <goals> -rf :hbase-server
Build step 'Invoke top-level Maven targets' marked build as failure
Performing Post build task...
Match found for :.* : True
Logical operation result is TRUE
Running script  : # Post-build task script. TODO: Check this in and have all builds reference
check-in.
pwd && ls
# NOTE!!!! The below code has been copied and pasted from ./dev-tools/run-test.sh
# Do not change here without syncing there and vice-versa.
ZOMBIE_TESTS_COUNT=`jps -v | grep surefirebooter | grep -e '-Dhbase.test' | wc -l`
if [[ $ZOMBIE_TESTS_COUNT != 0 ]] ; then
 echo "Suspicious java process found - waiting 30s to see if there are just slow to stop"
 sleep 30
 ZOMBIE_TESTS_COUNT=`jps -v | grep surefirebooter | grep -e '-Dhbase.test' | wc -l`
 if [[ $ZOMBIE_TESTS_COUNT != 0 ]] ; then
   echo " {color:red}There appear to be $ZOMBIE_TESTS_COUNT zombie tests{color}, they should
have been killed by surefire but survived"
   jps -v | grep surefirebooter | grep -e '-Dhbase.test'
   jps -v | grep surefirebooter | grep -e '-Dhbase.test' | cut -d ' ' -f 1 | xargs -n 1 jstack
   # Exit with error
   exit 1
 else
   echo "We're ok: there is no zombie test, but some tests took some time to stop"
 fi
else
  echo "We're ok: there is no zombie test"
fi
Setting JDK_1_7_LATEST__HOME=/home/jenkins/tools/java/latest1.7
Setting JDK_1_8_LATEST__HOME=/home/jenkins/tools/java/latest1.8
[19ccb43d] $ /bin/bash -xe /tmp/jenkins1277444835558830749.sh
+ pwd
<https://builds.apache.org/job/HBase-1.5/jdk=JDK_1_7,label=Hadoop&&!H13/ws/>
+ ls
bin
CHANGES.txt
conf
dev-support
extra_env_var
hbase-annotations
hbase-archetypes
hbase-assembly
hbase-checkstyle
hbase-client
hbase-common
hbase-examples
hbase-external-blockcache
hbase-hadoop2-compat
hbase-hadoop-compat
hbase-it
hbase-metrics
hbase-metrics-api
hbase-native-client
hbase-prefix-tree
hbase-procedure
hbase-protocol
hbase-resource-bundle
hbase-rest
hbase-rsgroup
hbase-server
hbase-shaded
hbase-shell
hbase-testing-util
hbase-thrift
LICENSE.txt
NOTICE.txt
pom.xml
README.txt
src
target
++ jps -v
++ grep surefirebooter
++ grep -e -Dhbase.test
++ wc -l
+ ZOMBIE_TESTS_COUNT=0
+ [[ 0 != 0 ]]
+ echo 'We'\''re ok: there is no zombie test'
We're ok: there is no zombie test
POST BUILD TASK : SUCCESS
END OF POST BUILD TASK : 0
Archiving artifacts
Setting JDK_1_7_LATEST__HOME=/home/jenkins/tools/java/latest1.7
Setting JDK_1_8_LATEST__HOME=/home/jenkins/tools/java/latest1.8
Recording test results
Setting JDK_1_7_LATEST__HOME=/home/jenkins/tools/java/latest1.7
Setting JDK_1_8_LATEST__HOME=/home/jenkins/tools/java/latest1.8
Setting JDK_1_7_LATEST__HOME=/home/jenkins/tools/java/latest1.7
Setting JDK_1_8_LATEST__HOME=/home/jenkins/tools/java/latest1.8

Mime
View raw message