hbase-builds mailing list archives

Site index · List index
Message view « Date » · « Thread »
Top « Date » · « Thread »
From Apache Jenkins Server <jenk...@builds.apache.org>
Subject Build failed in Jenkins: HBase-1.5 » JDK_1_7,Hadoop&&!H13 #155
Date Tue, 14 Nov 2017 05:37:33 GMT
See <https://builds.apache.org/job/HBase-1.5/jdk=JDK_1_7,label=Hadoop&&!H13/155/display/redirect?page=changes>

Changes:

[busbey] HBASE-19249 test for "hbase antipatterns" should check _count_ of

------------------------------------------
[...truncated 1.68 MB...]
[INFO] 
[INFO] --- maven-surefire-plugin:2.20.1:test (default-test) @ hbase-client ---
[INFO] 
[INFO] -------------------------------------------------------
[INFO]  T E S T S
[INFO] -------------------------------------------------------
[INFO] Running org.apache.hadoop.hbase.zookeeper.TestInstancePending
[INFO] Tests run: 1, Failures: 0, Errors: 0, Skipped: 0, Time elapsed: 0.208 s - in org.apache.hadoop.hbase.zookeeper.TestInstancePending
[INFO] Running org.apache.hadoop.hbase.zookeeper.TestMetricsZooKeeper
[INFO] Tests run: 2, Failures: 0, Errors: 0, Skipped: 0, Time elapsed: 0.279 s - in org.apache.hadoop.hbase.zookeeper.TestMetricsZooKeeper
[INFO] Running org.apache.hadoop.hbase.zookeeper.TestZooKeeperWatcher
[INFO] Tests run: 1, Failures: 0, Errors: 0, Skipped: 0, Time elapsed: 0.922 s - in org.apache.hadoop.hbase.zookeeper.TestZooKeeperWatcher
[INFO] Running org.apache.hadoop.hbase.zookeeper.TestZKUtil
[INFO] Tests run: 4, Failures: 0, Errors: 0, Skipped: 0, Time elapsed: 1.166 s - in org.apache.hadoop.hbase.zookeeper.TestZKUtil
[INFO] Running org.apache.hadoop.hbase.client.TestClientScanner
[INFO] Tests run: 6, Failures: 0, Errors: 0, Skipped: 0, Time elapsed: 1.045 s - in org.apache.hadoop.hbase.client.TestClientScanner
[INFO] Running org.apache.hadoop.hbase.client.TestClientExponentialBackoff
[INFO] Tests run: 5, Failures: 0, Errors: 0, Skipped: 0, Time elapsed: 0.047 s - in org.apache.hadoop.hbase.client.TestClientExponentialBackoff
[INFO] Running org.apache.hadoop.hbase.client.TestReversedScannerCallable
[INFO] Tests run: 2, Failures: 0, Errors: 0, Skipped: 0, Time elapsed: 0.13 s - in org.apache.hadoop.hbase.client.TestReversedScannerCallable
[INFO] Running org.apache.hadoop.hbase.client.TestDeleteTimeStamp
[INFO] Tests run: 1, Failures: 0, Errors: 0, Skipped: 0, Time elapsed: 0.037 s - in org.apache.hadoop.hbase.client.TestDeleteTimeStamp
[INFO] Running org.apache.hadoop.hbase.client.TestIncrement
[INFO] Tests run: 1, Failures: 0, Errors: 0, Skipped: 0, Time elapsed: 0.16 s - in org.apache.hadoop.hbase.client.TestIncrement
[INFO] Running org.apache.hadoop.hbase.client.TestDelayingRunner
[INFO] Tests run: 1, Failures: 0, Errors: 0, Skipped: 0, Time elapsed: 1.027 s - in org.apache.hadoop.hbase.client.TestDelayingRunner
[INFO] Running org.apache.hadoop.hbase.client.TestPut
[INFO] Tests run: 1, Failures: 0, Errors: 0, Skipped: 0, Time elapsed: 0.163 s - in org.apache.hadoop.hbase.client.TestPut
[INFO] Running org.apache.hadoop.hbase.client.TestPutDotHas
[INFO] Tests run: 4, Failures: 0, Errors: 0, Skipped: 0, Time elapsed: 0.023 s - in org.apache.hadoop.hbase.client.TestPutDotHas
[INFO] Running org.apache.hadoop.hbase.client.TestSnapshotFromAdmin
[INFO] Tests run: 2, Failures: 0, Errors: 0, Skipped: 0, Time elapsed: 4.662 s - in org.apache.hadoop.hbase.client.TestSnapshotFromAdmin
[INFO] Running org.apache.hadoop.hbase.client.TestMetricsConnection
[INFO] Tests run: 1, Failures: 0, Errors: 0, Skipped: 0, Time elapsed: 0.996 s - in org.apache.hadoop.hbase.client.TestMetricsConnection
[INFO] Running org.apache.hadoop.hbase.client.TestCompleteResultScanResultCache
[INFO] Tests run: 5, Failures: 0, Errors: 0, Skipped: 0, Time elapsed: 0.045 s - in org.apache.hadoop.hbase.client.TestCompleteResultScanResultCache
[INFO] Running org.apache.hadoop.hbase.client.TestClientNoCluster
[WARNING] Tests run: 6, Failures: 0, Errors: 0, Skipped: 1, Time elapsed: 1.998 s - in org.apache.hadoop.hbase.client.TestClientNoCluster
[INFO] Running org.apache.hadoop.hbase.client.TestOperation
[INFO] Tests run: 3, Failures: 0, Errors: 0, Skipped: 0, Time elapsed: 0.158 s - in org.apache.hadoop.hbase.client.TestOperation
[INFO] Running org.apache.hadoop.hbase.client.TestHTableMultiplexerViaMocks
[INFO] Tests run: 2, Failures: 0, Errors: 0, Skipped: 0, Time elapsed: 0.393 s - in org.apache.hadoop.hbase.client.TestHTableMultiplexerViaMocks
[INFO] Running org.apache.hadoop.hbase.client.TestBatchScanResultCache
[INFO] Tests run: 1, Failures: 0, Errors: 0, Skipped: 0, Time elapsed: 0.038 s - in org.apache.hadoop.hbase.client.TestBatchScanResultCache
[INFO] Running org.apache.hadoop.hbase.client.TestGet
[ERROR] Tests run: 5, Failures: 0, Errors: 1, Skipped: 0, Time elapsed: 1.414 s <<<
FAILURE! - in org.apache.hadoop.hbase.client.TestGet
[ERROR] testDynamicFilter(org.apache.hadoop.hbase.client.TestGet)  Time elapsed: 0.136 s 
<<< ERROR!
java.io.FileNotFoundException: /tmp/hbase-jenkins/local/jars/MockFilter.jar (Permission denied)
	at org.apache.hadoop.hbase.client.TestGet.testDynamicFilter(TestGet.java:231)

[ERROR] Tests run: 1, Failures: 0, Errors: 1, Skipped: 0, Time elapsed: 1.488 s <<<
FAILURE! - in org.apache.hadoop.hbase.client.TestGet
[ERROR] testDynamicFilter(org.apache.hadoop.hbase.client.TestGet)  Time elapsed: 0.059 s 
<<< ERROR!
java.io.FileNotFoundException: /tmp/hbase-jenkins/local/jars/MockFilter.jar (Permission denied)
	at org.apache.hadoop.hbase.client.TestGet.testDynamicFilter(TestGet.java:231)

[ERROR] Tests run: 1, Failures: 0, Errors: 1, Skipped: 0, Time elapsed: 1.528 s <<<
FAILURE! - in org.apache.hadoop.hbase.client.TestGet
[ERROR] testDynamicFilter(org.apache.hadoop.hbase.client.TestGet)  Time elapsed: 0.028 s 
<<< ERROR!
java.io.FileNotFoundException: /tmp/hbase-jenkins/local/jars/MockFilter.jar (Permission denied)
	at org.apache.hadoop.hbase.client.TestGet.testDynamicFilter(TestGet.java:231)

[INFO] Running org.apache.hadoop.hbase.client.TestScan
[INFO] Tests run: 6, Failures: 0, Errors: 0, Skipped: 0, Time elapsed: 1.044 s - in org.apache.hadoop.hbase.client.TestScan
[INFO] Running org.apache.hadoop.hbase.client.TestProcedureFuture
[INFO] Tests run: 4, Failures: 0, Errors: 0, Skipped: 0, Time elapsed: 0.591 s - in org.apache.hadoop.hbase.client.TestProcedureFuture
[INFO] Running org.apache.hadoop.hbase.client.coprocessor.TestSecureBulkLoadClient
[INFO] Tests run: 3, Failures: 0, Errors: 0, Skipped: 0, Time elapsed: 1.566 s - in org.apache.hadoop.hbase.client.coprocessor.TestSecureBulkLoadClient
[INFO] Running org.apache.hadoop.hbase.client.TestAsyncProcess
[INFO] Tests run: 42, Failures: 0, Errors: 0, Skipped: 0, Time elapsed: 58.912 s - in org.apache.hadoop.hbase.client.TestAsyncProcess
[INFO] Running org.apache.hadoop.hbase.client.TestAllowPartialScanResultCache
[INFO] Tests run: 1, Failures: 0, Errors: 0, Skipped: 0, Time elapsed: 0.036 s - in org.apache.hadoop.hbase.client.TestAllowPartialScanResultCache
[INFO] Running org.apache.hadoop.hbase.client.TestAttributes
[INFO] Tests run: 7, Failures: 0, Errors: 0, Skipped: 0, Time elapsed: 0.156 s - in org.apache.hadoop.hbase.client.TestAttributes
[INFO] Running org.apache.hadoop.hbase.TestHTableDescriptor
[INFO] Tests run: 18, Failures: 0, Errors: 0, Skipped: 0, Time elapsed: 1.037 s - in org.apache.hadoop.hbase.TestHTableDescriptor
[INFO] Running org.apache.hadoop.hbase.TestHColumnDescriptor
[INFO] Tests run: 4, Failures: 0, Errors: 0, Skipped: 0, Time elapsed: 1.213 s - in org.apache.hadoop.hbase.TestHColumnDescriptor
[INFO] Running org.apache.hadoop.hbase.TestInterfaceAudienceAnnotations
[INFO] Tests run: 2, Failures: 0, Errors: 0, Skipped: 0, Time elapsed: 3.459 s - in org.apache.hadoop.hbase.TestInterfaceAudienceAnnotations
[INFO] Running org.apache.hadoop.hbase.ipc.TestIPCUtil
[INFO] Tests run: 1, Failures: 0, Errors: 0, Skipped: 0, Time elapsed: 0.009 s - in org.apache.hadoop.hbase.ipc.TestIPCUtil
[INFO] Running org.apache.hadoop.hbase.ipc.TestFailedServersLog
[INFO] Tests run: 1, Failures: 0, Errors: 0, Skipped: 0, Time elapsed: 0.381 s - in org.apache.hadoop.hbase.ipc.TestFailedServersLog
[INFO] Running org.apache.hadoop.hbase.ipc.TestCellBlockBuilder
[INFO] Tests run: 1, Failures: 0, Errors: 0, Skipped: 0, Time elapsed: 0.402 s - in org.apache.hadoop.hbase.ipc.TestCellBlockBuilder
[INFO] Running org.apache.hadoop.hbase.ipc.TestHBaseRpcControllerImpl
[INFO] Tests run: 1, Failures: 0, Errors: 0, Skipped: 0, Time elapsed: 0.175 s - in org.apache.hadoop.hbase.ipc.TestHBaseRpcControllerImpl
[INFO] Running org.apache.hadoop.hbase.security.TestEncryptionUtil
[INFO] Tests run: 3, Failures: 0, Errors: 0, Skipped: 0, Time elapsed: 1.56 s - in org.apache.hadoop.hbase.security.TestEncryptionUtil
[INFO] Running org.apache.hadoop.hbase.security.TestHBaseSaslRpcClient
[INFO] Tests run: 5, Failures: 0, Errors: 0, Skipped: 0, Time elapsed: 0.505 s - in org.apache.hadoop.hbase.security.TestHBaseSaslRpcClient
[INFO] Running org.apache.hadoop.hbase.TestRegionLocations
[INFO] Tests run: 8, Failures: 0, Errors: 0, Skipped: 0, Time elapsed: 0.014 s - in org.apache.hadoop.hbase.TestRegionLocations
[INFO] Running org.apache.hadoop.hbase.filter.TestLongComparator
[INFO] Tests run: 1, Failures: 0, Errors: 0, Skipped: 0, Time elapsed: 0.152 s - in org.apache.hadoop.hbase.filter.TestLongComparator
[INFO] Running org.apache.hadoop.hbase.exceptions.TestClientExceptionsUtil
[INFO] Tests run: 1, Failures: 0, Errors: 0, Skipped: 0, Time elapsed: 0.018 s - in org.apache.hadoop.hbase.exceptions.TestClientExceptionsUtil
[INFO] 
[INFO] Results:
[INFO] 
[ERROR] Errors: 
[ERROR] org.apache.hadoop.hbase.client.TestGet.testDynamicFilter(org.apache.hadoop.hbase.client.TestGet)
[ERROR]   Run 1: TestGet.testDynamicFilter:231 » FileNotFound /tmp/hbase-jenkins/local/jars/Moc...
[ERROR]   Run 2: TestGet.testDynamicFilter:231 » FileNotFound /tmp/hbase-jenkins/local/jars/Moc...
[ERROR]   Run 3: TestGet.testDynamicFilter:231 » FileNotFound /tmp/hbase-jenkins/local/jars/Moc...
[INFO] 
[INFO] 
[ERROR] Tests run: 163, Failures: 0, Errors: 1, Skipped: 1
[INFO] 
[INFO] ------------------------------------------------------------------------
[INFO] Reactor Summary:
[INFO] 
[INFO] Apache HBase ...................................... SUCCESS [1:47.476s]
[INFO] Apache HBase - Checkstyle ......................... SUCCESS [14.256s]
[INFO] Apache HBase - Resource Bundle .................... SUCCESS [0.253s]
[INFO] Apache HBase - Annotations ........................ SUCCESS [1.561s]
[INFO] Apache HBase - Protocol ........................... SUCCESS [18.507s]
[INFO] Apache HBase - Common ............................. SUCCESS [2:48.325s]
[INFO] Apache HBase - Procedure .......................... SUCCESS [3:47.529s]
[INFO] Apache HBase - Metrics API ........................ SUCCESS [1.931s]
[INFO] Apache HBase - Hadoop Compatibility ............... SUCCESS [14.615s]
[INFO] Apache HBase - Metrics Implementation ............. SUCCESS [8.264s]
[INFO] Apache HBase - Hadoop Two Compatibility ........... SUCCESS [42.447s]
[INFO] Apache HBase - Client ............................. FAILURE [2:07.282s]
[INFO] Apache HBase - Prefix Tree ........................ SKIPPED
[INFO] Apache HBase - Server ............................. SKIPPED
[INFO] Apache HBase - Testing Util ....................... SKIPPED
[INFO] Apache HBase - Thrift ............................. SKIPPED
[INFO] Apache HBase - Rest ............................... SKIPPED
[INFO] Apache HBase - RSGroup ............................ SKIPPED
[INFO] Apache HBase - Shell .............................. SKIPPED
[INFO] Apache HBase - Integration Tests .................. SKIPPED
[INFO] Apache HBase - Examples ........................... SKIPPED
[INFO] Apache HBase - External Block Cache ............... SKIPPED
[INFO] Apache HBase - Assembly ........................... SKIPPED
[INFO] Apache HBase - Shaded ............................. SKIPPED
[INFO] Apache HBase - Shaded - Client .................... SKIPPED
[INFO] Apache HBase - Shaded - Server .................... SKIPPED
[INFO] Apache HBase Shaded Packaging Invariants .......... SKIPPED
[INFO] Apache HBase - Archetypes ......................... SKIPPED
[INFO] Apache HBase - Exemplar for hbase-client archetype  SKIPPED
[INFO] Apache HBase - Exemplar for hbase-shaded-client archetype  SKIPPED
[INFO] Apache HBase - Archetype builder .................. SKIPPED
[INFO] ------------------------------------------------------------------------
[INFO] BUILD FAILURE
[INFO] ------------------------------------------------------------------------
[INFO] Total time: 12:45.027s
[INFO] Finished at: Tue Nov 14 05:36:30 UTC 2017
[INFO] Final Memory: 81M/1446M
[INFO] ------------------------------------------------------------------------
[ERROR] Failed to execute goal org.apache.maven.plugins:maven-surefire-plugin:2.20.1:test
(default-test) on project hbase-client: There are test failures.
[ERROR] 
[ERROR] Please refer to <https://builds.apache.org/job/HBase-1.5/jdk=JDK_1_7,label=Hadoop&&!H13/ws/hbase-client/target/surefire-reports>
for the individual test results.
[ERROR] Please refer to dump files (if any exist) [date]-jvmRun[N].dump, [date].dumpstream
and [date]-jvmRun[N].dumpstream.
[ERROR] -> [Help 1]
[ERROR] 
[ERROR] To see the full stack trace of the errors, re-run Maven with the -e switch.
[ERROR] Re-run Maven using the -X switch to enable full debug logging.
[ERROR] 
[ERROR] For more information about the errors and possible solutions, please read the following
articles:
[ERROR] [Help 1] http://cwiki.apache.org/confluence/display/MAVEN/MojoFailureException
[ERROR] 
[ERROR] After correcting the problems, you can resume the build with the command
[ERROR]   mvn <goals> -rf :hbase-client
Build step 'Invoke top-level Maven targets' marked build as failure
Performing Post build task...
Match found for :.* : True
Logical operation result is TRUE
Running script  : # Post-build task script. TODO: Check this in and have all builds reference
check-in.
pwd && ls
# NOTE!!!! The below code has been copied and pasted from ./dev-tools/run-test.sh
# Do not change here without syncing there and vice-versa.
ZOMBIE_TESTS_COUNT=`jps -v | grep surefirebooter | grep -e '-Dhbase.test' | wc -l`
if [[ $ZOMBIE_TESTS_COUNT != 0 ]] ; then
 echo "Suspicious java process found - waiting 30s to see if there are just slow to stop"
 sleep 30
 ZOMBIE_TESTS_COUNT=`jps -v | grep surefirebooter | grep -e '-Dhbase.test' | wc -l`
 if [[ $ZOMBIE_TESTS_COUNT != 0 ]] ; then
   echo " {color:red}There appear to be $ZOMBIE_TESTS_COUNT zombie tests{color}, they should
have been killed by surefire but survived"
   jps -v | grep surefirebooter | grep -e '-Dhbase.test'
   jps -v | grep surefirebooter | grep -e '-Dhbase.test' | cut -d ' ' -f 1 | xargs -n 1 jstack
   # Exit with error
   exit 1
 else
   echo "We're ok: there is no zombie test, but some tests took some time to stop"
 fi
else
  echo "We're ok: there is no zombie test"
fi
Setting JDK_1_7_LATEST__HOME=/home/jenkins/tools/java/latest1.7
Setting JDK_1_8_LATEST__HOME=/home/jenkins/tools/java/latest1.8
[19ccb43d] $ /bin/bash -xe /tmp/jenkins2598457300286883720.sh
+ pwd
<https://builds.apache.org/job/HBase-1.5/jdk=JDK_1_7,label=Hadoop&&!H13/ws/>
+ ls
bin
CHANGES.txt
conf
dev-support
extra_env_var
hbase-annotations
hbase-archetypes
hbase-assembly
hbase-checkstyle
hbase-client
hbase-common
hbase-error-prone
hbase-examples
hbase-external-blockcache
hbase-hadoop2-compat
hbase-hadoop-compat
hbase-it
hbase-metrics
hbase-metrics-api
hbase-native-client
hbase-prefix-tree
hbase-procedure
hbase-protocol
hbase-resource-bundle
hbase-rest
hbase-rsgroup
hbase-server
hbase-shaded
hbase-shell
hbase-testing-util
hbase-thrift
LICENSE.txt
NOTICE.txt
pom.xml
README.txt
src
target
++ wc -l
++ grep -e -Dhbase.test
++ grep surefirebooter
++ jps -v
+ ZOMBIE_TESTS_COUNT=0
+ [[ 0 != 0 ]]
+ echo 'We'\''re ok: there is no zombie test'
We're ok: there is no zombie test
POST BUILD TASK : SUCCESS
END OF POST BUILD TASK : 0
Archiving artifacts
Setting JDK_1_7_LATEST__HOME=/home/jenkins/tools/java/latest1.7
Setting JDK_1_8_LATEST__HOME=/home/jenkins/tools/java/latest1.8
Recording test results
Setting JDK_1_7_LATEST__HOME=/home/jenkins/tools/java/latest1.7
Setting JDK_1_8_LATEST__HOME=/home/jenkins/tools/java/latest1.8
Setting JDK_1_7_LATEST__HOME=/home/jenkins/tools/java/latest1.7
Setting JDK_1_8_LATEST__HOME=/home/jenkins/tools/java/latest1.8

Mime
View raw message