hbase-builds mailing list archives

Site index · List index
Message view « Date » · « Thread »
Top « Date » · « Thread »
From Apache Jenkins Server <jenk...@builds.apache.org>
Subject Build failed in Jenkins: HBase-1.4 » JDK_1_7,Hadoop&&!H13 #987
Date Thu, 02 Nov 2017 22:06:31 GMT
See <https://builds.apache.org/job/HBase-1.4/jdk=JDK_1_7,label=Hadoop&&!H13/987/display/redirect?page=changes>

Changes:

[apurtell] HBASE-19150 TestSnapshotWithAcl is flaky

[elserj] HBASE-19118 Use SaslUtil to set Sasl.QOP in 'Thrift'

[elserj] HBASE-19156 Remove vestiges of an unused regions-per-server CLI argument

------------------------------------------
[...truncated 2.44 MB...]
[INFO] Tests run: 1, Failures: 0, Errors: 0, Skipped: 0, Time elapsed: 15.397 s - in org.apache.hadoop.hbase.util.TestIdLock
[INFO] Running org.apache.hadoop.hbase.util.TestMergeTable
[INFO] Running org.apache.hadoop.hbase.util.TestHBaseFsck
[INFO] Tests run: 4, Failures: 0, Errors: 0, Skipped: 0, Time elapsed: 74.416 s - in org.apache.hadoop.hbase.util.TestMiniClusterLoadParallel
[INFO] Running org.apache.hadoop.hbase.util.TestFSTableDescriptors
[INFO] Tests run: 15, Failures: 0, Errors: 0, Skipped: 0, Time elapsed: 2.62 s - in org.apache.hadoop.hbase.util.TestFSTableDescriptors
[INFO] Running org.apache.hadoop.hbase.util.TestMiniClusterLoadSequential
[INFO] Tests run: 1, Failures: 0, Errors: 0, Skipped: 0, Time elapsed: 32.607 s - in org.apache.hadoop.hbase.util.TestMergeTable
[INFO] Running org.apache.hadoop.hbase.util.TestConnectionCache
[INFO] Tests run: 1, Failures: 0, Errors: 0, Skipped: 0, Time elapsed: 22.555 s - in org.apache.hadoop.hbase.util.TestConnectionCache
[INFO] Running org.apache.hadoop.hbase.util.TestDefaultEnvironmentEdge
[INFO] Tests run: 1, Failures: 0, Errors: 0, Skipped: 0, Time elapsed: 0.382 s - in org.apache.hadoop.hbase.util.TestDefaultEnvironmentEdge
[INFO] Running org.apache.hadoop.hbase.util.TestFSVisitor
[INFO] Tests run: 1, Failures: 0, Errors: 0, Skipped: 0, Time elapsed: 1.854 s - in org.apache.hadoop.hbase.util.TestFSVisitor
[INFO] Running org.apache.hadoop.hbase.util.TestTableName
[INFO] Tests run: 6, Failures: 0, Errors: 0, Skipped: 0, Time elapsed: 0.628 s - in org.apache.hadoop.hbase.util.TestTableName
[INFO] Running org.apache.hadoop.hbase.util.TestHBaseFsckEncryption
[INFO] Tests run: 1, Failures: 0, Errors: 0, Skipped: 0, Time elapsed: 22.15 s - in org.apache.hadoop.hbase.util.TestHBaseFsckEncryption
[INFO] Running org.apache.hadoop.hbase.util.TestFSHDFSUtils
[INFO] Tests run: 3, Failures: 0, Errors: 0, Skipped: 0, Time elapsed: 8.007 s - in org.apache.hadoop.hbase.util.TestFSHDFSUtils
[INFO] Running org.apache.hadoop.hbase.util.TestMiniClusterLoadEncoded
[INFO] Tests run: 4, Failures: 0, Errors: 0, Skipped: 0, Time elapsed: 81.721 s - in org.apache.hadoop.hbase.util.TestMiniClusterLoadSequential
[INFO] Running org.apache.hadoop.hbase.util.TestIdReadWriteLock
[INFO] Tests run: 1, Failures: 0, Errors: 0, Skipped: 0, Time elapsed: 15.828 s - in org.apache.hadoop.hbase.util.TestIdReadWriteLock
[INFO] Running org.apache.hadoop.hbase.util.hbck.TestOfflineMetaRebuildOverlap
[INFO] Tests run: 1, Failures: 0, Errors: 0, Skipped: 0, Time elapsed: 38.333 s - in org.apache.hadoop.hbase.util.hbck.TestOfflineMetaRebuildOverlap
[INFO] Running org.apache.hadoop.hbase.util.hbck.TestOfflineMetaRebuildBase
[INFO] Tests run: 6, Failures: 0, Errors: 0, Skipped: 0, Time elapsed: 102.265 s - in org.apache.hadoop.hbase.util.TestMiniClusterLoadEncoded
[INFO] Running org.apache.hadoop.hbase.util.hbck.TestOfflineMetaRebuildHole
[INFO] Tests run: 9, Failures: 0, Errors: 0, Skipped: 0, Time elapsed: 384.763 s - in org.apache.hadoop.hbase.snapshot.TestExportSnapshot
[INFO] Running org.apache.hadoop.hbase.util.TestMergeTool
[INFO] Tests run: 9, Failures: 0, Errors: 0, Skipped: 0, Time elapsed: 385.386 s - in org.apache.hadoop.hbase.snapshot.TestSecureExportSnapshot
[INFO] Running org.apache.hadoop.hbase.util.TestFSUtils
[INFO] Tests run: 1, Failures: 0, Errors: 0, Skipped: 0, Time elapsed: 24.137 s - in org.apache.hadoop.hbase.util.TestMergeTool
[INFO] Tests run: 1, Failures: 0, Errors: 0, Skipped: 0, Time elapsed: 37.149 s - in org.apache.hadoop.hbase.util.hbck.TestOfflineMetaRebuildHole
[INFO] Tests run: 14, Failures: 0, Errors: 0, Skipped: 0, Time elapsed: 23.888 s - in org.apache.hadoop.hbase.util.TestFSUtils
[INFO] Running org.apache.hadoop.hbase.util.TestCoprocessorScanPolicy
[INFO] Running org.apache.hadoop.hbase.util.TestRegionSplitter
[INFO] Running org.apache.hadoop.hbase.TestFullLogReconstruction
[INFO] Tests run: 2, Failures: 0, Errors: 0, Skipped: 0, Time elapsed: 95.846 s - in org.apache.hadoop.hbase.util.hbck.TestOfflineMetaRebuildBase
[INFO] Running org.apache.hadoop.hbase.tool.TestCanaryTool
[INFO] Tests run: 7, Failures: 0, Errors: 0, Skipped: 0, Time elapsed: 11.274 s - in org.apache.hadoop.hbase.util.TestRegionSplitter
[INFO] Running org.apache.hadoop.hbase.wal.TestBoundedRegionGroupingStrategy
[INFO] Tests run: 4, Failures: 0, Errors: 0, Skipped: 0, Time elapsed: 21.459 s - in org.apache.hadoop.hbase.util.TestCoprocessorScanPolicy
[INFO] Tests run: 1, Failures: 0, Errors: 0, Skipped: 0, Time elapsed: 16.047 s - in org.apache.hadoop.hbase.TestFullLogReconstruction
[INFO] Running org.apache.hadoop.hbase.wal.TestDefaultWALProvider
[INFO] Running org.apache.hadoop.hbase.wal.TestWALSplit
[INFO] Tests run: 5, Failures: 0, Errors: 0, Skipped: 0, Time elapsed: 9.838 s - in org.apache.hadoop.hbase.wal.TestDefaultWALProvider
[INFO] Tests run: 5, Failures: 0, Errors: 0, Skipped: 0, Time elapsed: 24.178 s - in org.apache.hadoop.hbase.wal.TestBoundedRegionGroupingStrategy
[INFO] Running org.apache.hadoop.hbase.wal.TestWALFactory
[INFO] Tests run: 9, Failures: 0, Errors: 0, Skipped: 0, Time elapsed: 13.509 s - in org.apache.hadoop.hbase.wal.TestWALFactory
[INFO] Running org.apache.hadoop.hbase.wal.TestWALOpenAfterDNRollingStart
[INFO] Running org.apache.hadoop.hbase.wal.TestWALRootDir
[INFO] Tests run: 1, Failures: 0, Errors: 0, Skipped: 0, Time elapsed: 1.439 s - in org.apache.hadoop.hbase.wal.TestWALRootDir
[INFO] Running org.apache.hadoop.hbase.wal.TestSecureWAL
[INFO] Tests run: 1, Failures: 0, Errors: 0, Skipped: 0, Time elapsed: 1.635 s - in org.apache.hadoop.hbase.wal.TestSecureWAL
[INFO] Running org.apache.hadoop.hbase.wal.TestWALSplitCompressed
[WARNING] Tests run: 7, Failures: 0, Errors: 0, Skipped: 2, Time elapsed: 82.039 s - in org.apache.hadoop.hbase.tool.TestCanaryTool
[INFO] Running org.apache.hadoop.hbase.wal.TestWALFiltering
[INFO] Tests run: 1, Failures: 0, Errors: 0, Skipped: 0, Time elapsed: 46.76 s - in org.apache.hadoop.hbase.wal.TestWALOpenAfterDNRollingStart
[INFO] Running org.apache.hadoop.hbase.wal.TestWALReaderOnSecureWAL
[INFO] Tests run: 2, Failures: 0, Errors: 0, Skipped: 0, Time elapsed: 1.854 s - in org.apache.hadoop.hbase.wal.TestWALReaderOnSecureWAL
[INFO] Running org.apache.hadoop.hbase.wal.TestDefaultWALProviderWithHLogKey
[INFO] Tests run: 33, Failures: 0, Errors: 0, Skipped: 0, Time elapsed: 95.833 s - in org.apache.hadoop.hbase.wal.TestWALSplit
[INFO] Tests run: 1, Failures: 0, Errors: 0, Skipped: 0, Time elapsed: 33.122 s - in org.apache.hadoop.hbase.wal.TestWALFiltering
[INFO] Running org.apache.hadoop.hbase.TestHBaseOnOtherDfsCluster
[INFO] Tests run: 5, Failures: 0, Errors: 0, Skipped: 0, Time elapsed: 7.366 s - in org.apache.hadoop.hbase.wal.TestDefaultWALProviderWithHLogKey
[INFO] Tests run: 1, Failures: 0, Errors: 0, Skipped: 0, Time elapsed: 18.66 s - in org.apache.hadoop.hbase.TestHBaseOnOtherDfsCluster
[INFO] Running org.apache.hadoop.hbase.TestServerSideScanMetricsFromClientSide
[INFO] Tests run: 2, Failures: 0, Errors: 0, Skipped: 0, Time elapsed: 2.975 s - in org.apache.hadoop.hbase.TestServerSideScanMetricsFromClientSide
[INFO] Running org.apache.hadoop.hbase.TestZooKeeper
[INFO] Running org.apache.hadoop.hbase.filter.TestFuzzyRowFilterEndToEnd
[INFO] Running org.apache.hadoop.hbase.filter.TestFilterListOnMini
[INFO] Tests run: 1, Failures: 0, Errors: 0, Skipped: 0, Time elapsed: 4.067 s - in org.apache.hadoop.hbase.filter.TestFilterListOnMini
[INFO] Tests run: 33, Failures: 0, Errors: 0, Skipped: 0, Time elapsed: 89.936 s - in org.apache.hadoop.hbase.wal.TestWALSplitCompressed
[INFO] Running org.apache.hadoop.hbase.filter.TestFilterWithScanLimits
[INFO] Running org.apache.hadoop.hbase.filter.TestColumnRangeFilter
[INFO] Tests run: 1, Failures: 0, Errors: 0, Skipped: 0, Time elapsed: 6.002 s - in org.apache.hadoop.hbase.filter.TestFilterWithScanLimits
[INFO] Tests run: 1, Failures: 0, Errors: 0, Skipped: 0, Time elapsed: 8.902 s - in org.apache.hadoop.hbase.filter.TestColumnRangeFilter
[INFO] Running org.apache.hadoop.hbase.filter.TestMultiRowRangeFilter
[INFO] Running org.apache.hadoop.hbase.filter.TestFilterWrapper
[INFO] Tests run: 1, Failures: 0, Errors: 0, Skipped: 0, Time elapsed: 5.065 s - in org.apache.hadoop.hbase.filter.TestFilterWrapper
[INFO] Running org.apache.hadoop.hbase.filter.TestFilterListOrOperatorWithBlkCnt
[INFO] Tests run: 21, Failures: 0, Errors: 0, Skipped: 0, Time elapsed: 28.664 s - in org.apache.hadoop.hbase.filter.TestMultiRowRangeFilter
[INFO] Running org.apache.hadoop.hbase.filter.TestFuzzyRowAndColumnRangeFilter
[INFO] Tests run: 1, Failures: 0, Errors: 0, Skipped: 0, Time elapsed: 15.965 s - in org.apache.hadoop.hbase.filter.TestFilterListOrOperatorWithBlkCnt
[INFO] Tests run: 1, Failures: 0, Errors: 0, Skipped: 0, Time elapsed: 4.118 s - in org.apache.hadoop.hbase.filter.TestFuzzyRowAndColumnRangeFilter
[INFO] Running org.apache.hadoop.hbase.filter.TestScanRowPrefix
[INFO] Tests run: 1, Failures: 0, Errors: 0, Skipped: 0, Time elapsed: 8.597 s - in org.apache.hadoop.hbase.filter.TestScanRowPrefix
[INFO] Tests run: 10, Failures: 0, Errors: 0, Skipped: 0, Time elapsed: 184.277 s - in org.apache.hadoop.hbase.TestZooKeeper
[WARNING] Tests run: 59, Failures: 0, Errors: 0, Skipped: 1, Time elapsed: 592.581 s - in
org.apache.hadoop.hbase.util.TestHBaseFsck
[INFO] Tests run: 4, Failures: 0, Errors: 0, Skipped: 0, Time elapsed: 213.945 s - in org.apache.hadoop.hbase.filter.TestFuzzyRowFilterEndToEnd
[INFO] 
[INFO] Results:
[INFO] 
[ERROR] Errors: 
[ERROR]   TestReplicationKillSlaveRS.killOneSlaveRS » RetriesExhausted Failed after atte...
[WARNING] Flakes: 
[WARNING] org.apache.hadoop.hbase.client.replication.TestReplicationAdminWithClusters.testReplicationPeerConfigUpdateCallback(org.apache.hadoop.hbase.client.replication.TestReplicationAdminWithClusters)
[ERROR]   Run 1: TestReplicationAdminWithClusters.testReplicationPeerConfigUpdateCallback:231
expected:<true> but was:<false>
[INFO]   Run 2: PASS
[INFO] 
[WARNING] org.apache.hadoop.hbase.regionserver.TestCompactionInDeadRegionServer.test(org.apache.hadoop.hbase.regionserver.TestCompactionInDeadRegionServer)
[ERROR]   Run 1: TestCompactionInDeadRegionServer.test:132 Should fail as our wal file has
already been closed, and walDir has also been renamed
[INFO]   Run 2: PASS
[INFO] 
[INFO] 
[ERROR] Tests run: 2866, Failures: 0, Errors: 1, Skipped: 61, Flakes: 2
[INFO] 
[INFO] ------------------------------------------------------------------------
[INFO] Reactor Summary:
[INFO] 
[INFO] Apache HBase ...................................... SUCCESS [1:51.838s]
[INFO] Apache HBase - Checkstyle ......................... SUCCESS [15.623s]
[INFO] Apache HBase - Resource Bundle .................... SUCCESS [0.358s]
[INFO] Apache HBase - Annotations ........................ SUCCESS [2.578s]
[INFO] Apache HBase - Protocol ........................... SUCCESS [20.684s]
[INFO] Apache HBase - Common ............................. SUCCESS [3:14.982s]
[INFO] Apache HBase - Procedure .......................... SUCCESS [3:58.625s]
[INFO] Apache HBase - Metrics API ........................ SUCCESS [2.383s]
[INFO] Apache HBase - Hadoop Compatibility ............... SUCCESS [15.336s]
[INFO] Apache HBase - Metrics Implementation ............. SUCCESS [9.957s]
[INFO] Apache HBase - Hadoop Two Compatibility ........... SUCCESS [28.428s]
[INFO] Apache HBase - Client ............................. SUCCESS [2:10.186s]
[INFO] Apache HBase - Prefix Tree ........................ SUCCESS [15.870s]
[INFO] Apache HBase - Server ............................. FAILURE [2:05:23.819s]
[INFO] Apache HBase - Testing Util ....................... SKIPPED
[INFO] Apache HBase - Thrift ............................. SKIPPED
[INFO] Apache HBase - Rest ............................... SKIPPED
[INFO] Apache HBase - RSGroup ............................ SKIPPED
[INFO] Apache HBase - Shell .............................. SKIPPED
[INFO] Apache HBase - Integration Tests .................. SKIPPED
[INFO] Apache HBase - Examples ........................... SKIPPED
[INFO] Apache HBase - External Block Cache ............... SKIPPED
[INFO] Apache HBase - Assembly ........................... SKIPPED
[INFO] Apache HBase - Shaded ............................. SKIPPED
[INFO] Apache HBase - Shaded - Client .................... SKIPPED
[INFO] Apache HBase - Shaded - Server .................... SKIPPED
[INFO] Apache HBase Shaded Packaging Invariants .......... SKIPPED
[INFO] Apache HBase - Archetypes ......................... SKIPPED
[INFO] Apache HBase - Exemplar for hbase-client archetype  SKIPPED
[INFO] Apache HBase - Exemplar for hbase-shaded-client archetype  SKIPPED
[INFO] Apache HBase - Archetype builder .................. SKIPPED
[INFO] ------------------------------------------------------------------------
[INFO] BUILD FAILURE
[INFO] ------------------------------------------------------------------------
[INFO] Total time: 2:19:06.844s
[INFO] Finished at: Thu Nov 02 22:02:09 UTC 2017
[INFO] Final Memory: 107M/1843M
[INFO] ------------------------------------------------------------------------
[ERROR] Failed to execute goal org.apache.maven.plugins:maven-surefire-plugin:2.20.1:test
(secondPartTestsExecution) on project hbase-server: There are test failures.
[ERROR] 
[ERROR] Please refer to <https://builds.apache.org/job/HBase-1.4/jdk=JDK_1_7,label=Hadoop&&!H13/ws/hbase-server/target/surefire-reports>
for the individual test results.
[ERROR] Please refer to dump files (if any exist) [date]-jvmRun[N].dump, [date].dumpstream
and [date]-jvmRun[N].dumpstream.
[ERROR] -> [Help 1]
[ERROR] 
[ERROR] To see the full stack trace of the errors, re-run Maven with the -e switch.
[ERROR] Re-run Maven using the -X switch to enable full debug logging.
[ERROR] 
[ERROR] For more information about the errors and possible solutions, please read the following
articles:
[ERROR] [Help 1] http://cwiki.apache.org/confluence/display/MAVEN/MojoFailureException
[ERROR] 
[ERROR] After correcting the problems, you can resume the build with the command
[ERROR]   mvn <goals> -rf :hbase-server
Build step 'Invoke top-level Maven targets' marked build as failure
Performing Post build task...
Match found for :.* : True
Logical operation result is TRUE
Running script  : # Post-build task script. TODO: Check this in and have all builds reference
check-in.
pwd && ls
# NOTE!!!! The below code has been copied and pasted from ./dev-tools/run-test.sh
# Do not change here without syncing there and vice-versa.
ZOMBIE_TESTS_COUNT=`jps -v | grep surefirebooter | grep -e '-Dhbase.test' | wc -l`
if [[ $ZOMBIE_TESTS_COUNT != 0 ]] ; then
 echo "Suspicious java process found - waiting 30s to see if there are just slow to stop"
 sleep 30
 ZOMBIE_TESTS_COUNT=`jps -v | grep surefirebooter | grep -e '-Dhbase.test' | wc -l`
 if [[ $ZOMBIE_TESTS_COUNT != 0 ]] ; then
   echo " {color:red}There appear to be $ZOMBIE_TESTS_COUNT zombie tests{color}, they should
have been killed by surefire but survived"
   jps -v | grep surefirebooter | grep -e '-Dhbase.test'
   jps -v | grep surefirebooter | grep -e '-Dhbase.test' | cut -d ' ' -f 1 | xargs -n 1 jstack
   # Exit with error
   exit 1
 else
   echo "We're ok: there is no zombie test, but some tests took some time to stop"
 fi
else
  echo "We're ok: there is no zombie test"
fi
Setting JDK_1_7_LATEST__HOME=/home/jenkins/tools/java/latest1.7
Setting JDK_1_8_LATEST__HOME=/home/jenkins/tools/java/latest1.8
[19ccb43d] $ /bin/bash -xe /tmp/jenkins6965617293860478226.sh
+ pwd
<https://builds.apache.org/job/HBase-1.4/jdk=JDK_1_7,label=Hadoop&&!H13/ws/>
+ ls
bin
CHANGES.txt
conf
dev-support
extra_env_var
hbase-annotations
hbase-archetypes
hbase-assembly
hbase-checkstyle
hbase-client
hbase-common
hbase-examples
hbase-external-blockcache
hbase-hadoop2-compat
hbase-hadoop-compat
hbase-it
hbase-metrics
hbase-metrics-api
hbase-native-client
hbase-prefix-tree
hbase-procedure
hbase-protocol
hbase-resource-bundle
hbase-rest
hbase-rsgroup
hbase-server
hbase-shaded
hbase-shell
hbase-testing-util
hbase-thrift
LICENSE.txt
NOTICE.txt
pom.xml
README.txt
src
target
++ jps -v
++ grep surefirebooter
++ grep -e -Dhbase.test
++ wc -l
+ ZOMBIE_TESTS_COUNT=0
+ [[ 0 != 0 ]]
+ echo 'We'\''re ok: there is no zombie test'
We're ok: there is no zombie test
POST BUILD TASK : SUCCESS
END OF POST BUILD TASK : 0
Archiving artifacts
Setting JDK_1_7_LATEST__HOME=/home/jenkins/tools/java/latest1.7
Setting JDK_1_8_LATEST__HOME=/home/jenkins/tools/java/latest1.8
Recording test results
Setting JDK_1_7_LATEST__HOME=/home/jenkins/tools/java/latest1.7
Setting JDK_1_8_LATEST__HOME=/home/jenkins/tools/java/latest1.8
Setting JDK_1_7_LATEST__HOME=/home/jenkins/tools/java/latest1.7
Setting JDK_1_8_LATEST__HOME=/home/jenkins/tools/java/latest1.8

Mime
View raw message