hbase-builds mailing list archives

Site index · List index
Message view « Date » · « Thread »
Top « Date » · « Thread »
From Apache Jenkins Server <jenk...@builds.apache.org>
Subject Build failed in Jenkins: HBase-1.4 » JDK_1_7,Hadoop&&!H13 #961
Date Sat, 21 Oct 2017 04:19:42 GMT
See <https://builds.apache.org/job/HBase-1.4/jdk=JDK_1_7,label=Hadoop&&!H13/961/display/redirect?page=changes>

Changes:

[busbey] HBASE-19060 precommit plugin test 'hadoopcheck' should only run when

[busbey] HBASE-19039 refactor shadedjars test to only run on java changes.

------------------------------------------
[...truncated 2.42 MB...]
[INFO] 
[ERROR] org.apache.hadoop.hbase.util.TestHBaseFsck.testHBaseFsck(org.apache.hadoop.hbase.util.TestHBaseFsck)
[ERROR]   Run 1: TestHBaseFsck.testHBaseFsck:240 expected:<[]> but was:<[NOT_IN_HDFS,
NOT_IN_HDFS, SHOULD_NOT_BE_DEPLOYED, NOT_IN_HDFS, NOT_IN_HDFS]>
[ERROR]   Run 2: TestHBaseFsck.testHBaseFsck:240 expected:<[]> but was:<[NOT_IN_HDFS,
NOT_IN_META_HDFS, NOT_IN_HDFS, NOT_IN_HDFS, NOT_IN_HDFS]>
[INFO] 
[ERROR] org.apache.hadoop.hbase.util.TestHBaseFsck.testHbckFixOrphanTable(org.apache.hadoop.hbase.util.TestHBaseFsck)
[ERROR]   Run 1: TestHBaseFsck.testHbckFixOrphanTable:720 expected:<[NO_TABLEINFO_FILE]>
but was:<[NOT_IN_HDFS, NOT_IN_HDFS, NOT_IN_HDFS, NOT_IN_HDFS, SHOULD_NOT_BE_DEPLOYED, NO_TABLEINFO_FILE]>
[ERROR]   Run 2: TestHBaseFsck.testHbckFixOrphanTable:720 expected:<[NO_TABLEINFO_FILE]>
but was:<[NOT_IN_META_HDFS, NOT_IN_HDFS, NOT_IN_HDFS, NOT_IN_HDFS, NOT_IN_HDFS, NO_TABLEINFO_FILE]>
[INFO] 
[ERROR] org.apache.hadoop.hbase.util.TestHBaseFsck.testNoHdfsTable(org.apache.hadoop.hbase.util.TestHBaseFsck)
[ERROR]   Run 1: TestHBaseFsck.testNoHdfsTable:1678 expected:<[NOT_IN_HDFS, NOT_IN_HDFS,
NOT_IN_HDFS, NOT_IN_HDFS]> but was:<[NOT_IN_HDFS, NOT_IN_HDFS, NOT_IN_HDFS, NOT_IN_HDFS,
SHOULD_NOT_BE_DEPLOYED]>
[ERROR]   Run 2: TestHBaseFsck.testNoHdfsTable:1678 expected:<[NOT_IN_HDFS, NOT_IN_HDFS,
NOT_IN_HDFS, NOT_IN_HDFS]> but was:<[NOT_IN_META_HDFS, NOT_IN_HDFS, NOT_IN_HDFS, NOT_IN_HDFS,
NOT_IN_HDFS]>
[INFO] 
[ERROR] org.apache.hadoop.hbase.util.TestHBaseFsck.testNotInHdfsWithReplicas(org.apache.hadoop.hbase.util.TestHBaseFsck)
[ERROR]   Run 1: TestHBaseFsck.testNotInHdfsWithReplicas:1610 expected:<[NOT_IN_HDFS]>
but was:<[NOT_IN_HDFS, NOT_IN_HDFS, NOT_IN_HDFS, NOT_IN_HDFS, NOT_IN_HDFS, SHOULD_NOT_BE_DEPLOYED]>
[ERROR]   Run 2: TestHBaseFsck.testNotInHdfsWithReplicas:1610 expected:<[NOT_IN_HDFS]>
but was:<[NOT_IN_META_HDFS, NOT_IN_HDFS, NOT_IN_HDFS, NOT_IN_HDFS, NOT_IN_HDFS, NOT_IN_HDFS]>
[INFO] 
[ERROR] Errors: 
[ERROR] org.apache.hadoop.hbase.util.TestHBaseFsck.testSplitAndDupeRegionWithRegionReplica(org.apache.hadoop.hbase.util.TestHBaseFsck)
[ERROR]   Run 1: TestHBaseFsck.testSplitAndDupeRegionWithRegionReplica:384->cleanupTable:654->deleteTable:3206
» TestTimedOut
[ERROR]   Run 2: TestHBaseFsck.testSplitAndDupeRegionWithRegionReplica:361 expected:<[NOT_DEPLOYED,
DUPE_STARTKEYS, DUPE_STARTKEYS, OVERLAP_IN_REGION_CHAIN]> but was:<[MULTI_DEPLOYED]>
[INFO] 
[WARNING] Flakes: 
[WARNING] org.apache.hadoop.hbase.regionserver.TestCompactionInDeadRegionServer.test(org.apache.hadoop.hbase.regionserver.TestCompactionInDeadRegionServer)
[ERROR]   Run 1: TestCompactionInDeadRegionServer.test:132 Should fail as our wal file has
already been closed, and walDir has also been renamed
[INFO]   Run 2: PASS
[INFO] 
[INFO] 
[ERROR] Tests run: 2816, Failures: 9, Errors: 1, Skipped: 59, Flakes: 1
[INFO] 
[INFO] ------------------------------------------------------------------------
[INFO] Reactor Summary:
[INFO] 
[INFO] Apache HBase ...................................... SUCCESS [1:53.230s]
[INFO] Apache HBase - Checkstyle ......................... SUCCESS [15.535s]
[INFO] Apache HBase - Resource Bundle .................... SUCCESS [0.540s]
[INFO] Apache HBase - Annotations ........................ SUCCESS [2.291s]
[INFO] Apache HBase - Protocol ........................... SUCCESS [21.441s]
[INFO] Apache HBase - Common ............................. SUCCESS [3:12.221s]
[INFO] Apache HBase - Procedure .......................... SUCCESS [3:58.379s]
[INFO] Apache HBase - Metrics API ........................ SUCCESS [2.738s]
[INFO] Apache HBase - Hadoop Compatibility ............... SUCCESS [15.481s]
[INFO] Apache HBase - Metrics Implementation ............. SUCCESS [10.674s]
[INFO] Apache HBase - Hadoop Two Compatibility ........... SUCCESS [29.613s]
[INFO] Apache HBase - Client ............................. SUCCESS [2:15.139s]
[INFO] Apache HBase - Prefix Tree ........................ SUCCESS [17.119s]
[INFO] Apache HBase - Server ............................. FAILURE [2:04:32.240s]
[INFO] Apache HBase - Testing Util ....................... SKIPPED
[INFO] Apache HBase - Thrift ............................. SKIPPED
[INFO] Apache HBase - Rest ............................... SKIPPED
[INFO] Apache HBase - Shell .............................. SKIPPED
[INFO] Apache HBase - Integration Tests .................. SKIPPED
[INFO] Apache HBase - Examples ........................... SKIPPED
[INFO] Apache HBase - External Block Cache ............... SKIPPED
[INFO] Apache HBase - Assembly ........................... SKIPPED
[INFO] Apache HBase - Shaded ............................. SKIPPED
[INFO] Apache HBase - Shaded - Client .................... SKIPPED
[INFO] Apache HBase - Shaded - Server .................... SKIPPED
[INFO] Apache HBase Shaded Packaging Invariants .......... SKIPPED
[INFO] Apache HBase - Archetypes ......................... SKIPPED
[INFO] Apache HBase - Exemplar for hbase-client archetype  SKIPPED
[INFO] Apache HBase - Exemplar for hbase-shaded-client archetype  SKIPPED
[INFO] Apache HBase - Archetype builder .................. SKIPPED
[INFO] ------------------------------------------------------------------------
[INFO] BUILD FAILURE
[INFO] ------------------------------------------------------------------------
[INFO] Total time: 2:18:22.610s
[INFO] Finished at: Sat Oct 21 04:15:07 UTC 2017
[INFO] Final Memory: 103M/1250M
[INFO] ------------------------------------------------------------------------
[ERROR] Failed to execute goal org.apache.maven.plugins:maven-surefire-plugin:2.20.1:test
(secondPartTestsExecution) on project hbase-server: There are test failures.
[ERROR] 
[ERROR] Please refer to <https://builds.apache.org/job/HBase-1.4/jdk=JDK_1_7,label=Hadoop&&!H13/ws/hbase-server/target/surefire-reports>
for the individual test results.
[ERROR] Please refer to dump files (if any exist) [date]-jvmRun[N].dump, [date].dumpstream
and [date]-jvmRun[N].dumpstream.
[ERROR] ExecutionException The forked VM terminated without properly saying goodbye. VM crash
or System.exit called?
[ERROR] Command was /bin/sh -c cd <https://builds.apache.org/job/HBase-1.4/jdk=JDK_1_7,label=Hadoop&&!H13/ws/hbase-server>
&& /usr/local/asfpackages/java/jdk1.7.0_80/jre/bin/java -enableassertions -Dhbase.test
-Xmx2800m -XX:MaxPermSize=512m -Djava.security.egd=file:/dev/./urandom -Djava.net.preferIPv4Stack=true
-Djava.awt.headless=true -jar <https://builds.apache.org/job/HBase-1.4/jdk=JDK_1_7,label=Hadoop&&!H13/ws/hbase-server/target/surefire/surefirebooter8656454533161983367.jar>
<https://builds.apache.org/job/HBase-1.4/jdk=JDK_1_7,label=Hadoop&&!H13/ws/hbase-server/target/surefire>
2017-10-21T01-59-26_413-jvmRun1 surefire8762990077754136651tmp surefire_11043481289828321287310tmp
[ERROR] Error occurred in starting fork, check output in log
[ERROR] Process Exit Code: 1
[ERROR] Crashed tests:
[ERROR] org.apache.hadoop.hbase.master.balancer.TestStochasticLoadBalancer
[ERROR] ExecutionException The forked VM terminated without properly saying goodbye. VM crash
or System.exit called?
[ERROR] Command was /bin/sh -c cd <https://builds.apache.org/job/HBase-1.4/jdk=JDK_1_7,label=Hadoop&&!H13/ws/hbase-server>
&& /usr/local/asfpackages/java/jdk1.7.0_80/jre/bin/java -enableassertions -Dhbase.test
-Xmx2800m -XX:MaxPermSize=512m -Djava.security.egd=file:/dev/./urandom -Djava.net.preferIPv4Stack=true
-Djava.awt.headless=true -jar <https://builds.apache.org/job/HBase-1.4/jdk=JDK_1_7,label=Hadoop&&!H13/ws/hbase-server/target/surefire/surefirebooter3470599957667885987.jar>
<https://builds.apache.org/job/HBase-1.4/jdk=JDK_1_7,label=Hadoop&&!H13/ws/hbase-server/target/surefire>
2017-10-21T01-59-26_413-jvmRun2 surefire267966874615869059tmp surefire_11075956727221458593659tmp
[ERROR] Error occurred in starting fork, check output in log
[ERROR] Process Exit Code: 1
[ERROR] Crashed tests:
[ERROR] org.apache.hadoop.hbase.master.balancer.TestStochasticLoadBalancer2
[ERROR] ExecutionException The forked VM terminated without properly saying goodbye. VM crash
or System.exit called?
[ERROR] Command was /bin/sh -c cd <https://builds.apache.org/job/HBase-1.4/jdk=JDK_1_7,label=Hadoop&&!H13/ws/hbase-server>
&& /usr/local/asfpackages/java/jdk1.7.0_80/jre/bin/java -enableassertions -Dhbase.test
-Xmx2800m -XX:MaxPermSize=512m -Djava.security.egd=file:/dev/./urandom -Djava.net.preferIPv4Stack=true
-Djava.awt.headless=true -jar <https://builds.apache.org/job/HBase-1.4/jdk=JDK_1_7,label=Hadoop&&!H13/ws/hbase-server/target/surefire/surefirebooter1561246693458725011.jar>
<https://builds.apache.org/job/HBase-1.4/jdk=JDK_1_7,label=Hadoop&&!H13/ws/hbase-server/target/surefire>
2017-10-21T01-59-26_413-jvmRun3 surefire8935894667743838744tmp surefire_11367357274034896219069tmp
[ERROR] Error occurred in starting fork, check output in log
[ERROR] Process Exit Code: 1
[ERROR] ExecutionException The forked VM terminated without properly saying goodbye. VM crash
or System.exit called?
[ERROR] Command was /bin/sh -c cd <https://builds.apache.org/job/HBase-1.4/jdk=JDK_1_7,label=Hadoop&&!H13/ws/hbase-server>
&& /usr/local/asfpackages/java/jdk1.7.0_80/jre/bin/java -enableassertions -Dhbase.test
-Xmx2800m -XX:MaxPermSize=512m -Djava.security.egd=file:/dev/./urandom -Djava.net.preferIPv4Stack=true
-Djava.awt.headless=true -jar <https://builds.apache.org/job/HBase-1.4/jdk=JDK_1_7,label=Hadoop&&!H13/ws/hbase-server/target/surefire/surefirebooter4255144215314917103.jar>
<https://builds.apache.org/job/HBase-1.4/jdk=JDK_1_7,label=Hadoop&&!H13/ws/hbase-server/target/surefire>
2017-10-21T01-59-26_413-jvmRun4 surefire1542740735603667991tmp surefire_11371417139399650670002tmp
[ERROR] Error occurred in starting fork, check output in log
[ERROR] Process Exit Code: 1
[ERROR] org.apache.maven.surefire.booter.SurefireBooterForkException: ExecutionException The
forked VM terminated without properly saying goodbye. VM crash or System.exit called?
[ERROR] Command was /bin/sh -c cd <https://builds.apache.org/job/HBase-1.4/jdk=JDK_1_7,label=Hadoop&&!H13/ws/hbase-server>
&& /usr/local/asfpackages/java/jdk1.7.0_80/jre/bin/java -enableassertions -Dhbase.test
-Xmx2800m -XX:MaxPermSize=512m -Djava.security.egd=file:/dev/./urandom -Djava.net.preferIPv4Stack=true
-Djava.awt.headless=true -jar <https://builds.apache.org/job/HBase-1.4/jdk=JDK_1_7,label=Hadoop&&!H13/ws/hbase-server/target/surefire/surefirebooter8656454533161983367.jar>
<https://builds.apache.org/job/HBase-1.4/jdk=JDK_1_7,label=Hadoop&&!H13/ws/hbase-server/target/surefire>
2017-10-21T01-59-26_413-jvmRun1 surefire8762990077754136651tmp surefire_11043481289828321287310tmp
[ERROR] Error occurred in starting fork, check output in log
[ERROR] Process Exit Code: 1
[ERROR] Crashed tests:
[ERROR] org.apache.hadoop.hbase.master.balancer.TestStochasticLoadBalancer
[ERROR] ExecutionException The forked VM terminated without properly saying goodbye. VM crash
or System.exit called?
[ERROR] Command was /bin/sh -c cd <https://builds.apache.org/job/HBase-1.4/jdk=JDK_1_7,label=Hadoop&&!H13/ws/hbase-server>
&& /usr/local/asfpackages/java/jdk1.7.0_80/jre/bin/java -enableassertions -Dhbase.test
-Xmx2800m -XX:MaxPermSize=512m -Djava.security.egd=file:/dev/./urandom -Djava.net.preferIPv4Stack=true
-Djava.awt.headless=true -jar <https://builds.apache.org/job/HBase-1.4/jdk=JDK_1_7,label=Hadoop&&!H13/ws/hbase-server/target/surefire/surefirebooter3470599957667885987.jar>
<https://builds.apache.org/job/HBase-1.4/jdk=JDK_1_7,label=Hadoop&&!H13/ws/hbase-server/target/surefire>
2017-10-21T01-59-26_413-jvmRun2 surefire267966874615869059tmp surefire_11075956727221458593659tmp
[ERROR] Error occurred in starting fork, check output in log
[ERROR] Process Exit Code: 1
[ERROR] Crashed tests:
[ERROR] org.apache.hadoop.hbase.master.balancer.TestStochasticLoadBalancer2
[ERROR] ExecutionException The forked VM terminated without properly saying goodbye. VM crash
or System.exit called?
[ERROR] Command was /bin/sh -c cd <https://builds.apache.org/job/HBase-1.4/jdk=JDK_1_7,label=Hadoop&&!H13/ws/hbase-server>
&& /usr/local/asfpackages/java/jdk1.7.0_80/jre/bin/java -enableassertions -Dhbase.test
-Xmx2800m -XX:MaxPermSize=512m -Djava.security.egd=file:/dev/./urandom -Djava.net.preferIPv4Stack=true
-Djava.awt.headless=true -jar <https://builds.apache.org/job/HBase-1.4/jdk=JDK_1_7,label=Hadoop&&!H13/ws/hbase-server/target/surefire/surefirebooter1561246693458725011.jar>
<https://builds.apache.org/job/HBase-1.4/jdk=JDK_1_7,label=Hadoop&&!H13/ws/hbase-server/target/surefire>
2017-10-21T01-59-26_413-jvmRun3 surefire8935894667743838744tmp surefire_11367357274034896219069tmp
[ERROR] Error occurred in starting fork, check output in log
[ERROR] Process Exit Code: 1
[ERROR] ExecutionException The forked VM terminated without properly saying goodbye. VM crash
or System.exit called?
[ERROR] Command was /bin/sh -c cd <https://builds.apache.org/job/HBase-1.4/jdk=JDK_1_7,label=Hadoop&&!H13/ws/hbase-server>
&& /usr/local/asfpackages/java/jdk1.7.0_80/jre/bin/java -enableassertions -Dhbase.test
-Xmx2800m -XX:MaxPermSize=512m -Djava.security.egd=file:/dev/./urandom -Djava.net.preferIPv4Stack=true
-Djava.awt.headless=true -jar <https://builds.apache.org/job/HBase-1.4/jdk=JDK_1_7,label=Hadoop&&!H13/ws/hbase-server/target/surefire/surefirebooter4255144215314917103.jar>
<https://builds.apache.org/job/HBase-1.4/jdk=JDK_1_7,label=Hadoop&&!H13/ws/hbase-server/target/surefire>
2017-10-21T01-59-26_413-jvmRun4 surefire1542740735603667991tmp surefire_11371417139399650670002tmp
[ERROR] Error occurred in starting fork, check output in log
[ERROR] Process Exit Code: 1
[ERROR] at org.apache.maven.plugin.surefire.booterclient.ForkStarter.awaitResultsDone(ForkStarter.java:496)
[ERROR] at org.apache.maven.plugin.surefire.booterclient.ForkStarter.runSuitesForkPerTestSet(ForkStarter.java:443)
[ERROR] at org.apache.maven.plugin.surefire.booterclient.ForkStarter.run(ForkStarter.java:295)
[ERROR] at org.apache.maven.plugin.surefire.booterclient.ForkStarter.run(ForkStarter.java:246)
[ERROR] at org.apache.maven.plugin.surefire.AbstractSurefireMojo.executeProvider(AbstractSurefireMojo.java:1124)
[ERROR] at org.apache.maven.plugin.surefire.AbstractSurefireMojo.executeAfterPreconditionsChecked(AbstractSurefireMojo.java:954)
[ERROR] at org.apache.maven.plugin.surefire.AbstractSurefireMojo.execute(AbstractSurefireMojo.java:832)
[ERROR] at org.apache.maven.plugin.DefaultBuildPluginManager.executeMojo(DefaultBuildPluginManager.java:101)
[ERROR] at org.apache.maven.lifecycle.internal.MojoExecutor.execute(MojoExecutor.java:209)
[ERROR] at org.apache.maven.lifecycle.internal.MojoExecutor.execute(MojoExecutor.java:153)
[ERROR] at org.apache.maven.lifecycle.internal.MojoExecutor.execute(MojoExecutor.java:145)
[ERROR] at org.apache.maven.lifecycle.internal.LifecycleModuleBuilder.buildProject(LifecycleModuleBuilder.java:84)
[ERROR] at org.apache.maven.lifecycle.internal.LifecycleModuleBuilder.buildProject(LifecycleModuleBuilder.java:59)
[ERROR] at org.apache.maven.lifecycle.internal.LifecycleStarter.singleThreadedBuild(LifecycleStarter.java:183)
[ERROR] at org.apache.maven.lifecycle.internal.LifecycleStarter.execute(LifecycleStarter.java:161)
[ERROR] at org.apache.maven.DefaultMaven.doExecute(DefaultMaven.java:320)
[ERROR] at org.apache.maven.DefaultMaven.execute(DefaultMaven.java:156)
[ERROR] at org.apache.maven.cli.MavenCli.execute(MavenCli.java:537)
[ERROR] at org.apache.maven.cli.MavenCli.doMain(MavenCli.java:196)
[ERROR] at org.apache.maven.cli.MavenCli.main(MavenCli.java:141)
[ERROR] at sun.reflect.NativeMethodAccessorImpl.invoke0(Native Method)
[ERROR] at sun.reflect.NativeMethodAccessorImpl.invoke(NativeMethodAccessorImpl.java:57)
[ERROR] at sun.reflect.DelegatingMethodAccessorImpl.invoke(DelegatingMethodAccessorImpl.java:43)
[ERROR] at java.lang.reflect.Method.invoke(Method.java:606)
[ERROR] at org.codehaus.plexus.classworlds.launcher.Launcher.launchEnhanced(Launcher.java:290)
[ERROR] at org.codehaus.plexus.classworlds.launcher.Launcher.launch(Launcher.java:230)
[ERROR] at org.codehaus.plexus.classworlds.launcher.Launcher.mainWithExitCode(Launcher.java:409)
[ERROR] at org.codehaus.plexus.classworlds.launcher.Launcher.main(Launcher.java:352)
[ERROR] Caused by: org.apache.maven.surefire.booter.SurefireBooterForkException: The forked
VM terminated without properly saying goodbye. VM crash or System.exit called?
[ERROR] Command was /bin/sh -c cd <https://builds.apache.org/job/HBase-1.4/jdk=JDK_1_7,label=Hadoop&&!H13/ws/hbase-server>
&& /usr/local/asfpackages/java/jdk1.7.0_80/jre/bin/java -enableassertions -Dhbase.test
-Xmx2800m -XX:MaxPermSize=512m -Djava.security.egd=file:/dev/./urandom -Djava.net.preferIPv4Stack=true
-Djava.awt.headless=true -jar <https://builds.apache.org/job/HBase-1.4/jdk=JDK_1_7,label=Hadoop&&!H13/ws/hbase-server/target/surefire/surefirebooter4255144215314917103.jar>
<https://builds.apache.org/job/HBase-1.4/jdk=JDK_1_7,label=Hadoop&&!H13/ws/hbase-server/target/surefire>
2017-10-21T01-59-26_413-jvmRun4 surefire1542740735603667991tmp surefire_11371417139399650670002tmp
[ERROR] Error occurred in starting fork, check output in log
[ERROR] Process Exit Code: 1
[ERROR] at org.apache.maven.plugin.surefire.booterclient.ForkStarter.fork(ForkStarter.java:686)
[ERROR] at org.apache.maven.plugin.surefire.booterclient.ForkStarter.fork(ForkStarter.java:535)
[ERROR] at org.apache.maven.plugin.surefire.booterclient.ForkStarter.access$700(ForkStarter.java:116)
[ERROR] at org.apache.maven.plugin.surefire.booterclient.ForkStarter$2.call(ForkStarter.java:431)
[ERROR] at org.apache.maven.plugin.surefire.booterclient.ForkStarter$2.call(ForkStarter.java:408)
[ERROR] at java.util.concurrent.FutureTask.run(FutureTask.java:262)
[ERROR] at java.util.concurrent.ThreadPoolExecutor.runWorker(ThreadPoolExecutor.java:1145)
[ERROR] at java.util.concurrent.ThreadPoolExecutor$Worker.run(ThreadPoolExecutor.java:615)
[ERROR] at java.lang.Thread.run(Thread.java:745)
[ERROR] -> [Help 1]
[ERROR] 
[ERROR] To see the full stack trace of the errors, re-run Maven with the -e switch.
[ERROR] Re-run Maven using the -X switch to enable full debug logging.
[ERROR] 
[ERROR] For more information about the errors and possible solutions, please read the following
articles:
[ERROR] [Help 1] http://cwiki.apache.org/confluence/display/MAVEN/MojoExecutionException
[ERROR] 
[ERROR] After correcting the problems, you can resume the build with the command
[ERROR]   mvn <goals> -rf :hbase-server
Build step 'Invoke top-level Maven targets' marked build as failure
Performing Post build task...
Match found for :.* : True
Logical operation result is TRUE
Running script  : # Post-build task script. TODO: Check this in and have all builds reference
check-in.
pwd && ls
# NOTE!!!! The below code has been copied and pasted from ./dev-tools/run-test.sh
# Do not change here without syncing there and vice-versa.
ZOMBIE_TESTS_COUNT=`jps -v | grep surefirebooter | grep -e '-Dhbase.test' | wc -l`
if [[ $ZOMBIE_TESTS_COUNT != 0 ]] ; then
 echo "Suspicious java process found - waiting 30s to see if there are just slow to stop"
 sleep 30
 ZOMBIE_TESTS_COUNT=`jps -v | grep surefirebooter | grep -e '-Dhbase.test' | wc -l`
 if [[ $ZOMBIE_TESTS_COUNT != 0 ]] ; then
   echo " {color:red}There appear to be $ZOMBIE_TESTS_COUNT zombie tests{color}, they should
have been killed by surefire but survived"
   jps -v | grep surefirebooter | grep -e '-Dhbase.test'
   jps -v | grep surefirebooter | grep -e '-Dhbase.test' | cut -d ' ' -f 1 | xargs -n 1 jstack
   # Exit with error
   exit 1
 else
   echo "We're ok: there is no zombie test, but some tests took some time to stop"
 fi
else
  echo "We're ok: there is no zombie test"
fi
Setting JDK_1_7_LATEST__HOME=/home/jenkins/tools/java/latest1.7
Setting JDK_1_8_LATEST__HOME=/home/jenkins/tools/java/latest1.8
[19ccb43d] $ /bin/bash -xe /tmp/jenkins6110452939663426284.sh
+ pwd
<https://builds.apache.org/job/HBase-1.4/jdk=JDK_1_7,label=Hadoop&&!H13/ws/>
+ ls
bin
CHANGES.txt
conf
dev-support
extra_env_var
hbase-annotations
hbase-archetypes
hbase-assembly
hbase-checkstyle
hbase-client
hbase-common
hbase-examples
hbase-external-blockcache
hbase-hadoop2-compat
hbase-hadoop-compat
hbase-it
hbase-metrics
hbase-metrics-api
hbase-native-client
hbase-prefix-tree
hbase-procedure
hbase-protocol
hbase-resource-bundle
hbase-rest
hbase-server
hbase-shaded
hbase-shell
hbase-testing-util
hbase-thrift
LICENSE.txt
NOTICE.txt
pom.xml
README.txt
src
target
++ wc -l
++ grep -e -Dhbase.test
++ grep surefirebooter
++ jps -v
+ ZOMBIE_TESTS_COUNT=0
+ [[ 0 != 0 ]]
+ echo 'We'\''re ok: there is no zombie test'
We're ok: there is no zombie test
POST BUILD TASK : SUCCESS
END OF POST BUILD TASK : 0
Archiving artifacts
Setting JDK_1_7_LATEST__HOME=/home/jenkins/tools/java/latest1.7
Setting JDK_1_8_LATEST__HOME=/home/jenkins/tools/java/latest1.8
Recording test results
Setting JDK_1_7_LATEST__HOME=/home/jenkins/tools/java/latest1.7
Setting JDK_1_8_LATEST__HOME=/home/jenkins/tools/java/latest1.8
Setting JDK_1_7_LATEST__HOME=/home/jenkins/tools/java/latest1.7
Setting JDK_1_8_LATEST__HOME=/home/jenkins/tools/java/latest1.8

Mime
View raw message