hbase-builds mailing list archives

Site index · List index
Message view « Date » · « Thread »
Top « Date » · « Thread »
From Apache Jenkins Server <jenk...@builds.apache.org>
Subject Build failed in Jenkins: HBase-1.5 » JDK_1_8,Hadoop&&!H13 #106
Date Sat, 21 Oct 2017 07:30:13 GMT
See <https://builds.apache.org/job/HBase-1.5/jdk=JDK_1_8,label=Hadoop&&!H13/106/display/redirect?page=changes>

Changes:

[busbey] HBASE-19060 precommit plugin test 'hadoopcheck' should only run when

[busbey] HBASE-19039 refactor shadedjars test to only run on java changes.

[busbey] HBASE-19058. The wget isn't installed in building docker image

------------------------------------------
[...truncated 2.46 MB...]
[INFO] Tests run: 1, Failures: 0, Errors: 0, Skipped: 0, Time elapsed: 0.519 s - in org.apache.hadoop.hbase.util.TestDefaultEnvironmentEdge
[INFO] Tests run: 1, Failures: 0, Errors: 0, Skipped: 0, Time elapsed: 24.889 s - in org.apache.hadoop.hbase.util.TestConnectionCache
[INFO] Running org.apache.hadoop.hbase.wal.TestWALFiltering
[INFO] Tests run: 4, Failures: 0, Errors: 0, Skipped: 0, Time elapsed: 79.45 s - in org.apache.hadoop.hbase.util.TestMiniClusterLoadParallel
[INFO] Running org.apache.hadoop.hbase.util.TestRegionSplitter
[INFO] Tests run: 14, Failures: 0, Errors: 0, Skipped: 0, Time elapsed: 22.707 s - in org.apache.hadoop.hbase.util.TestFSUtils
[INFO] Tests run: 6, Failures: 0, Errors: 0, Skipped: 0, Time elapsed: 11.631 s - in org.apache.hadoop.hbase.util.TestRegionSplitter
[INFO] Running org.apache.hadoop.hbase.wal.TestWALRootDir
[INFO] Tests run: 1, Failures: 0, Errors: 0, Skipped: 0, Time elapsed: 1.158 s - in org.apache.hadoop.hbase.wal.TestWALRootDir
[INFO] Running org.apache.hadoop.hbase.wal.TestWALOpenAfterDNRollingStart
[INFO] Running org.apache.hadoop.hbase.wal.TestDefaultWALProviderWithHLogKey
[INFO] Running org.apache.hadoop.hbase.wal.TestBoundedRegionGroupingStrategy
[INFO] Tests run: 5, Failures: 0, Errors: 0, Skipped: 0, Time elapsed: 13.268 s - in org.apache.hadoop.hbase.wal.TestDefaultWALProviderWithHLogKey
[INFO] Running org.apache.hadoop.hbase.wal.TestWALReaderOnSecureWAL
[INFO] Tests run: 1, Failures: 0, Errors: 0, Skipped: 0, Time elapsed: 39.097 s - in org.apache.hadoop.hbase.wal.TestWALFiltering
[INFO] Tests run: 2, Failures: 0, Errors: 0, Skipped: 0, Time elapsed: 2.694 s - in org.apache.hadoop.hbase.wal.TestWALReaderOnSecureWAL
[INFO] Running org.apache.hadoop.hbase.wal.TestSecureWAL
[INFO] Tests run: 1, Failures: 0, Errors: 0, Skipped: 0, Time elapsed: 2.872 s - in org.apache.hadoop.hbase.wal.TestSecureWAL
[INFO] Running org.apache.hadoop.hbase.wal.TestWALSplit
[INFO] Tests run: 5, Failures: 0, Errors: 0, Skipped: 0, Time elapsed: 32.701 s - in org.apache.hadoop.hbase.wal.TestBoundedRegionGroupingStrategy
[INFO] Running org.apache.hadoop.hbase.wal.TestWALSplitCompressed
[INFO] Running org.apache.hadoop.hbase.wal.TestDefaultWALProvider
[INFO] Tests run: 1, Failures: 0, Errors: 0, Skipped: 0, Time elapsed: 47.282 s - in org.apache.hadoop.hbase.wal.TestWALOpenAfterDNRollingStart
[INFO] Tests run: 5, Failures: 0, Errors: 0, Skipped: 0, Time elapsed: 11.413 s - in org.apache.hadoop.hbase.wal.TestDefaultWALProvider
[INFO] Running org.apache.hadoop.hbase.wal.TestWALFactory
[INFO] Running org.apache.hadoop.hbase.namespace.TestNamespaceAuditor
[INFO] Tests run: 9, Failures: 0, Errors: 0, Skipped: 0, Time elapsed: 20.2 s - in org.apache.hadoop.hbase.wal.TestWALFactory
[INFO] Running org.apache.hadoop.hbase.constraint.TestConstraint
[INFO] Tests run: 5, Failures: 0, Errors: 0, Skipped: 0, Time elapsed: 24.348 s - in org.apache.hadoop.hbase.constraint.TestConstraint
[INFO] Tests run: 33, Failures: 0, Errors: 0, Skipped: 0, Time elapsed: 103.462 s - in org.apache.hadoop.hbase.wal.TestWALSplit
[INFO] Running org.apache.hadoop.hbase.TestNamespace
[INFO] Tests run: 33, Failures: 0, Errors: 0, Skipped: 0, Time elapsed: 102.323 s - in org.apache.hadoop.hbase.wal.TestWALSplitCompressed
[INFO] Running org.apache.hadoop.hbase.TestRegionRebalancing
[INFO] Running org.apache.hadoop.hbase.TestInfoServers
[INFO] Tests run: 3, Failures: 0, Errors: 0, Skipped: 0, Time elapsed: 4.807 s - in org.apache.hadoop.hbase.TestInfoServers
[INFO] Running org.apache.hadoop.hbase.filter.TestMultiRowRangeFilter
[INFO] Tests run: 9, Failures: 0, Errors: 0, Skipped: 0, Time elapsed: 41.715 s - in org.apache.hadoop.hbase.TestNamespace
[WARNING] Tests run: 12, Failures: 0, Errors: 0, Skipped: 1, Time elapsed: 120.776 s - in
org.apache.hadoop.hbase.namespace.TestNamespaceAuditor
[INFO] Running org.apache.hadoop.hbase.filter.TestScanRowPrefix
[INFO] Tests run: 1, Failures: 0, Errors: 0, Skipped: 0, Time elapsed: 7.101 s - in org.apache.hadoop.hbase.filter.TestScanRowPrefix
[INFO] Tests run: 21, Failures: 0, Errors: 0, Skipped: 0, Time elapsed: 24.982 s - in org.apache.hadoop.hbase.filter.TestMultiRowRangeFilter
[INFO] Tests run: 2, Failures: 0, Errors: 0, Skipped: 0, Time elapsed: 65.849 s - in org.apache.hadoop.hbase.TestRegionRebalancing
[INFO] Running org.apache.hadoop.hbase.filter.TestFilterWrapper
[INFO] Running org.apache.hadoop.hbase.filter.TestFilterListOnMini
[INFO] Running org.apache.hadoop.hbase.filter.TestFuzzyRowFilterEndToEnd
[INFO] Tests run: 1, Failures: 0, Errors: 0, Skipped: 0, Time elapsed: 6.28 s - in org.apache.hadoop.hbase.filter.TestFilterWrapper
[INFO] Tests run: 1, Failures: 0, Errors: 0, Skipped: 0, Time elapsed: 3.326 s - in org.apache.hadoop.hbase.filter.TestFilterListOnMini
[INFO] Running org.apache.hadoop.hbase.filter.TestFuzzyRowAndColumnRangeFilter
[INFO] Tests run: 1, Failures: 0, Errors: 0, Skipped: 0, Time elapsed: 5.07 s - in org.apache.hadoop.hbase.filter.TestFuzzyRowAndColumnRangeFilter
[INFO] Running org.apache.hadoop.hbase.filter.TestColumnRangeFilter
[INFO] Running org.apache.hadoop.hbase.filter.TestFilterWithScanLimits
[INFO] Tests run: 1, Failures: 0, Errors: 0, Skipped: 0, Time elapsed: 5.335 s - in org.apache.hadoop.hbase.filter.TestFilterWithScanLimits
[INFO] Tests run: 1, Failures: 0, Errors: 0, Skipped: 0, Time elapsed: 10.672 s - in org.apache.hadoop.hbase.filter.TestColumnRangeFilter
[INFO] Running org.apache.hadoop.hbase.filter.TestFilterListOrOperatorWithBlkCnt
[INFO] Running org.apache.hadoop.hbase.io.TestFileLink
[INFO] Running org.apache.hadoop.hbase.io.hfile.TestScannerSelectionUsingTTL
[INFO] Tests run: 1, Failures: 0, Errors: 0, Skipped: 0, Time elapsed: 15.103 s - in org.apache.hadoop.hbase.filter.TestFilterListOrOperatorWithBlkCnt
[INFO] Running org.apache.hadoop.hbase.io.hfile.TestCacheConfig
[INFO] Tests run: 7, Failures: 0, Errors: 0, Skipped: 0, Time elapsed: 2.22 s - in org.apache.hadoop.hbase.io.hfile.TestCacheConfig
[INFO] Running org.apache.hadoop.hbase.io.hfile.TestHFileSeek
[INFO] Tests run: 6, Failures: 0, Errors: 0, Skipped: 0, Time elapsed: 18.921 s - in org.apache.hadoop.hbase.io.TestFileLink
[INFO] Tests run: 1, Failures: 0, Errors: 0, Skipped: 0, Time elapsed: 2.375 s - in org.apache.hadoop.hbase.io.hfile.TestHFileSeek
[INFO] Running org.apache.hadoop.hbase.io.hfile.TestSeekBeforeWithInlineBlocks
[INFO] Running org.apache.hadoop.hbase.io.hfile.TestForceCacheImportantBlocks
[INFO] Tests run: 1, Failures: 0, Errors: 0, Skipped: 0, Time elapsed: 15.17 s - in org.apache.hadoop.hbase.io.hfile.TestSeekBeforeWithInlineBlocks
[INFO] Running org.apache.hadoop.hbase.io.hfile.TestCacheOnWrite
[INFO] Tests run: 6, Failures: 0, Errors: 0, Skipped: 0, Time elapsed: 64.688 s - in org.apache.hadoop.hbase.io.hfile.TestScannerSelectionUsingTTL
[INFO] Tests run: 4, Failures: 0, Errors: 0, Skipped: 0, Time elapsed: 46.384 s - in org.apache.hadoop.hbase.io.hfile.TestForceCacheImportantBlocks
[INFO] Running org.apache.hadoop.hbase.io.hfile.TestHFileBlock
[INFO] Running org.apache.hadoop.hbase.io.hfile.TestHFileBlockIndex
[INFO] Tests run: 16, Failures: 0, Errors: 0, Skipped: 0, Time elapsed: 8.371 s - in org.apache.hadoop.hbase.io.hfile.TestHFileBlockIndex
[ERROR] Tests run: 59, Failures: 1, Errors: 0, Skipped: 1, Time elapsed: 435.293 s <<<
FAILURE! - in org.apache.hadoop.hbase.util.TestHBaseFsck
[ERROR] testHbckReportReplicaLingeringSplitParent(org.apache.hadoop.hbase.util.TestHBaseFsck)
 Time elapsed: 6.469 s  <<< FAILURE!
java.lang.AssertionError: expected:<[]> but was:<[NOT_DEPLOYED, HOLE_IN_REGION_CHAIN]>
	at org.apache.hadoop.hbase.util.TestHBaseFsck.testHbckReportReplicaLingeringSplitParent(TestHBaseFsck.java:230)

[INFO] Running org.apache.hadoop.hbase.io.encoding.TestLoadAndSwitchEncodeOnDisk
[INFO] Tests run: 1, Failures: 0, Errors: 0, Skipped: 0, Time elapsed: 452.411 s - in org.apache.hadoop.hbase.util.TestHBaseFsck
[INFO] Running org.apache.hadoop.hbase.io.encoding.TestBufferedDataBlockEncoder
[INFO] Tests run: 1, Failures: 0, Errors: 0, Skipped: 0, Time elapsed: 20.751 s - in org.apache.hadoop.hbase.io.encoding.TestBufferedDataBlockEncoder
[INFO] Running org.apache.hadoop.hbase.io.encoding.TestEncodedSeekers
[INFO] Tests run: 1, Failures: 0, Errors: 0, Skipped: 0, Time elapsed: 41.582 s - in org.apache.hadoop.hbase.io.encoding.TestLoadAndSwitchEncodeOnDisk
[INFO] Running org.apache.hadoop.hbase.io.encoding.TestDataBlockEncoders
[INFO] Tests run: 28, Failures: 0, Errors: 0, Skipped: 0, Time elapsed: 95.738 s - in org.apache.hadoop.hbase.io.hfile.TestHFileBlock
[INFO] Running org.apache.hadoop.hbase.io.encoding.TestChangingEncoding
[INFO] Tests run: 28, Failures: 0, Errors: 0, Skipped: 0, Time elapsed: 37.256 s - in org.apache.hadoop.hbase.io.encoding.TestDataBlockEncoders
[INFO] Running org.apache.hadoop.hbase.TestClusterBootOrder
[INFO] Tests run: 4, Failures: 0, Errors: 0, Skipped: 0, Time elapsed: 240.766 s - in org.apache.hadoop.hbase.filter.TestFuzzyRowFilterEndToEnd
[INFO] Tests run: 72, Failures: 0, Errors: 0, Skipped: 0, Time elapsed: 171.331 s - in org.apache.hadoop.hbase.io.hfile.TestCacheOnWrite
[INFO] Tests run: 2, Failures: 0, Errors: 0, Skipped: 0, Time elapsed: 36.496 s - in org.apache.hadoop.hbase.TestClusterBootOrder
[INFO] Tests run: 24, Failures: 0, Errors: 0, Skipped: 0, Time elapsed: 121.158 s - in org.apache.hadoop.hbase.io.encoding.TestEncodedSeekers
[INFO] Tests run: 3, Failures: 0, Errors: 0, Skipped: 0, Time elapsed: 167.936 s - in org.apache.hadoop.hbase.io.encoding.TestChangingEncoding
[INFO] 
[INFO] Results:
[INFO] 
[ERROR] Failures: 
[ERROR]   TestStochasticLoadBalancer2.testRegionReplicasOnMidClusterHighReplication:78->BalancerTestBase.testWithCluster:426->BalancerTestBase.testWithCluster:454->BalancerTestBase.assertRegionReplicaPlacement:229
Two or more region replicas are hosted on the same host after balance
[ERROR] Errors: 
[ERROR]   TestMasterBalanceThrottling.testThrottlingByMaxRitPercent:105 » TestTimedOut t...
[WARNING] Flakes: 
[WARNING] org.apache.hadoop.hbase.client.TestReplicasClient.testCancelOfMultiGet(org.apache.hadoop.hbase.client.TestReplicasClient)
[ERROR]   Run 1: TestReplicasClient.testCancelOfMultiGet:674
[INFO]   Run 2: PASS
[INFO] 
[WARNING] org.apache.hadoop.hbase.util.TestHBaseFsck.testHbckReportReplicaLingeringSplitParent(org.apache.hadoop.hbase.util.TestHBaseFsck)
[ERROR]   Run 1: TestHBaseFsck.testHbckReportReplicaLingeringSplitParent:230 expected:<[]>
but was:<[NOT_DEPLOYED, HOLE_IN_REGION_CHAIN]>
[INFO]   Run 2: PASS
[INFO] 
[INFO] 
[ERROR] Tests run: 2859, Failures: 1, Errors: 1, Skipped: 60, Flakes: 2
[INFO] 
[INFO] ------------------------------------------------------------------------
[INFO] Reactor Summary:
[INFO] 
[INFO] Apache HBase ...................................... SUCCESS [1:56.415s]
[INFO] Apache HBase - Checkstyle ......................... SUCCESS [16.040s]
[INFO] Apache HBase - Resource Bundle .................... SUCCESS [0.287s]
[INFO] Apache HBase - Annotations ........................ SUCCESS [2.911s]
[INFO] Apache HBase - Protocol ........................... SUCCESS [29.782s]
[INFO] Apache HBase - Common ............................. SUCCESS [3:55.148s]
[INFO] Apache HBase - Procedure .......................... SUCCESS [4:36.831s]
[INFO] Apache HBase - Metrics API ........................ SUCCESS [2.947s]
[INFO] Apache HBase - Hadoop Compatibility ............... SUCCESS [19.701s]
[INFO] Apache HBase - Metrics Implementation ............. SUCCESS [11.784s]
[INFO] Apache HBase - Hadoop Two Compatibility ........... SUCCESS [31.853s]
[INFO] Apache HBase - Client ............................. SUCCESS [2:21.145s]
[INFO] Apache HBase - Prefix Tree ........................ SUCCESS [19.789s]
[INFO] Apache HBase - Server ............................. FAILURE [2:18:48.156s]
[INFO] Apache HBase - Testing Util ....................... SKIPPED
[INFO] Apache HBase - Thrift ............................. SKIPPED
[INFO] Apache HBase - Rest ............................... SKIPPED
[INFO] Apache HBase - Shell .............................. SKIPPED
[INFO] Apache HBase - Integration Tests .................. SKIPPED
[INFO] Apache HBase - Examples ........................... SKIPPED
[INFO] Apache HBase - External Block Cache ............... SKIPPED
[INFO] Apache HBase - Assembly ........................... SKIPPED
[INFO] Apache HBase - Shaded ............................. SKIPPED
[INFO] Apache HBase - Shaded - Client .................... SKIPPED
[INFO] Apache HBase - Shaded - Server .................... SKIPPED
[INFO] Apache HBase Shaded Packaging Invariants .......... SKIPPED
[INFO] Apache HBase - Archetypes ......................... SKIPPED
[INFO] Apache HBase - Exemplar for hbase-client archetype  SKIPPED
[INFO] Apache HBase - Exemplar for hbase-shaded-client archetype  SKIPPED
[INFO] Apache HBase - Archetype builder .................. SKIPPED
[INFO] ------------------------------------------------------------------------
[INFO] BUILD FAILURE
[INFO] ------------------------------------------------------------------------
[INFO] Total time: 2:34:27.736s
[INFO] Finished at: Sat Oct 21 07:24:37 UTC 2017
[INFO] Final Memory: 104M/1666M
[INFO] ------------------------------------------------------------------------
[ERROR] Failed to execute goal org.apache.maven.plugins:maven-surefire-plugin:2.20.1:test
(secondPartTestsExecution) on project hbase-server: There are test failures.
[ERROR] 
[ERROR] Please refer to <https://builds.apache.org/job/HBase-1.5/jdk=JDK_1_8,label=Hadoop&&!H13/ws/hbase-server/target/surefire-reports>
for the individual test results.
[ERROR] Please refer to dump files (if any exist) [date]-jvmRun[N].dump, [date].dumpstream
and [date]-jvmRun[N].dumpstream.
[ERROR] -> [Help 1]
[ERROR] 
[ERROR] To see the full stack trace of the errors, re-run Maven with the -e switch.
[ERROR] Re-run Maven using the -X switch to enable full debug logging.
[ERROR] 
[ERROR] For more information about the errors and possible solutions, please read the following
articles:
[ERROR] [Help 1] http://cwiki.apache.org/confluence/display/MAVEN/MojoFailureException
[ERROR] 
[ERROR] After correcting the problems, you can resume the build with the command
[ERROR]   mvn <goals> -rf :hbase-server
Build step 'Invoke top-level Maven targets' marked build as failure
Performing Post build task...
Match found for :.* : True
Logical operation result is TRUE
Running script  : # Post-build task script. TODO: Check this in and have all builds reference
check-in.
pwd && ls
# NOTE!!!! The below code has been copied and pasted from ./dev-tools/run-test.sh
# Do not change here without syncing there and vice-versa.
ZOMBIE_TESTS_COUNT=`jps -v | grep surefirebooter | grep -e '-Dhbase.test' | wc -l`
if [[ $ZOMBIE_TESTS_COUNT != 0 ]] ; then
 echo "Suspicious java process found - waiting 30s to see if there are just slow to stop"
 sleep 30
 ZOMBIE_TESTS_COUNT=`jps -v | grep surefirebooter | grep -e '-Dhbase.test' | wc -l`
 if [[ $ZOMBIE_TESTS_COUNT != 0 ]] ; then
   echo " {color:red}There appear to be $ZOMBIE_TESTS_COUNT zombie tests{color}, they should
have been killed by surefire but survived"
   jps -v | grep surefirebooter | grep -e '-Dhbase.test'
   jps -v | grep surefirebooter | grep -e '-Dhbase.test' | cut -d ' ' -f 1 | xargs -n 1 jstack
   # Exit with error
   exit 1
 else
   echo "We're ok: there is no zombie test, but some tests took some time to stop"
 fi
else
  echo "We're ok: there is no zombie test"
fi
Setting JDK_1_7_LATEST__HOME=/home/jenkins/tools/java/latest1.7
Setting JDK_1_8_LATEST__HOME=/home/jenkins/tools/java/latest1.8
[30b16b4c] $ /bin/bash -xe /tmp/jenkins8693327076606577567.sh
+ pwd
<https://builds.apache.org/job/HBase-1.5/jdk=JDK_1_8,label=Hadoop&&!H13/ws/>
+ ls
bin
CHANGES.txt
conf
dev-support
extra_env_var
hbase-annotations
hbase-archetypes
hbase-assembly
hbase-checkstyle
hbase-client
hbase-common
hbase-examples
hbase-external-blockcache
hbase-hadoop2-compat
hbase-hadoop-compat
hbase-it
hbase-metrics
hbase-metrics-api
hbase-native-client
hbase-prefix-tree
hbase-procedure
hbase-protocol
hbase-resource-bundle
hbase-rest
hbase-server
hbase-shaded
hbase-shell
hbase-testing-util
hbase-thrift
LICENSE.txt
NOTICE.txt
pom.xml
README.txt
src
target
++ jps -v
++ grep surefirebooter
++ grep -e -Dhbase.test
++ wc -l
+ ZOMBIE_TESTS_COUNT=0
+ [[ 0 != 0 ]]
+ echo 'We'\''re ok: there is no zombie test'
We're ok: there is no zombie test
POST BUILD TASK : SUCCESS
END OF POST BUILD TASK : 0
Archiving artifacts
Setting JDK_1_7_LATEST__HOME=/home/jenkins/tools/java/latest1.7
Setting JDK_1_8_LATEST__HOME=/home/jenkins/tools/java/latest1.8
Recording test results
Setting JDK_1_7_LATEST__HOME=/home/jenkins/tools/java/latest1.7
Setting JDK_1_8_LATEST__HOME=/home/jenkins/tools/java/latest1.8
Setting JDK_1_7_LATEST__HOME=/home/jenkins/tools/java/latest1.7
Setting JDK_1_8_LATEST__HOME=/home/jenkins/tools/java/latest1.8

Mime
View raw message