hbase-builds mailing list archives

Site index · List index
Message view « Date » · « Thread »
Top « Date » · « Thread »
From Apache Jenkins Server <jenk...@builds.apache.org>
Subject Build failed in Jenkins: HBase-1.4 » JDK_1_7,Hadoop&&!H13 #966
Date Mon, 23 Oct 2017 18:09:24 GMT
See <https://builds.apache.org/job/HBase-1.4/jdk=JDK_1_7,label=Hadoop&&!H13/966/display/redirect?page=changes>

Changes:

[tedyu] HBASE-19052 FixedFileTrailer should recognize CellComparatorImpl class

------------------------------------------
[...truncated 2.40 MB...]
[INFO] Tests run: 6, Failures: 0, Errors: 0, Skipped: 0, Time elapsed: 39.257 s - in org.apache.hadoop.hbase.io.TestFileLink
[INFO] Tests run: 28, Failures: 0, Errors: 0, Skipped: 0, Time elapsed: 106.736 s - in org.apache.hadoop.hbase.io.hfile.TestHFileBlock
[INFO] Running org.apache.hadoop.hbase.constraint.TestConstraint
[INFO] Tests run: 4, Failures: 0, Errors: 0, Skipped: 0, Time elapsed: 85.773 s - in org.apache.hadoop.hbase.io.hfile.TestForceCacheImportantBlocks
[INFO] Running org.apache.hadoop.hbase.filter.TestColumnRangeFilter
[INFO] Tests run: 72, Failures: 0, Errors: 0, Skipped: 0, Time elapsed: 260.96 s - in org.apache.hadoop.hbase.io.hfile.TestCacheOnWrite
[INFO] Running org.apache.hadoop.hbase.filter.TestFuzzyRowAndColumnRangeFilter
[INFO] Tests run: 1, Failures: 0, Errors: 0, Skipped: 0, Time elapsed: 6.541 s - in org.apache.hadoop.hbase.filter.TestFuzzyRowAndColumnRangeFilter
[INFO] Tests run: 5, Failures: 0, Errors: 0, Skipped: 0, Time elapsed: 29.818 s - in org.apache.hadoop.hbase.constraint.TestConstraint
[INFO] Tests run: 1, Failures: 0, Errors: 0, Skipped: 0, Time elapsed: 14.874 s - in org.apache.hadoop.hbase.filter.TestColumnRangeFilter
[INFO] Running org.apache.hadoop.hbase.filter.TestFuzzyRowFilterEndToEnd
[INFO] Running org.apache.hadoop.hbase.filter.TestMultiRowRangeFilter
[INFO] Running org.apache.hadoop.hbase.filter.TestFilterWithScanLimits
[INFO] Running org.apache.hadoop.hbase.filter.TestFilterListOnMini
[INFO] Tests run: 1, Failures: 0, Errors: 0, Skipped: 0, Time elapsed: 7.049 s - in org.apache.hadoop.hbase.filter.TestFilterWithScanLimits
[INFO] Tests run: 1, Failures: 0, Errors: 0, Skipped: 0, Time elapsed: 4.728 s - in org.apache.hadoop.hbase.filter.TestFilterListOnMini
[INFO] Running org.apache.hadoop.hbase.filter.TestScanRowPrefix
[INFO] Tests run: 1, Failures: 0, Errors: 0, Skipped: 0, Time elapsed: 9.362 s - in org.apache.hadoop.hbase.filter.TestScanRowPrefix
[INFO] Running org.apache.hadoop.hbase.TestGlobalMemStoreSize
[INFO] Tests run: 21, Failures: 0, Errors: 0, Skipped: 0, Time elapsed: 42.118 s - in org.apache.hadoop.hbase.filter.TestMultiRowRangeFilter
[INFO] Running org.apache.hadoop.hbase.filter.TestFilterListOrOperatorWithBlkCnt
[INFO] Running org.apache.hadoop.hbase.filter.TestFilterWrapper
[INFO] Running org.apache.hadoop.hbase.TestHBaseOnOtherDfsCluster
[INFO] Tests run: 1, Failures: 0, Errors: 0, Skipped: 0, Time elapsed: 6.567 s - in org.apache.hadoop.hbase.filter.TestFilterWrapper
[INFO] Tests run: 1, Failures: 0, Errors: 0, Skipped: 0, Time elapsed: 35.373 s - in org.apache.hadoop.hbase.TestGlobalMemStoreSize
[INFO] Running org.apache.hadoop.hbase.tool.TestCanaryTool
[INFO] Tests run: 1, Failures: 0, Errors: 0, Skipped: 0, Time elapsed: 29.053 s - in org.apache.hadoop.hbase.TestHBaseOnOtherDfsCluster
[INFO] Tests run: 1, Failures: 0, Errors: 0, Skipped: 0, Time elapsed: 30.88 s - in org.apache.hadoop.hbase.filter.TestFilterListOrOperatorWithBlkCnt
[INFO] Running org.apache.hadoop.hbase.TestNamespace
[INFO] Running org.apache.hadoop.hbase.replication.TestReplicationSource
[INFO] Running org.apache.hadoop.hbase.replication.TestReplicationWithTags
[INFO] Tests run: 9, Failures: 0, Errors: 0, Skipped: 0, Time elapsed: 46.723 s - in org.apache.hadoop.hbase.TestNamespace
[INFO] Tests run: 1, Failures: 0, Errors: 0, Skipped: 0, Time elapsed: 6.476 s - in org.apache.hadoop.hbase.replication.TestReplicationWithTags
[INFO] Tests run: 3, Failures: 0, Errors: 0, Skipped: 0, Time elapsed: 50.898 s - in org.apache.hadoop.hbase.replication.TestReplicationSource
[INFO] Running org.apache.hadoop.hbase.replication.TestPerTableCFReplication
[WARNING] Tests run: 7, Failures: 0, Errors: 0, Skipped: 2, Time elapsed: 115.876 s - in org.apache.hadoop.hbase.tool.TestCanaryTool
[INFO] Running org.apache.hadoop.hbase.replication.TestReplicationChangingPeerRegionservers
[INFO] Running org.apache.hadoop.hbase.replication.TestReplicationSmallTests
[INFO] Tests run: 1, Failures: 0, Errors: 0, Skipped: 0, Time elapsed: 11.422 s - in org.apache.hadoop.hbase.replication.TestReplicationChangingPeerRegionservers
[INFO] Running org.apache.hadoop.hbase.replication.TestMultiSlaveReplication
[INFO] Tests run: 3, Failures: 0, Errors: 0, Skipped: 0, Time elapsed: 49.118 s - in org.apache.hadoop.hbase.replication.TestPerTableCFReplication
[INFO] Running org.apache.hadoop.hbase.replication.TestReplicationSyncUpToolWithBulkLoadedData
[INFO] Running org.apache.hadoop.hbase.replication.TestReplicationKillSlaveRS
[INFO] Tests run: 2, Failures: 0, Errors: 0, Skipped: 0, Time elapsed: 106.458 s - in org.apache.hadoop.hbase.replication.TestMultiSlaveReplication
[INFO] Tests run: 1, Failures: 0, Errors: 0, Skipped: 0, Time elapsed: 70.273 s - in org.apache.hadoop.hbase.replication.TestReplicationSyncUpToolWithBulkLoadedData
[INFO] Tests run: 1, Failures: 0, Errors: 0, Skipped: 0, Time elapsed: 26.743 s - in org.apache.hadoop.hbase.replication.TestReplicationKillSlaveRS
[INFO] Running org.apache.hadoop.hbase.replication.TestMasterReplication
[INFO] Tests run: 4, Failures: 0, Errors: 0, Skipped: 0, Time elapsed: 355.112 s - in org.apache.hadoop.hbase.filter.TestFuzzyRowFilterEndToEnd
[INFO] Running org.apache.hadoop.hbase.replication.regionserver.TestReplicationSourceManager
[INFO] Running org.apache.hadoop.hbase.replication.regionserver.TestRegionReplicaReplicationEndpointNoMaster
[INFO] Running org.apache.hadoop.hbase.replication.TestSerialReplication
[INFO] Tests run: 10, Failures: 0, Errors: 0, Skipped: 0, Time elapsed: 47.559 s - in org.apache.hadoop.hbase.replication.regionserver.TestReplicationSourceManager
[INFO] Tests run: 14, Failures: 0, Errors: 0, Skipped: 0, Time elapsed: 192.452 s - in org.apache.hadoop.hbase.replication.TestReplicationSmallTests
[INFO] Running org.apache.hadoop.hbase.replication.regionserver.TestWALEntryStream
[INFO] Running org.apache.hadoop.hbase.replication.regionserver.TestReplicationSink
[INFO] Tests run: 4, Failures: 0, Errors: 0, Skipped: 0, Time elapsed: 85.699 s - in org.apache.hadoop.hbase.replication.regionserver.TestRegionReplicaReplicationEndpointNoMaster
[INFO] Tests run: 6, Failures: 0, Errors: 0, Skipped: 0, Time elapsed: 18.238 s - in org.apache.hadoop.hbase.replication.regionserver.TestReplicationSink
[INFO] Running org.apache.hadoop.hbase.replication.regionserver.TestGlobalThrottler
[INFO] Running org.apache.hadoop.hbase.replication.regionserver.TestReplicator
[INFO] Tests run: 2, Failures: 0, Errors: 0, Skipped: 0, Time elapsed: 24.793 s - in org.apache.hadoop.hbase.replication.regionserver.TestReplicator
[INFO] Running org.apache.hadoop.hbase.replication.regionserver.TestRegionReplicaReplicationEndpoint
[INFO] Tests run: 1, Failures: 0, Errors: 0, Skipped: 0, Time elapsed: 89.327 s - in org.apache.hadoop.hbase.replication.regionserver.TestGlobalThrottler
[INFO] Tests run: 3, Failures: 0, Errors: 0, Skipped: 0, Time elapsed: 207.997 s - in org.apache.hadoop.hbase.replication.TestSerialReplication
[INFO] Running org.apache.hadoop.hbase.replication.multiwal.TestReplicationKillMasterRSCompressedWithMultipleWAL
[INFO] Running org.apache.hadoop.hbase.replication.multiwal.TestReplicationEndpointWithMultipleWAL
[INFO] Tests run: 8, Failures: 0, Errors: 0, Skipped: 0, Time elapsed: 339.756 s - in org.apache.hadoop.hbase.replication.TestMasterReplication
[INFO] Tests run: 7, Failures: 0, Errors: 0, Skipped: 0, Time elapsed: 29.527 s - in org.apache.hadoop.hbase.replication.multiwal.TestReplicationEndpointWithMultipleWAL
[INFO] Tests run: 1, Failures: 0, Errors: 0, Skipped: 0, Time elapsed: 34.959 s - in org.apache.hadoop.hbase.replication.multiwal.TestReplicationKillMasterRSCompressedWithMultipleWAL
[INFO] Running org.apache.hadoop.hbase.replication.TestReplicationStateZKImpl
[INFO] Tests run: 9, Failures: 0, Errors: 0, Skipped: 0, Time elapsed: 2.825 s - in org.apache.hadoop.hbase.replication.TestReplicationStateZKImpl
[INFO] Running org.apache.hadoop.hbase.replication.multiwal.TestReplicationSyncUpToolWithMultipleWAL
[INFO] Running org.apache.hadoop.hbase.replication.TestReplicationEndpoint
[INFO] Running org.apache.hadoop.hbase.replication.TestReplicationSyncUpTool
[INFO] Tests run: 8, Failures: 0, Errors: 0, Skipped: 0, Time elapsed: 341.45 s - in org.apache.hadoop.hbase.replication.regionserver.TestWALEntryStream
[INFO] Running org.apache.hadoop.hbase.replication.TestReplicationTrackerZKImpl
[INFO] Tests run: 5, Failures: 0, Errors: 0, Skipped: 0, Time elapsed: 4.817 s - in org.apache.hadoop.hbase.replication.TestReplicationTrackerZKImpl
[INFO] Tests run: 7, Failures: 0, Errors: 0, Skipped: 0, Time elapsed: 27.721 s - in org.apache.hadoop.hbase.replication.TestReplicationEndpoint
[INFO] Running org.apache.hadoop.hbase.replication.TestReplicationKillMasterRS
[INFO] Running org.apache.hadoop.hbase.replication.TestReplicationKillMasterRSCompressed
[INFO] Tests run: 1, Failures: 0, Errors: 0, Skipped: 0, Time elapsed: 82.008 s - in org.apache.hadoop.hbase.replication.TestReplicationSyncUpTool
[INFO] Tests run: 1, Failures: 0, Errors: 0, Skipped: 0, Time elapsed: 109.472 s - in org.apache.hadoop.hbase.replication.multiwal.TestReplicationSyncUpToolWithMultipleWAL
[INFO] Tests run: 1, Failures: 0, Errors: 0, Skipped: 0, Time elapsed: 32.874 s - in org.apache.hadoop.hbase.replication.TestReplicationKillMasterRS
[INFO] Tests run: 1, Failures: 0, Errors: 0, Skipped: 0, Time elapsed: 31.229 s - in org.apache.hadoop.hbase.replication.TestReplicationKillMasterRSCompressed
[INFO] Running org.apache.hadoop.hbase.replication.TestReplicationStatus
[INFO] Tests run: 9, Failures: 0, Errors: 0, Skipped: 0, Time elapsed: 341.593 s - in org.apache.hadoop.hbase.replication.regionserver.TestRegionReplicaReplicationEndpoint
[INFO] Running org.apache.hadoop.hbase.replication.TestReplicationDisableInactivePeer
[INFO] Tests run: 1, Failures: 0, Errors: 0, Skipped: 0, Time elapsed: 17.467 s - in org.apache.hadoop.hbase.replication.TestReplicationStatus
[INFO] Tests run: 1, Failures: 0, Errors: 0, Skipped: 0, Time elapsed: 29.882 s - in org.apache.hadoop.hbase.replication.TestReplicationDisableInactivePeer
[INFO] 
[INFO] Results:
[INFO] 
[ERROR] Failures: 
[ERROR] org.apache.hadoop.hbase.util.TestHBaseFsck.testHbckReportReplicaLingeringSplitParent(org.apache.hadoop.hbase.util.TestHBaseFsck)
[ERROR]   Run 1: TestHBaseFsck.testHbckReportReplicaLingeringSplitParent:230 expected:<[]>
but was:<[NOT_DEPLOYED]>
[ERROR]   Run 2: TestHBaseFsck.testHbckReportReplicaLingeringSplitParent:230 expected:<[]>
but was:<[NOT_DEPLOYED, NOT_DEPLOYED]>
[ERROR]   Run 3: TestHBaseFsck.testHbckReportReplicaLingeringSplitParent:230 expected:<[]>
but was:<[NOT_DEPLOYED, NOT_DEPLOYED, HOLE_IN_REGION_CHAIN]>
[INFO] 
[ERROR] Errors: 
[ERROR] org.apache.hadoop.hbase.client.TestAdmin1.testMergeRegions(org.apache.hadoop.hbase.client.TestAdmin1)
[ERROR]   Run 1: TestAdmin1.testMergeRegions:1417 expected:<2> but was:<3>
[ERROR]   Run 2: TestAdmin1.testMergeRegions:1417 expected:<2> but was:<3>
[ERROR]   Run 3: TestAdmin1.testMergeRegions:1423 » MergeRegion org.apache.hadoop.hbase.excepti...
[INFO] 
[WARNING] Flakes: 
[WARNING] org.apache.hadoop.hbase.client.TestReplicasClient.testCancelOfMultiGet(org.apache.hadoop.hbase.client.TestReplicasClient)
[ERROR]   Run 1: TestReplicasClient.testCancelOfMultiGet:674
[INFO]   Run 2: PASS
[INFO] 
[INFO] 
[ERROR] Tests run: 2860, Failures: 1, Errors: 1, Skipped: 60, Flakes: 1
[INFO] 
[INFO] ------------------------------------------------------------------------
[INFO] Reactor Summary:
[INFO] 
[INFO] Apache HBase ...................................... SUCCESS [1:51.447s]
[INFO] Apache HBase - Checkstyle ......................... SUCCESS [15.326s]
[INFO] Apache HBase - Resource Bundle .................... SUCCESS [0.358s]
[INFO] Apache HBase - Annotations ........................ SUCCESS [1.920s]
[INFO] Apache HBase - Protocol ........................... SUCCESS [20.406s]
[INFO] Apache HBase - Common ............................. SUCCESS [3:31.850s]
[INFO] Apache HBase - Procedure .......................... SUCCESS [4:14.059s]
[INFO] Apache HBase - Metrics API ........................ SUCCESS [2.610s]
[INFO] Apache HBase - Hadoop Compatibility ............... SUCCESS [16.484s]
[INFO] Apache HBase - Metrics Implementation ............. SUCCESS [10.416s]
[INFO] Apache HBase - Hadoop Two Compatibility ........... SUCCESS [30.422s]
[INFO] Apache HBase - Client ............................. SUCCESS [2:17.586s]
[INFO] Apache HBase - Prefix Tree ........................ SUCCESS [17.359s]
[INFO] Apache HBase - Server ............................. FAILURE [2:28:48.737s]
[INFO] Apache HBase - Testing Util ....................... SKIPPED
[INFO] Apache HBase - Thrift ............................. SKIPPED
[INFO] Apache HBase - Rest ............................... SKIPPED
[INFO] Apache HBase - Shell .............................. SKIPPED
[INFO] Apache HBase - Integration Tests .................. SKIPPED
[INFO] Apache HBase - Examples ........................... SKIPPED
[INFO] Apache HBase - External Block Cache ............... SKIPPED
[INFO] Apache HBase - Assembly ........................... SKIPPED
[INFO] Apache HBase - Shaded ............................. SKIPPED
[INFO] Apache HBase - Shaded - Client .................... SKIPPED
[INFO] Apache HBase - Shaded - Server .................... SKIPPED
[INFO] Apache HBase Shaded Packaging Invariants .......... SKIPPED
[INFO] Apache HBase - Archetypes ......................... SKIPPED
[INFO] Apache HBase - Exemplar for hbase-client archetype  SKIPPED
[INFO] Apache HBase - Exemplar for hbase-shaded-client archetype  SKIPPED
[INFO] Apache HBase - Archetype builder .................. SKIPPED
[INFO] ------------------------------------------------------------------------
[INFO] BUILD FAILURE
[INFO] ------------------------------------------------------------------------
[INFO] Total time: 2:43:13.679s
[INFO] Finished at: Mon Oct 23 17:53:20 UTC 2017
[INFO] Final Memory: 104M/1251M
[INFO] ------------------------------------------------------------------------
[ERROR] Failed to execute goal org.apache.maven.plugins:maven-surefire-plugin:2.20.1:test
(secondPartTestsExecution) on project hbase-server: There are test failures.
[ERROR] 
[ERROR] Please refer to <https://builds.apache.org/job/HBase-1.4/jdk=JDK_1_7,label=Hadoop&&!H13/ws/hbase-server/target/surefire-reports>
for the individual test results.
[ERROR] Please refer to dump files (if any exist) [date]-jvmRun[N].dump, [date].dumpstream
and [date]-jvmRun[N].dumpstream.
[ERROR] -> [Help 1]
[ERROR] 
[ERROR] To see the full stack trace of the errors, re-run Maven with the -e switch.
[ERROR] Re-run Maven using the -X switch to enable full debug logging.
[ERROR] 
[ERROR] For more information about the errors and possible solutions, please read the following
articles:
[ERROR] [Help 1] http://cwiki.apache.org/confluence/display/MAVEN/MojoFailureException
[ERROR] 
[ERROR] After correcting the problems, you can resume the build with the command
[ERROR]   mvn <goals> -rf :hbase-server
Build step 'Invoke top-level Maven targets' marked build as failure
Performing Post build task...
Match found for :.* : True
Logical operation result is TRUE
Running script  : # Post-build task script. TODO: Check this in and have all builds reference
check-in.
pwd && ls
# NOTE!!!! The below code has been copied and pasted from ./dev-tools/run-test.sh
# Do not change here without syncing there and vice-versa.
ZOMBIE_TESTS_COUNT=`jps -v | grep surefirebooter | grep -e '-Dhbase.test' | wc -l`
if [[ $ZOMBIE_TESTS_COUNT != 0 ]] ; then
 echo "Suspicious java process found - waiting 30s to see if there are just slow to stop"
 sleep 30
 ZOMBIE_TESTS_COUNT=`jps -v | grep surefirebooter | grep -e '-Dhbase.test' | wc -l`
 if [[ $ZOMBIE_TESTS_COUNT != 0 ]] ; then
   echo " {color:red}There appear to be $ZOMBIE_TESTS_COUNT zombie tests{color}, they should
have been killed by surefire but survived"
   jps -v | grep surefirebooter | grep -e '-Dhbase.test'
   jps -v | grep surefirebooter | grep -e '-Dhbase.test' | cut -d ' ' -f 1 | xargs -n 1 jstack
   # Exit with error
   exit 1
 else
   echo "We're ok: there is no zombie test, but some tests took some time to stop"
 fi
else
  echo "We're ok: there is no zombie test"
fi
Setting JDK_1_7_LATEST__HOME=/home/jenkins/tools/java/latest1.7
Setting JDK_1_8_LATEST__HOME=/home/jenkins/tools/java/latest1.8
[19ccb43d] $ /bin/bash -xe /tmp/jenkins527497068529373861.sh
+ pwd
<https://builds.apache.org/job/HBase-1.4/jdk=JDK_1_7,label=Hadoop&&!H13/ws/>
+ ls
bin
CHANGES.txt
conf
dev-support
extra_env_var
hbase-annotations
hbase-archetypes
hbase-assembly
hbase-checkstyle
hbase-client
hbase-common
hbase-examples
hbase-external-blockcache
hbase-hadoop2-compat
hbase-hadoop-compat
hbase-it
hbase-metrics
hbase-metrics-api
hbase-native-client
hbase-prefix-tree
hbase-procedure
hbase-protocol
hbase-resource-bundle
hbase-rest
hbase-server
hbase-shaded
hbase-shell
hbase-testing-util
hbase-thrift
LICENSE.txt
NOTICE.txt
pom.xml
README.txt
src
target
++ grep surefirebooter
++ grep -e -Dhbase.test
++ jps -v
++ wc -l
+ ZOMBIE_TESTS_COUNT=0
+ [[ 0 != 0 ]]
+ echo 'We'\''re ok: there is no zombie test'
We're ok: there is no zombie test
POST BUILD TASK : SUCCESS
END OF POST BUILD TASK : 0
Archiving artifacts
Setting JDK_1_7_LATEST__HOME=/home/jenkins/tools/java/latest1.7
Setting JDK_1_8_LATEST__HOME=/home/jenkins/tools/java/latest1.8
Recording test results
Setting JDK_1_7_LATEST__HOME=/home/jenkins/tools/java/latest1.7
Setting JDK_1_8_LATEST__HOME=/home/jenkins/tools/java/latest1.8
Setting JDK_1_7_LATEST__HOME=/home/jenkins/tools/java/latest1.7
Setting JDK_1_8_LATEST__HOME=/home/jenkins/tools/java/latest1.8

Mime
View raw message