hbase-builds mailing list archives

Site index · List index
Message view « Date » · « Thread »
Top « Date » · « Thread »
From Apache Jenkins Server <jenk...@builds.apache.org>
Subject Build failed in Jenkins: HBase-Trunk_matrix » JDK 1.8 (latest),Hadoop #3966
Date Sun, 29 Oct 2017 11:57:48 GMT
See <https://builds.apache.org/job/HBase-Trunk_matrix/jdk=JDK%201.8%20(latest),label=Hadoop/3966/display/redirect>

------------------------------------------
[...truncated 1.34 MB...]
[INFO] 
[INFO] --- maven-archetype-plugin:2.4:integration-test (default-integration-test) @ hbase-client-project-archetype
---
[INFO] Processing Archetype IT project: basic
[INFO] ----------------------------------------------------------------------------
[INFO] Using following parameters for creating project from Archetype: hbase-client-project-archetype:3.0.0-SNAPSHOT
[INFO] ----------------------------------------------------------------------------
[INFO] Parameter: groupId, Value: archetype.it
[INFO] Parameter: artifactId, Value: basic
[INFO] Parameter: version, Value: 0.1-SNAPSHOT
[INFO] Parameter: package, Value: it.pkg
[INFO] Parameter: packageInPathFormat, Value: it/pkg
[INFO] Parameter: version, Value: 0.1-SNAPSHOT
[INFO] Parameter: package, Value: it.pkg
[INFO] Parameter: groupId, Value: archetype.it
[INFO] Parameter: artifactId, Value: basic
[INFO] project created from Archetype in dir: <https://builds.apache.org/job/HBase-Trunk_matrix/jdk=JDK%201.8%20(latest),label=Hadoop/ws/hbase-archetypes/hbase-client-project/target/build-archetype/target/generated-sources/archetype/target/test-classes/projects/basic/project/basic>
[INFO] 
[INFO] --- maven-install-plugin:2.5.2:install (default-install) @ hbase-client-project-archetype
---
[INFO] Installing <https://builds.apache.org/job/HBase-Trunk_matrix/jdk=JDK%201.8%20(latest),label=Hadoop/ws/hbase-archetypes/hbase-client-project/target/build-archetype/target/generated-sources/archetype/target/hbase-client-project-archetype-3.0.0-SNAPSHOT.jar>
to /home/jenkins/.m2/repository/org/apache/hbase/hbase-client-project-archetype/3.0.0-SNAPSHOT/hbase-client-project-archetype-3.0.0-SNAPSHOT.jar
[INFO] Installing <https://builds.apache.org/job/HBase-Trunk_matrix/jdk=JDK%201.8%20(latest),label=Hadoop/3966/artifact/hbase-archetypes/hbase-client-project/target/build-archetype/target/generated-sources/archetype/pom.xml>
to /home/jenkins/.m2/repository/org/apache/hbase/hbase-client-project-archetype/3.0.0-SNAPSHOT/hbase-client-project-archetype-3.0.0-SNAPSHOT.pom
[INFO] 
[INFO] --- maven-archetype-plugin:2.4:update-local-catalog (default-update-local-catalog)
@ hbase-client-project-archetype ---
[INFO] ------------------------------------------------------------------------
[INFO] BUILD SUCCESS
[INFO] ------------------------------------------------------------------------
[INFO] Total time: 1.320s
[INFO] Finished at: Sun Oct 29 11:52:23 UTC 2017
[INFO] Final Memory: 21M/724M
[INFO] ------------------------------------------------------------------------
[INFO] Scanning for projects...
[INFO]                                                                         
[INFO] ------------------------------------------------------------------------
[INFO] Building hbase-shaded-client-project-archetype 3.0.0-SNAPSHOT
[INFO] ------------------------------------------------------------------------
[INFO] 
[INFO] --- maven-resources-plugin:3.0.1:resources (default-resources) @ hbase-shaded-client-project-archetype
---
[INFO] Using 'UTF-8' encoding to copy filtered resources.
[INFO] Copying 6 resources
[INFO] 
[INFO] --- maven-resources-plugin:3.0.1:testResources (default-testResources) @ hbase-shaded-client-project-archetype
---
[INFO] Using 'UTF-8' encoding to copy filtered resources.
[INFO] Copying 2 resources
[INFO] 
[INFO] --- maven-archetype-plugin:2.4:jar (default-jar) @ hbase-shaded-client-project-archetype
---
[INFO] Building archetype jar: <https://builds.apache.org/job/HBase-Trunk_matrix/jdk=JDK%201.8%20(latest),label=Hadoop/ws/hbase-archetypes/hbase-shaded-client-project/target/build-archetype/target/generated-sources/archetype/target/hbase-shaded-client-project-archetype-3.0.0-SNAPSHOT>
[INFO] 
[INFO] --- maven-archetype-plugin:2.4:integration-test (default-integration-test) @ hbase-shaded-client-project-archetype
---
[INFO] Processing Archetype IT project: basic
[INFO] ----------------------------------------------------------------------------
[INFO] Using following parameters for creating project from Archetype: hbase-shaded-client-project-archetype:3.0.0-SNAPSHOT
[INFO] ----------------------------------------------------------------------------
[INFO] Parameter: groupId, Value: archetype.it
[INFO] Parameter: artifactId, Value: basic
[INFO] Parameter: version, Value: 0.1-SNAPSHOT
[INFO] Parameter: package, Value: it.pkg
[INFO] Parameter: packageInPathFormat, Value: it/pkg
[INFO] Parameter: version, Value: 0.1-SNAPSHOT
[INFO] Parameter: package, Value: it.pkg
[INFO] Parameter: groupId, Value: archetype.it
[INFO] Parameter: artifactId, Value: basic
[INFO] project created from Archetype in dir: <https://builds.apache.org/job/HBase-Trunk_matrix/jdk=JDK%201.8%20(latest),label=Hadoop/ws/hbase-archetypes/hbase-shaded-client-project/target/build-archetype/target/generated-sources/archetype/target/test-classes/projects/basic/project/basic>
[INFO] 
[INFO] --- maven-install-plugin:2.5.2:install (default-install) @ hbase-shaded-client-project-archetype
---
[INFO] Installing <https://builds.apache.org/job/HBase-Trunk_matrix/jdk=JDK%201.8%20(latest),label=Hadoop/ws/hbase-archetypes/hbase-shaded-client-project/target/build-archetype/target/generated-sources/archetype/target/hbase-shaded-client-project-archetype-3.0.0-SNAPSHOT.jar>
to /home/jenkins/.m2/repository/org/apache/hbase/hbase-shaded-client-project-archetype/3.0.0-SNAPSHOT/hbase-shaded-client-project-archetype-3.0.0-SNAPSHOT.jar
[INFO] Installing <https://builds.apache.org/job/HBase-Trunk_matrix/jdk=JDK%201.8%20(latest),label=Hadoop/3966/artifact/hbase-archetypes/hbase-shaded-client-project/target/build-archetype/target/generated-sources/archetype/pom.xml>
to /home/jenkins/.m2/repository/org/apache/hbase/hbase-shaded-client-project-archetype/3.0.0-SNAPSHOT/hbase-shaded-client-project-archetype-3.0.0-SNAPSHOT.pom
[INFO] 
[INFO] --- maven-archetype-plugin:2.4:update-local-catalog (default-update-local-catalog)
@ hbase-shaded-client-project-archetype ---
[INFO] ------------------------------------------------------------------------
[INFO] BUILD SUCCESS
[INFO] ------------------------------------------------------------------------
[INFO] Total time: 1.284s
[INFO] Finished at: Sun Oct 29 11:52:26 UTC 2017
[INFO] Final Memory: 21M/724M
[INFO] ------------------------------------------------------------------------
[INFO] ------------------------------------------------------------------------
[INFO] Reactor Summary:
[INFO] 
[INFO] Apache HBase ...................................... SUCCESS [2.259s]
[INFO] Apache HBase - Checkstyle ......................... SUCCESS [0.599s]
[INFO] Apache HBase - Build Support ...................... SUCCESS [0.064s]
[INFO] Apache HBase - Error Prone Rules .................. SUCCESS [0.238s]
[INFO] Apache HBase - Annotations ........................ SUCCESS [0.432s]
[INFO] Apache HBase - Build Configuration ................ SUCCESS [0.073s]
[INFO] Apache HBase - Shaded Protocol .................... SUCCESS [24.592s]
[INFO] Apache HBase - Common ............................. SUCCESS [2:06.438s]
[INFO] Apache HBase - Metrics API ........................ SUCCESS [1.667s]
[INFO] Apache HBase - Hadoop Compatibility ............... SUCCESS [13.049s]
[INFO] Apache HBase - Metrics Implementation ............. SUCCESS [6.931s]
[INFO] Apache HBase - Hadoop Two Compatibility ........... SUCCESS [15.080s]
[INFO] Apache HBase - Protocol ........................... SUCCESS [7.853s]
[INFO] Apache HBase - Client ............................. SUCCESS [2:19.541s]
[INFO] Apache HBase - Replication ........................ SUCCESS [1.232s]
[INFO] Apache HBase - Prefix Tree ........................ SUCCESS [14.679s]
[INFO] Apache HBase - Resource Bundle .................... SUCCESS [0.160s]
[INFO] Apache HBase - HTTP ............................... SUCCESS [29.736s]
[INFO] Apache HBase - Procedure .......................... SUCCESS [2:43.940s]
[INFO] Apache HBase - Server ............................. FAILURE [1:55:31.469s]
[INFO] Apache HBase - MapReduce .......................... SKIPPED
[INFO] Apache HBase - Testing Util ....................... SKIPPED
[INFO] Apache HBase - Thrift ............................. SKIPPED
[INFO] Apache HBase - RSGroup ............................ SKIPPED
[INFO] Apache HBase - Shell .............................. SKIPPED
[INFO] Apache HBase - Coprocessor Endpoint ............... SKIPPED
[INFO] Apache HBase - Backup ............................. SKIPPED
[INFO] Apache HBase - Integration Tests .................. SKIPPED
[INFO] Apache HBase - Examples ........................... SKIPPED
[INFO] Apache HBase - Rest ............................... SKIPPED
[INFO] Apache HBase - External Block Cache ............... SKIPPED
[INFO] Apache HBase - Spark .............................. SKIPPED
[INFO] Apache HBase - Spark Integration Tests ............ SKIPPED
[INFO] Apache HBase - Assembly ........................... SKIPPED
[INFO] Apache HBase - Shaded ............................. SUCCESS [0.263s]
[INFO] Apache HBase - Shaded - Client .................... SUCCESS [1.227s]
[INFO] Apache HBase - Shaded - MapReduce ................. SKIPPED
[INFO] Apache HBase Shaded Packaging Invariants .......... SKIPPED
[INFO] Apache HBase - Archetypes ......................... SUCCESS [0.047s]
[INFO] Apache HBase - Exemplar for hbase-client archetype  SKIPPED
[INFO] Apache HBase - Exemplar for hbase-shaded-client archetype  SKIPPED
[INFO] Apache HBase - Archetype builder .................. SUCCESS [15.514s]
[INFO] ------------------------------------------------------------------------
[INFO] BUILD FAILURE
[INFO] ------------------------------------------------------------------------
[INFO] Total time: 2:04:58.519s
[INFO] Finished at: Sun Oct 29 11:52:26 UTC 2017
[INFO] Final Memory: 98M/2894M
[INFO] ------------------------------------------------------------------------
[ERROR] Failed to execute goal org.apache.maven.plugins:maven-surefire-plugin:2.20.1:test
(secondPartTestsExecution) on project hbase-server: There are test failures.
[ERROR] 
[ERROR] Please refer to <https://builds.apache.org/job/HBase-Trunk_matrix/jdk=JDK%201.8%20(latest),label=Hadoop/ws/hbase-server/target/surefire-reports>
for the individual test results.
[ERROR] Please refer to dump files (if any exist) [date]-jvmRun[N].dump, [date].dumpstream
and [date]-jvmRun[N].dumpstream.
[ERROR] ExecutionException The forked VM terminated without properly saying goodbye. VM crash
or System.exit called?
[ERROR] Command was /bin/sh -c cd <https://builds.apache.org/job/HBase-Trunk_matrix/jdk=JDK%201.8%20(latest),label=Hadoop/ws/hbase-server>
&& /usr/local/asfpackages/java/jdk1.8.0_152/jre/bin/java -enableassertions -Dhbase.build.id=3966
-Xmx2800m -Djava.security.egd=file:/dev/./urandom -Djava.net.preferIPv4Stack=true -Djava.awt.headless=true
-jar <https://builds.apache.org/job/HBase-Trunk_matrix/jdk=JDK%201.8%20(latest),label=Hadoop/ws/hbase-server/target/surefire/surefirebooter7532058133216298007.jar>
<https://builds.apache.org/job/HBase-Trunk_matrix/jdk=JDK%201.8%20(latest),label=Hadoop/ws/hbase-server/target/surefire>
2017-10-29T09-47-32_261-jvmRun1 surefire7248766689830269249tmp surefire_12939014748573004799394tmp
[ERROR] Error occurred in starting fork, check output in log
[ERROR] Process Exit Code: 1
[ERROR] Crashed tests:
[ERROR] org.apache.hadoop.hbase.io.asyncfs.TestSaslFanOutOneBlockAsyncDFSOutput
[ERROR] ExecutionException The forked VM terminated without properly saying goodbye. VM crash
or System.exit called?
[ERROR] Command was /bin/sh -c cd <https://builds.apache.org/job/HBase-Trunk_matrix/jdk=JDK%201.8%20(latest),label=Hadoop/ws/hbase-server>
&& /usr/local/asfpackages/java/jdk1.8.0_152/jre/bin/java -enableassertions -Dhbase.build.id=3966
-Xmx2800m -Djava.security.egd=file:/dev/./urandom -Djava.net.preferIPv4Stack=true -Djava.awt.headless=true
-jar <https://builds.apache.org/job/HBase-Trunk_matrix/jdk=JDK%201.8%20(latest),label=Hadoop/ws/hbase-server/target/surefire/surefirebooter4027909756424137877.jar>
<https://builds.apache.org/job/HBase-Trunk_matrix/jdk=JDK%201.8%20(latest),label=Hadoop/ws/hbase-server/target/surefire>
2017-10-29T09-47-32_261-jvmRun5 surefire4178567171739014864tmp surefire_12952844726051458247363tmp
[ERROR] Error occurred in starting fork, check output in log
[ERROR] Process Exit Code: 1
[ERROR] Crashed tests:
[ERROR] org.apache.hadoop.hbase.TestAcidGuarantees
[ERROR] ExecutionException The forked VM terminated without properly saying goodbye. VM crash
or System.exit called?
[ERROR] Command was /bin/sh -c cd <https://builds.apache.org/job/HBase-Trunk_matrix/jdk=JDK%201.8%20(latest),label=Hadoop/ws/hbase-server>
&& /usr/local/asfpackages/java/jdk1.8.0_152/jre/bin/java -enableassertions -Dhbase.build.id=3966
-Xmx2800m -Djava.security.egd=file:/dev/./urandom -Djava.net.preferIPv4Stack=true -Djava.awt.headless=true
-jar <https://builds.apache.org/job/HBase-Trunk_matrix/jdk=JDK%201.8%20(latest),label=Hadoop/ws/hbase-server/target/surefire/surefirebooter1929064143169100607.jar>
<https://builds.apache.org/job/HBase-Trunk_matrix/jdk=JDK%201.8%20(latest),label=Hadoop/ws/hbase-server/target/surefire>
2017-10-29T09-47-32_261-jvmRun4 surefire5923471776802444595tmp surefire_12968052947253447049487tmp
[ERROR] Error occurred in starting fork, check output in log
[ERROR] Process Exit Code: 1
[ERROR] Crashed tests:
[ERROR] org.apache.hadoop.hbase.TestHColumnDescriptorDefaultVersions
[ERROR] ExecutionException The forked VM terminated without properly saying goodbye. VM crash
or System.exit called?
[ERROR] Command was /bin/sh -c cd <https://builds.apache.org/job/HBase-Trunk_matrix/jdk=JDK%201.8%20(latest),label=Hadoop/ws/hbase-server>
&& /usr/local/asfpackages/java/jdk1.8.0_152/jre/bin/java -enableassertions -Dhbase.build.id=3966
-Xmx2800m -Djava.security.egd=file:/dev/./urandom -Djava.net.preferIPv4Stack=true -Djava.awt.headless=true
-jar <https://builds.apache.org/job/HBase-Trunk_matrix/jdk=JDK%201.8%20(latest),label=Hadoop/ws/hbase-server/target/surefire/surefirebooter2791152900346815222.jar>
<https://builds.apache.org/job/HBase-Trunk_matrix/jdk=JDK%201.8%20(latest),label=Hadoop/ws/hbase-server/target/surefire>
2017-10-29T09-47-32_261-jvmRun3 surefire7833599071993698139tmp surefire_12975472456011146452829tmp
[ERROR] Error occurred in starting fork, check output in log
[ERROR] Process Exit Code: 1
[ERROR] Crashed tests:
[ERROR] org.apache.hadoop.hbase.TestHBaseTestingUtility
[ERROR] org.apache.maven.surefire.booter.SurefireBooterForkException: ExecutionException The
forked VM terminated without properly saying goodbye. VM crash or System.exit called?
[ERROR] Command was /bin/sh -c cd <https://builds.apache.org/job/HBase-Trunk_matrix/jdk=JDK%201.8%20(latest),label=Hadoop/ws/hbase-server>
&& /usr/local/asfpackages/java/jdk1.8.0_152/jre/bin/java -enableassertions -Dhbase.build.id=3966
-Xmx2800m -Djava.security.egd=file:/dev/./urandom -Djava.net.preferIPv4Stack=true -Djava.awt.headless=true
-jar <https://builds.apache.org/job/HBase-Trunk_matrix/jdk=JDK%201.8%20(latest),label=Hadoop/ws/hbase-server/target/surefire/surefirebooter7532058133216298007.jar>
<https://builds.apache.org/job/HBase-Trunk_matrix/jdk=JDK%201.8%20(latest),label=Hadoop/ws/hbase-server/target/surefire>
2017-10-29T09-47-32_261-jvmRun1 surefire7248766689830269249tmp surefire_12939014748573004799394tmp
[ERROR] Error occurred in starting fork, check output in log
[ERROR] Process Exit Code: 1
[ERROR] Crashed tests:
[ERROR] org.apache.hadoop.hbase.io.asyncfs.TestSaslFanOutOneBlockAsyncDFSOutput
[ERROR] ExecutionException The forked VM terminated without properly saying goodbye. VM crash
or System.exit called?
[ERROR] Command was /bin/sh -c cd <https://builds.apache.org/job/HBase-Trunk_matrix/jdk=JDK%201.8%20(latest),label=Hadoop/ws/hbase-server>
&& /usr/local/asfpackages/java/jdk1.8.0_152/jre/bin/java -enableassertions -Dhbase.build.id=3966
-Xmx2800m -Djava.security.egd=file:/dev/./urandom -Djava.net.preferIPv4Stack=true -Djava.awt.headless=true
-jar <https://builds.apache.org/job/HBase-Trunk_matrix/jdk=JDK%201.8%20(latest),label=Hadoop/ws/hbase-server/target/surefire/surefirebooter4027909756424137877.jar>
<https://builds.apache.org/job/HBase-Trunk_matrix/jdk=JDK%201.8%20(latest),label=Hadoop/ws/hbase-server/target/surefire>
2017-10-29T09-47-32_261-jvmRun5 surefire4178567171739014864tmp surefire_12952844726051458247363tmp
[ERROR] Error occurred in starting fork, check output in log
[ERROR] Process Exit Code: 1
[ERROR] Crashed tests:
[ERROR] org.apache.hadoop.hbase.TestAcidGuarantees
[ERROR] ExecutionException The forked VM terminated without properly saying goodbye. VM crash
or System.exit called?
[ERROR] Command was /bin/sh -c cd <https://builds.apache.org/job/HBase-Trunk_matrix/jdk=JDK%201.8%20(latest),label=Hadoop/ws/hbase-server>
&& /usr/local/asfpackages/java/jdk1.8.0_152/jre/bin/java -enableassertions -Dhbase.build.id=3966
-Xmx2800m -Djava.security.egd=file:/dev/./urandom -Djava.net.preferIPv4Stack=true -Djava.awt.headless=true
-jar <https://builds.apache.org/job/HBase-Trunk_matrix/jdk=JDK%201.8%20(latest),label=Hadoop/ws/hbase-server/target/surefire/surefirebooter1929064143169100607.jar>
<https://builds.apache.org/job/HBase-Trunk_matrix/jdk=JDK%201.8%20(latest),label=Hadoop/ws/hbase-server/target/surefire>
2017-10-29T09-47-32_261-jvmRun4 surefire5923471776802444595tmp surefire_12968052947253447049487tmp
[ERROR] Error occurred in starting fork, check output in log
[ERROR] Process Exit Code: 1
[ERROR] Crashed tests:
[ERROR] org.apache.hadoop.hbase.TestHColumnDescriptorDefaultVersions
[ERROR] ExecutionException The forked VM terminated without properly saying goodbye. VM crash
or System.exit called?
[ERROR] Command was /bin/sh -c cd <https://builds.apache.org/job/HBase-Trunk_matrix/jdk=JDK%201.8%20(latest),label=Hadoop/ws/hbase-server>
&& /usr/local/asfpackages/java/jdk1.8.0_152/jre/bin/java -enableassertions -Dhbase.build.id=3966
-Xmx2800m -Djava.security.egd=file:/dev/./urandom -Djava.net.preferIPv4Stack=true -Djava.awt.headless=true
-jar <https://builds.apache.org/job/HBase-Trunk_matrix/jdk=JDK%201.8%20(latest),label=Hadoop/ws/hbase-server/target/surefire/surefirebooter2791152900346815222.jar>
<https://builds.apache.org/job/HBase-Trunk_matrix/jdk=JDK%201.8%20(latest),label=Hadoop/ws/hbase-server/target/surefire>
2017-10-29T09-47-32_261-jvmRun3 surefire7833599071993698139tmp surefire_12975472456011146452829tmp
[ERROR] Error occurred in starting fork, check output in log
[ERROR] Process Exit Code: 1
[ERROR] Crashed tests:
[ERROR] org.apache.hadoop.hbase.TestHBaseTestingUtility
[ERROR] at org.apache.maven.plugin.surefire.booterclient.ForkStarter.awaitResultsDone(ForkStarter.java:496)
[ERROR] at org.apache.maven.plugin.surefire.booterclient.ForkStarter.runSuitesForkPerTestSet(ForkStarter.java:443)
[ERROR] at org.apache.maven.plugin.surefire.booterclient.ForkStarter.run(ForkStarter.java:295)
[ERROR] at org.apache.maven.plugin.surefire.booterclient.ForkStarter.run(ForkStarter.java:246)
[ERROR] at org.apache.maven.plugin.surefire.AbstractSurefireMojo.executeProvider(AbstractSurefireMojo.java:1124)
[ERROR] at org.apache.maven.plugin.surefire.AbstractSurefireMojo.executeAfterPreconditionsChecked(AbstractSurefireMojo.java:954)
[ERROR] at org.apache.maven.plugin.surefire.AbstractSurefireMojo.execute(AbstractSurefireMojo.java:832)
[ERROR] at org.apache.maven.plugin.DefaultBuildPluginManager.executeMojo(DefaultBuildPluginManager.java:101)
[ERROR] at org.apache.maven.lifecycle.internal.MojoExecutor.execute(MojoExecutor.java:209)
[ERROR] at org.apache.maven.lifecycle.internal.MojoExecutor.execute(MojoExecutor.java:153)
[ERROR] at org.apache.maven.lifecycle.internal.MojoExecutor.execute(MojoExecutor.java:145)
[ERROR] at org.apache.maven.lifecycle.internal.LifecycleModuleBuilder.buildProject(LifecycleModuleBuilder.java:84)
[ERROR] at org.apache.maven.lifecycle.internal.LifecycleModuleBuilder.buildProject(LifecycleModuleBuilder.java:59)
[ERROR] at org.apache.maven.lifecycle.internal.LifecycleStarter.singleThreadedBuild(LifecycleStarter.java:183)
[ERROR] at org.apache.maven.lifecycle.internal.LifecycleStarter.execute(LifecycleStarter.java:161)
[ERROR] at org.apache.maven.DefaultMaven.doExecute(DefaultMaven.java:320)
[ERROR] at org.apache.maven.DefaultMaven.execute(DefaultMaven.java:156)
[ERROR] at org.apache.maven.cli.MavenCli.execute(MavenCli.java:537)
[ERROR] at org.apache.maven.cli.MavenCli.doMain(MavenCli.java:196)
[ERROR] at org.apache.maven.cli.MavenCli.main(MavenCli.java:141)
[ERROR] at sun.reflect.NativeMethodAccessorImpl.invoke0(Native Method)
[ERROR] at sun.reflect.NativeMethodAccessorImpl.invoke(NativeMethodAccessorImpl.java:62)
[ERROR] at sun.reflect.DelegatingMethodAccessorImpl.invoke(DelegatingMethodAccessorImpl.java:43)
[ERROR] at java.lang.reflect.Method.invoke(Method.java:498)
[ERROR] at org.codehaus.plexus.classworlds.launcher.Launcher.launchEnhanced(Launcher.java:290)
[ERROR] at org.codehaus.plexus.classworlds.launcher.Launcher.launch(Launcher.java:230)
[ERROR] at org.codehaus.plexus.classworlds.launcher.Launcher.mainWithExitCode(Launcher.java:409)
[ERROR] at org.codehaus.plexus.classworlds.launcher.Launcher.main(Launcher.java:352)
[ERROR] Caused by: org.apache.maven.surefire.booter.SurefireBooterForkException: The forked
VM terminated without properly saying goodbye. VM crash or System.exit called?
[ERROR] Command was /bin/sh -c cd <https://builds.apache.org/job/HBase-Trunk_matrix/jdk=JDK%201.8%20(latest),label=Hadoop/ws/hbase-server>
&& /usr/local/asfpackages/java/jdk1.8.0_152/jre/bin/java -enableassertions -Dhbase.build.id=3966
-Xmx2800m -Djava.security.egd=file:/dev/./urandom -Djava.net.preferIPv4Stack=true -Djava.awt.headless=true
-jar <https://builds.apache.org/job/HBase-Trunk_matrix/jdk=JDK%201.8%20(latest),label=Hadoop/ws/hbase-server/target/surefire/surefirebooter2791152900346815222.jar>
<https://builds.apache.org/job/HBase-Trunk_matrix/jdk=JDK%201.8%20(latest),label=Hadoop/ws/hbase-server/target/surefire>
2017-10-29T09-47-32_261-jvmRun3 surefire7833599071993698139tmp surefire_12975472456011146452829tmp
[ERROR] Error occurred in starting fork, check output in log
[ERROR] Process Exit Code: 1
[ERROR] Crashed tests:
[ERROR] org.apache.hadoop.hbase.TestHBaseTestingUtility
[ERROR] at org.apache.maven.plugin.surefire.booterclient.ForkStarter.fork(ForkStarter.java:686)
[ERROR] at org.apache.maven.plugin.surefire.booterclient.ForkStarter.fork(ForkStarter.java:535)
[ERROR] at org.apache.maven.plugin.surefire.booterclient.ForkStarter.access$700(ForkStarter.java:116)
[ERROR] at org.apache.maven.plugin.surefire.booterclient.ForkStarter$2.call(ForkStarter.java:431)
[ERROR] at org.apache.maven.plugin.surefire.booterclient.ForkStarter$2.call(ForkStarter.java:408)
[ERROR] at java.util.concurrent.FutureTask.run(FutureTask.java:266)
[ERROR] at java.util.concurrent.ThreadPoolExecutor.runWorker(ThreadPoolExecutor.java:1149)
[ERROR] at java.util.concurrent.ThreadPoolExecutor$Worker.run(ThreadPoolExecutor.java:624)
[ERROR] at java.lang.Thread.run(Thread.java:748)
[ERROR] -> [Help 1]
[ERROR] 
[ERROR] To see the full stack trace of the errors, re-run Maven with the -e switch.
[ERROR] Re-run Maven using the -X switch to enable full debug logging.
[ERROR] 
[ERROR] For more information about the errors and possible solutions, please read the following
articles:
[ERROR] [Help 1] http://cwiki.apache.org/confluence/display/MAVEN/MojoExecutionException
[ERROR] 
[ERROR] After correcting the problems, you can resume the build with the command
[ERROR]   mvn <goals> -rf :hbase-server
Build step 'Invoke top-level Maven targets' marked build as failure
Performing Post build task...
Match found for :.* : True
Logical operation result is TRUE
Running script  : # Run zombie detector script
./dev-support/zombie-detector.sh --jenkins ${BUILD_ID}
[a3159d73] $ /bin/bash -xe /tmp/jenkins1121001156035760239.sh
+ ./dev-support/zombie-detector.sh --jenkins 3966
Sun Oct 29 11:52:28 UTC 2017 We're ok: there is no zombie test


    {color:green}+1 zombies{color}. No zombie tests found running at the end of the build.
POST BUILD TASK : SUCCESS
END OF POST BUILD TASK : 0
Archiving artifacts
Recording test results
[FINDBUGS] Skipping publisher since build result is FAILURE
[CHECKSTYLE] Skipping publisher since build result is FAILURE

Mime
View raw message