hbase-builds mailing list archives

Site index · List index
Message view « Date » · « Thread »
Top « Date » · « Thread »
From Apache Jenkins Server <jenk...@builds.apache.org>
Subject Build failed in Jenkins: HBase-1.4 » JDK_1_7,Hadoop&&!H13 #965
Date Mon, 23 Oct 2017 09:38:47 GMT
See <https://builds.apache.org/job/HBase-1.4/jdk=JDK_1_7,label=Hadoop&&!H13/965/display/redirect>

------------------------------------------
[...truncated 2.45 MB...]
[INFO] Running org.apache.hadoop.hbase.filter.TestFilterWithScanLimits
[INFO] Running org.apache.hadoop.hbase.filter.TestFilterListOnMini
[INFO] Tests run: 1, Failures: 0, Errors: 0, Skipped: 0, Time elapsed: 6.454 s - in org.apache.hadoop.hbase.filter.TestFilterWithScanLimits
[INFO] Tests run: 1, Failures: 0, Errors: 0, Skipped: 0, Time elapsed: 5.281 s - in org.apache.hadoop.hbase.filter.TestFilterListOnMini
[INFO] Running org.apache.hadoop.hbase.filter.TestScanRowPrefix
[INFO] Tests run: 1, Failures: 0, Errors: 0, Skipped: 0, Time elapsed: 8.756 s - in org.apache.hadoop.hbase.filter.TestScanRowPrefix
[INFO] Running org.apache.hadoop.hbase.TestGlobalMemStoreSize
[INFO] Tests run: 21, Failures: 0, Errors: 0, Skipped: 0, Time elapsed: 40.442 s - in org.apache.hadoop.hbase.filter.TestMultiRowRangeFilter
[INFO] Running org.apache.hadoop.hbase.TestHBaseOnOtherDfsCluster
[INFO] Running org.apache.hadoop.hbase.filter.TestFilterListOrOperatorWithBlkCnt
[INFO] Running org.apache.hadoop.hbase.filter.TestFilterWrapper
[INFO] Tests run: 1, Failures: 0, Errors: 0, Skipped: 0, Time elapsed: 6.717 s - in org.apache.hadoop.hbase.filter.TestFilterWrapper
[INFO] Tests run: 1, Failures: 0, Errors: 0, Skipped: 0, Time elapsed: 27.108 s - in org.apache.hadoop.hbase.TestHBaseOnOtherDfsCluster
[INFO] Tests run: 1, Failures: 0, Errors: 0, Skipped: 0, Time elapsed: 42.699 s - in org.apache.hadoop.hbase.TestGlobalMemStoreSize
[INFO] Running org.apache.hadoop.hbase.tool.TestCanaryTool
[INFO] Tests run: 1, Failures: 0, Errors: 0, Skipped: 0, Time elapsed: 35.748 s - in org.apache.hadoop.hbase.filter.TestFilterListOrOperatorWithBlkCnt
[INFO] Running org.apache.hadoop.hbase.TestNamespace
[INFO] Running org.apache.hadoop.hbase.replication.TestReplicationSource
[INFO] Tests run: 9, Failures: 0, Errors: 0, Skipped: 0, Time elapsed: 44.812 s - in org.apache.hadoop.hbase.TestNamespace
[INFO] Running org.apache.hadoop.hbase.replication.TestReplicationWithTags
[INFO] Tests run: 1, Failures: 0, Errors: 0, Skipped: 0, Time elapsed: 5.164 s - in org.apache.hadoop.hbase.replication.TestReplicationWithTags
[INFO] Tests run: 3, Failures: 0, Errors: 0, Skipped: 0, Time elapsed: 52.608 s - in org.apache.hadoop.hbase.replication.TestReplicationSource
[INFO] Running org.apache.hadoop.hbase.replication.TestPerTableCFReplication
[WARNING] Tests run: 7, Failures: 0, Errors: 0, Skipped: 2, Time elapsed: 106.429 s - in org.apache.hadoop.hbase.tool.TestCanaryTool
[INFO] Running org.apache.hadoop.hbase.replication.TestReplicationChangingPeerRegionservers
[INFO] Running org.apache.hadoop.hbase.replication.TestReplicationSmallTests
[INFO] Tests run: 1, Failures: 0, Errors: 0, Skipped: 0, Time elapsed: 11.795 s - in org.apache.hadoop.hbase.replication.TestReplicationChangingPeerRegionservers
[INFO] Running org.apache.hadoop.hbase.replication.TestMultiSlaveReplication
[INFO] Tests run: 3, Failures: 0, Errors: 0, Skipped: 0, Time elapsed: 46.776 s - in org.apache.hadoop.hbase.replication.TestPerTableCFReplication
[INFO] Running org.apache.hadoop.hbase.replication.TestReplicationSyncUpToolWithBulkLoadedData
[INFO] Running org.apache.hadoop.hbase.replication.TestReplicationKillSlaveRS
[INFO] Tests run: 1, Failures: 0, Errors: 0, Skipped: 0, Time elapsed: 27.242 s - in org.apache.hadoop.hbase.replication.TestReplicationKillSlaveRS
[INFO] Running org.apache.hadoop.hbase.replication.TestMasterReplication
[INFO] Tests run: 2, Failures: 0, Errors: 0, Skipped: 0, Time elapsed: 104.242 s - in org.apache.hadoop.hbase.replication.TestMultiSlaveReplication
[INFO] Tests run: 4, Failures: 0, Errors: 0, Skipped: 0, Time elapsed: 330.401 s - in org.apache.hadoop.hbase.filter.TestFuzzyRowFilterEndToEnd
[INFO] Tests run: 1, Failures: 0, Errors: 0, Skipped: 0, Time elapsed: 68.364 s - in org.apache.hadoop.hbase.replication.TestReplicationSyncUpToolWithBulkLoadedData
[INFO] Running org.apache.hadoop.hbase.replication.regionserver.TestReplicationSourceManager
[INFO] Running org.apache.hadoop.hbase.replication.regionserver.TestRegionReplicaReplicationEndpointNoMaster
[INFO] Running org.apache.hadoop.hbase.replication.TestSerialReplication
[INFO] Tests run: 10, Failures: 0, Errors: 0, Skipped: 0, Time elapsed: 47.023 s - in org.apache.hadoop.hbase.replication.regionserver.TestReplicationSourceManager
[INFO] Running org.apache.hadoop.hbase.replication.regionserver.TestWALEntryStream
[INFO] Tests run: 14, Failures: 0, Errors: 0, Skipped: 0, Time elapsed: 187.05 s - in org.apache.hadoop.hbase.replication.TestReplicationSmallTests
[INFO] Running org.apache.hadoop.hbase.replication.regionserver.TestReplicationSink
[INFO] Tests run: 4, Failures: 0, Errors: 0, Skipped: 0, Time elapsed: 95.16 s - in org.apache.hadoop.hbase.replication.regionserver.TestRegionReplicaReplicationEndpointNoMaster
[INFO] Tests run: 6, Failures: 0, Errors: 0, Skipped: 0, Time elapsed: 18.716 s - in org.apache.hadoop.hbase.replication.regionserver.TestReplicationSink
[INFO] Running org.apache.hadoop.hbase.replication.regionserver.TestGlobalThrottler
[INFO] Running org.apache.hadoop.hbase.replication.regionserver.TestReplicator
[INFO] Tests run: 2, Failures: 0, Errors: 0, Skipped: 0, Time elapsed: 27.502 s - in org.apache.hadoop.hbase.replication.regionserver.TestReplicator
[INFO] Running org.apache.hadoop.hbase.replication.regionserver.TestRegionReplicaReplicationEndpoint
[INFO] Tests run: 3, Failures: 0, Errors: 0, Skipped: 0, Time elapsed: 210.192 s - in org.apache.hadoop.hbase.replication.TestSerialReplication
[INFO] Tests run: 1, Failures: 0, Errors: 0, Skipped: 0, Time elapsed: 95.682 s - in org.apache.hadoop.hbase.replication.regionserver.TestGlobalThrottler
[INFO] Running org.apache.hadoop.hbase.replication.multiwal.TestReplicationKillMasterRSCompressedWithMultipleWAL
[INFO] Running org.apache.hadoop.hbase.replication.multiwal.TestReplicationEndpointWithMultipleWAL
[INFO] Tests run: 8, Failures: 0, Errors: 0, Skipped: 0, Time elapsed: 353.095 s - in org.apache.hadoop.hbase.replication.TestMasterReplication
[INFO] Tests run: 7, Failures: 0, Errors: 0, Skipped: 0, Time elapsed: 27.882 s - in org.apache.hadoop.hbase.replication.multiwal.TestReplicationEndpointWithMultipleWAL
[INFO] Tests run: 1, Failures: 0, Errors: 0, Skipped: 0, Time elapsed: 38.342 s - in org.apache.hadoop.hbase.replication.multiwal.TestReplicationKillMasterRSCompressedWithMultipleWAL
[INFO] Running org.apache.hadoop.hbase.replication.TestReplicationStateZKImpl
[INFO] Tests run: 9, Failures: 0, Errors: 0, Skipped: 0, Time elapsed: 3.298 s - in org.apache.hadoop.hbase.replication.TestReplicationStateZKImpl
[INFO] Tests run: 8, Failures: 0, Errors: 0, Skipped: 0, Time elapsed: 314.318 s - in org.apache.hadoop.hbase.replication.regionserver.TestWALEntryStream
[INFO] Running org.apache.hadoop.hbase.replication.TestReplicationTrackerZKImpl
[INFO] Tests run: 5, Failures: 0, Errors: 0, Skipped: 0, Time elapsed: 3.993 s - in org.apache.hadoop.hbase.replication.TestReplicationTrackerZKImpl
[INFO] Running org.apache.hadoop.hbase.replication.multiwal.TestReplicationSyncUpToolWithMultipleWAL
[INFO] Running org.apache.hadoop.hbase.replication.TestReplicationEndpoint
[INFO] Running org.apache.hadoop.hbase.replication.TestReplicationSyncUpTool
[INFO] Tests run: 7, Failures: 0, Errors: 0, Skipped: 0, Time elapsed: 27.797 s - in org.apache.hadoop.hbase.replication.TestReplicationEndpoint
[INFO] Running org.apache.hadoop.hbase.replication.TestReplicationKillMasterRS
[INFO] Tests run: 1, Failures: 0, Errors: 0, Skipped: 0, Time elapsed: 84.316 s - in org.apache.hadoop.hbase.replication.multiwal.TestReplicationSyncUpToolWithMultipleWAL
[INFO] Tests run: 1, Failures: 0, Errors: 0, Skipped: 0, Time elapsed: 32.494 s - in org.apache.hadoop.hbase.replication.TestReplicationKillMasterRS
[INFO] Running org.apache.hadoop.hbase.replication.TestReplicationKillMasterRSCompressed
[INFO] Tests run: 1, Failures: 0, Errors: 0, Skipped: 0, Time elapsed: 82.209 s - in org.apache.hadoop.hbase.replication.TestReplicationSyncUpTool
[INFO] Tests run: 1, Failures: 0, Errors: 0, Skipped: 0, Time elapsed: 31.339 s - in org.apache.hadoop.hbase.replication.TestReplicationKillMasterRSCompressed
[INFO] Running org.apache.hadoop.hbase.replication.TestReplicationStatus
[INFO] Running org.apache.hadoop.hbase.replication.TestReplicationDisableInactivePeer
[INFO] Tests run: 1, Failures: 0, Errors: 0, Skipped: 0, Time elapsed: 17.493 s - in org.apache.hadoop.hbase.replication.TestReplicationStatus
[INFO] Tests run: 9, Failures: 0, Errors: 0, Skipped: 0, Time elapsed: 344.308 s - in org.apache.hadoop.hbase.replication.regionserver.TestRegionReplicaReplicationEndpoint
[INFO] Tests run: 1, Failures: 0, Errors: 0, Skipped: 0, Time elapsed: 31.935 s - in org.apache.hadoop.hbase.replication.TestReplicationDisableInactivePeer
[INFO] 
[INFO] Results:
[INFO] 
[ERROR] Failures: 
[ERROR]   TestStochasticLoadBalancer2.testRegionReplicasOnMidClusterHighReplication:78->BalancerTestBase.testWithCluster:426->BalancerTestBase.testWithCluster:454->BalancerTestBase.assertRegionReplicaPlacement:229
Two or more region replicas are hosted on the same host after balance
[ERROR]   TestHBaseFsck.testContainedRegionOverlap:1163 expected:<[OVERLAP_IN_REGION_CHAIN]>
but was:<[NOT_IN_HDFS, NOT_IN_HDFS, NOT_IN_HDFS, NOT_IN_HDFS, SHOULD_NOT_BE_DEPLOYED, OVERLAP_IN_REGION_CHAIN]>
[ERROR]   TestHBaseFsck.testCorruptLinkDirectory:2629 expected:<[]> but was:<[SHOULD_NOT_BE_DEPLOYED,
NOT_IN_HDFS, NOT_IN_HDFS, NOT_IN_HDFS, NOT_IN_HDFS]>
[ERROR]   TestHBaseFsck.testDupeRegion:1064 expected:<[]> but was:<[SHOULD_NOT_BE_DEPLOYED,
NOT_IN_HDFS, NOT_IN_HDFS, NOT_IN_HDFS, NOT_IN_HDFS]>
[ERROR]   TestHBaseFsck.testDupeStartKey:861 expected:<[]> but was:<[SHOULD_NOT_BE_DEPLOYED,
NOT_IN_HDFS, NOT_IN_HDFS, NOT_IN_HDFS, NOT_IN_HDFS]>
[ERROR]   TestHBaseFsck.testHBaseFsck:240 expected:<[]> but was:<[SHOULD_NOT_BE_DEPLOYED,
NOT_IN_HDFS, NOT_IN_HDFS, NOT_IN_HDFS, NOT_IN_HDFS]>
[ERROR]   TestHBaseFsck.testHbckFixOrphanTable:720 expected:<[NO_TABLEINFO_FILE]> but
was:<[NOT_IN_HDFS, NOT_IN_HDFS, NOT_IN_HDFS, NOT_IN_HDFS, SHOULD_NOT_BE_DEPLOYED, NO_TABLEINFO_FILE]>
[ERROR]   TestHBaseFsck.testNoHdfsTable:1678 expected:<[NOT_IN_HDFS, NOT_IN_HDFS, NOT_IN_HDFS,
NOT_IN_HDFS]> but was:<[NOT_IN_HDFS, NOT_IN_HDFS, NOT_IN_HDFS, NOT_IN_HDFS, SHOULD_NOT_BE_DEPLOYED]>
[ERROR]   TestHBaseFsck.testNotInHdfsWithReplicas:1610 expected:<[NOT_IN_HDFS]> but
was:<[NOT_IN_HDFS, NOT_IN_HDFS, NOT_IN_HDFS, NOT_IN_HDFS, NOT_IN_HDFS, SHOULD_NOT_BE_DEPLOYED]>
[ERROR] Errors: 
[ERROR]   TestAdmin2.testCreateTableRPCTimeOut:209 » TimeoutIO java.util.concurrent.Time...
[ERROR]   TestMasterBalanceThrottling.testThrottlingByMaxRitPercent:105 » TestTimedOut t...
[ERROR] org.apache.hadoop.hbase.regionserver.TestPerColumnFamilyFlush.testCompareStoreFileCount(org.apache.hadoop.hbase.regionserver.TestPerColumnFamilyFlush)
[ERROR]   Run 1: TestPerColumnFamilyFlush.testCompareStoreFileCount:616 » TestTimedOut test
tim...
[ERROR]   Run 2: TestPerColumnFamilyFlush.testCompareStoreFileCount:622->doPut:559->Object.wait:-2
» TestTimedOut
[ERROR]   Run 3: TestPerColumnFamilyFlush.testCompareStoreFileCount:610 » ConcurrentModification
[INFO] 
[ERROR] org.apache.hadoop.hbase.regionserver.TestPerColumnFamilyFlush.testFlushingWhenLogRolling(org.apache.hadoop.hbase.regionserver.TestPerColumnFamilyFlush)
[ERROR]   Run 1: TestPerColumnFamilyFlush.testFlushingWhenLogRolling:467 » IllegalState A
mini-...
[ERROR]   Run 2: TestPerColumnFamilyFlush.testFlushingWhenLogRolling:467 » IllegalState A
mini-...
[ERROR]   Run 3: TestPerColumnFamilyFlush.testFlushingWhenLogRolling:467 » IllegalState A
mini-...
[INFO] 
[ERROR]   TestHBaseFsck.testSplitAndDupeRegionWithRegionReplica:384->cleanupTable:654->deleteTable:3206
» TestTimedOut
[WARNING] Flakes: 
[WARNING] org.apache.hadoop.hbase.client.TestAdmin1.testMergeRegions(org.apache.hadoop.hbase.client.TestAdmin1)
[ERROR]   Run 1: TestAdmin1.testMergeRegions:1417 expected:<2> but was:<3>
[INFO]   Run 2: PASS
[INFO] 
[INFO] 
[ERROR] Tests run: 2860, Failures: 9, Errors: 5, Skipped: 60, Flakes: 1
[INFO] 
[INFO] ------------------------------------------------------------------------
[INFO] Reactor Summary:
[INFO] 
[INFO] Apache HBase ...................................... SUCCESS [1:51.337s]
[INFO] Apache HBase - Checkstyle ......................... SUCCESS [15.482s]
[INFO] Apache HBase - Resource Bundle .................... SUCCESS [0.432s]
[INFO] Apache HBase - Annotations ........................ SUCCESS [1.803s]
[INFO] Apache HBase - Protocol ........................... SUCCESS [20.607s]
[INFO] Apache HBase - Common ............................. SUCCESS [3:32.402s]
[INFO] Apache HBase - Procedure .......................... SUCCESS [4:08.506s]
[INFO] Apache HBase - Metrics API ........................ SUCCESS [2.293s]
[INFO] Apache HBase - Hadoop Compatibility ............... SUCCESS [15.768s]
[INFO] Apache HBase - Metrics Implementation ............. SUCCESS [9.384s]
[INFO] Apache HBase - Hadoop Two Compatibility ........... SUCCESS [28.872s]
[INFO] Apache HBase - Client ............................. SUCCESS [2:19.612s]
[INFO] Apache HBase - Prefix Tree ........................ SUCCESS [18.050s]
[INFO] Apache HBase - Server ............................. FAILURE [2:45:07.300s]
[INFO] Apache HBase - Testing Util ....................... SKIPPED
[INFO] Apache HBase - Thrift ............................. SKIPPED
[INFO] Apache HBase - Rest ............................... SKIPPED
[INFO] Apache HBase - Shell .............................. SKIPPED
[INFO] Apache HBase - Integration Tests .................. SKIPPED
[INFO] Apache HBase - Examples ........................... SKIPPED
[INFO] Apache HBase - External Block Cache ............... SKIPPED
[INFO] Apache HBase - Assembly ........................... SKIPPED
[INFO] Apache HBase - Shaded ............................. SKIPPED
[INFO] Apache HBase - Shaded - Client .................... SKIPPED
[INFO] Apache HBase - Shaded - Server .................... SKIPPED
[INFO] Apache HBase Shaded Packaging Invariants .......... SKIPPED
[INFO] Apache HBase - Archetypes ......................... SKIPPED
[INFO] Apache HBase - Exemplar for hbase-client archetype  SKIPPED
[INFO] Apache HBase - Exemplar for hbase-shaded-client archetype  SKIPPED
[INFO] Apache HBase - Archetype builder .................. SKIPPED
[INFO] ------------------------------------------------------------------------
[INFO] BUILD FAILURE
[INFO] ------------------------------------------------------------------------
[INFO] Total time: 2:59:25.957s
[INFO] Finished at: Mon Oct 23 09:32:23 UTC 2017
[INFO] Final Memory: 102M/690M
[INFO] ------------------------------------------------------------------------
[ERROR] Failed to execute goal org.apache.maven.plugins:maven-surefire-plugin:2.20.1:test
(secondPartTestsExecution) on project hbase-server: There are test failures.
[ERROR] 
[ERROR] Please refer to <https://builds.apache.org/job/HBase-1.4/jdk=JDK_1_7,label=Hadoop&&!H13/ws/hbase-server/target/surefire-reports>
for the individual test results.
[ERROR] Please refer to dump files (if any exist) [date]-jvmRun[N].dump, [date].dumpstream
and [date]-jvmRun[N].dumpstream.
[ERROR] -> [Help 1]
[ERROR] 
[ERROR] To see the full stack trace of the errors, re-run Maven with the -e switch.
[ERROR] Re-run Maven using the -X switch to enable full debug logging.
[ERROR] 
[ERROR] For more information about the errors and possible solutions, please read the following
articles:
[ERROR] [Help 1] http://cwiki.apache.org/confluence/display/MAVEN/MojoFailureException
[ERROR] 
[ERROR] After correcting the problems, you can resume the build with the command
[ERROR]   mvn <goals> -rf :hbase-server
Build step 'Invoke top-level Maven targets' marked build as failure
Performing Post build task...
Match found for :.* : True
Logical operation result is TRUE
Running script  : # Post-build task script. TODO: Check this in and have all builds reference
check-in.
pwd && ls
# NOTE!!!! The below code has been copied and pasted from ./dev-tools/run-test.sh
# Do not change here without syncing there and vice-versa.
ZOMBIE_TESTS_COUNT=`jps -v | grep surefirebooter | grep -e '-Dhbase.test' | wc -l`
if [[ $ZOMBIE_TESTS_COUNT != 0 ]] ; then
 echo "Suspicious java process found - waiting 30s to see if there are just slow to stop"
 sleep 30
 ZOMBIE_TESTS_COUNT=`jps -v | grep surefirebooter | grep -e '-Dhbase.test' | wc -l`
 if [[ $ZOMBIE_TESTS_COUNT != 0 ]] ; then
   echo " {color:red}There appear to be $ZOMBIE_TESTS_COUNT zombie tests{color}, they should
have been killed by surefire but survived"
   jps -v | grep surefirebooter | grep -e '-Dhbase.test'
   jps -v | grep surefirebooter | grep -e '-Dhbase.test' | cut -d ' ' -f 1 | xargs -n 1 jstack
   # Exit with error
   exit 1
 else
   echo "We're ok: there is no zombie test, but some tests took some time to stop"
 fi
else
  echo "We're ok: there is no zombie test"
fi
Setting JDK_1_7_LATEST__HOME=/home/jenkins/tools/java/latest1.7
Setting JDK_1_8_LATEST__HOME=/home/jenkins/tools/java/latest1.8
[19ccb43d] $ /bin/bash -xe /tmp/jenkins6587128620936518363.sh
+ pwd
<https://builds.apache.org/job/HBase-1.4/jdk=JDK_1_7,label=Hadoop&&!H13/ws/>
+ ls
bin
CHANGES.txt
conf
dev-support
extra_env_var
hbase-annotations
hbase-archetypes
hbase-assembly
hbase-checkstyle
hbase-client
hbase-common
hbase-examples
hbase-external-blockcache
hbase-hadoop2-compat
hbase-hadoop-compat
hbase-it
hbase-metrics
hbase-metrics-api
hbase-native-client
hbase-prefix-tree
hbase-procedure
hbase-protocol
hbase-resource-bundle
hbase-rest
hbase-server
hbase-shaded
hbase-shell
hbase-testing-util
hbase-thrift
LICENSE.txt
NOTICE.txt
pom.xml
README.txt
src
target
++ wc -l
++ grep -e -Dhbase.test
++ grep surefirebooter
++ jps -v
+ ZOMBIE_TESTS_COUNT=0
+ [[ 0 != 0 ]]
+ echo 'We'\''re ok: there is no zombie test'
We're ok: there is no zombie test
POST BUILD TASK : SUCCESS
END OF POST BUILD TASK : 0
Archiving artifacts
Setting JDK_1_7_LATEST__HOME=/home/jenkins/tools/java/latest1.7
Setting JDK_1_8_LATEST__HOME=/home/jenkins/tools/java/latest1.8
Recording test results
Setting JDK_1_7_LATEST__HOME=/home/jenkins/tools/java/latest1.7
Setting JDK_1_8_LATEST__HOME=/home/jenkins/tools/java/latest1.8
Setting JDK_1_7_LATEST__HOME=/home/jenkins/tools/java/latest1.7
Setting JDK_1_8_LATEST__HOME=/home/jenkins/tools/java/latest1.8

Mime
View raw message