hbase-builds mailing list archives

Site index · List index
Message view « Date » · « Thread »
Top « Date » · « Thread »
From Apache Jenkins Server <jenk...@builds.apache.org>
Subject Build failed in Jenkins: HBase-Trunk_matrix » JDK 1.8 (latest),Hadoop #3693
Date Sun, 10 Sep 2017 21:32:44 GMT
See <https://builds.apache.org/job/HBase-Trunk_matrix/jdk=JDK%201.8%20(latest),label=Hadoop/3693/display/redirect?page=changes>

Changes:

[chia7712] HBASE-18421 update hadoop prerequisites docs to call out 2.8.1

------------------------------------------
[...truncated 1.07 MB...]
[INFO] --- maven-enforcer-plugin:1.4.1:enforce (banned-jsr305) @ hbase-resource-bundle ---
[INFO] 
[INFO] --- maven-enforcer-plugin:1.4.1:enforce (banned-scala) @ hbase-resource-bundle ---
[INFO] 
[INFO] --- maven-enforcer-plugin:1.4.1:enforce (banned-hbase-spark) @ hbase-resource-bundle
---
[INFO] 
[INFO] --- buildnumber-maven-plugin:1.4:create-timestamp (default) @ hbase-resource-bundle
---
[INFO] 
[INFO] --- maven-remote-resources-plugin:1.5:process (process-resource-bundles) @ hbase-resource-bundle
---
[INFO] 
[INFO] --- maven-remote-resources-plugin:1.5:bundle (build-hbase-resource-bundle) @ hbase-resource-bundle
---
[INFO] 
[INFO] --- maven-resources-plugin:2.7:resources (default-resources) @ hbase-resource-bundle
---
[INFO] Using 'UTF-8' encoding to copy filtered resources.
[INFO] skip non existing resourceDirectory <https://builds.apache.org/job/HBase-Trunk_matrix/jdk=JDK%201.8%20(latest),label=Hadoop/ws/hbase-resource-bundle/src/main/resources>
[INFO] Copying 3 resources
[INFO] 
[INFO] --- maven-enforcer-plugin:1.4.1:enforce (check-aggregate-license) @ hbase-resource-bundle
---
[INFO] Skipping Rule Enforcement.
[INFO] 
[INFO] --- maven-compiler-plugin:3.6.1:compile (default-compile) @ hbase-resource-bundle ---
[INFO] No sources to compile
[INFO] 
[INFO] --- maven-resources-plugin:2.7:testResources (default-testResources) @ hbase-resource-bundle
---
[INFO] Not copying test resources
[INFO] 
[INFO] --- maven-compiler-plugin:3.6.1:testCompile (default-testCompile) @ hbase-resource-bundle
---
[INFO] Not compiling test sources
[INFO] 
[INFO] --- maven-surefire-plugin:2.19.1:test (default-test) @ hbase-resource-bundle ---
[INFO] No tests to run.
[INFO] 
[INFO] --- maven-surefire-plugin:2.19.1:test (secondPartTestsExecution) @ hbase-resource-bundle
---
[INFO] No tests to run.
[INFO] 
[INFO] --- maven-jar-plugin:3.0.0:test-jar (default) @ hbase-resource-bundle ---
[INFO] Skipping packaging of the test-jar
[INFO] 
[INFO] --- maven-jar-plugin:3.0.0:jar (default-jar) @ hbase-resource-bundle ---
[INFO]                                                                         
[INFO] ------------------------------------------------------------------------
[INFO] Skipping Apache HBase - Testing Util
[INFO] This project has been banned from the build due to previous failures.
[INFO] ------------------------------------------------------------------------
[INFO]                                                                         
[INFO] ------------------------------------------------------------------------
[INFO] Skipping Apache HBase - Thrift
[INFO] This project has been banned from the build due to previous failures.
[INFO] ------------------------------------------------------------------------
[INFO]                                                                         
[INFO] ------------------------------------------------------------------------
[INFO] Skipping Apache HBase - RSGroup
[INFO] This project has been banned from the build due to previous failures.
[INFO] ------------------------------------------------------------------------
[INFO]                                                                         
[INFO] ------------------------------------------------------------------------
[INFO] Skipping Apache HBase - Shell
[INFO] This project has been banned from the build due to previous failures.
[INFO] ------------------------------------------------------------------------
[INFO]                                                                         
[INFO] ------------------------------------------------------------------------
[INFO] Skipping Apache HBase - Coprocessor Endpoint
[INFO] This project has been banned from the build due to previous failures.
[INFO] ------------------------------------------------------------------------
[INFO]                                                                         
[INFO] ------------------------------------------------------------------------
[INFO] Skipping Apache HBase - Backup
[INFO] This project has been banned from the build due to previous failures.
[INFO] ------------------------------------------------------------------------
[INFO]                                                                         
[INFO] ------------------------------------------------------------------------
[INFO] Skipping Apache HBase - Integration Tests
[INFO] This project has been banned from the build due to previous failures.
[INFO] ------------------------------------------------------------------------
[INFO]                                                                         
[INFO] ------------------------------------------------------------------------
[INFO] Skipping Apache HBase - Examples
[INFO] This project has been banned from the build due to previous failures.
[INFO] ------------------------------------------------------------------------
[INFO]                                                                         
[INFO] ------------------------------------------------------------------------
[INFO] Skipping Apache HBase - Rest
[INFO] This project has been banned from the build due to previous failures.
[INFO] ------------------------------------------------------------------------
[INFO]                                                                         
[INFO] ------------------------------------------------------------------------
[INFO] Skipping Apache HBase - External Block Cache
[INFO] This project has been banned from the build due to previous failures.
[INFO] ------------------------------------------------------------------------
[INFO]                                                                         
[INFO] ------------------------------------------------------------------------
[INFO] Skipping Apache HBase - Spark
[INFO] This project has been banned from the build due to previous failures.
[INFO] ------------------------------------------------------------------------
[INFO]                                                                         
[INFO] ------------------------------------------------------------------------
[INFO] Skipping Apache HBase - Spark Integration Tests
[INFO] This project has been banned from the build due to previous failures.
[INFO] ------------------------------------------------------------------------
[INFO]                                                                         
[INFO] ------------------------------------------------------------------------
[INFO] Skipping Apache HBase - Assembly
[INFO] This project has been banned from the build due to previous failures.
[INFO] ------------------------------------------------------------------------
[INFO]                                                                         
[INFO] ------------------------------------------------------------------------
[INFO] Skipping Apache HBase - Shaded
[INFO] This project has been banned from the build due to previous failures.
[INFO] ------------------------------------------------------------------------
[INFO]                                                                         
[INFO] ------------------------------------------------------------------------
[INFO] Skipping Apache HBase - Shaded - Client
[INFO] This project has been banned from the build due to previous failures.
[INFO] ------------------------------------------------------------------------
[INFO]                                                                         
[INFO] ------------------------------------------------------------------------
[INFO] Skipping Apache HBase - Shaded - MapReduce
[INFO] This project has been banned from the build due to previous failures.
[INFO] ------------------------------------------------------------------------
[INFO]                                                                         
[INFO] ------------------------------------------------------------------------
[INFO] Skipping Apache HBase Shaded Packaging Invariants
[INFO] This project has been banned from the build due to previous failures.
[INFO] ------------------------------------------------------------------------
[INFO]                                                                         
[INFO] ------------------------------------------------------------------------
[INFO] Building Apache HBase - Archetypes 3.0.0-SNAPSHOT
[INFO] ------------------------------------------------------------------------
[INFO] 
[INFO] --- build-helper-maven-plugin:3.0.0:bsh-property (negate-license-bundles-property)
@ hbase-archetypes ---
[INFO] 
[INFO] --- maven-enforcer-plugin:1.4.1:enforce (min-maven-min-java-banned-xerces) @ hbase-archetypes
---
[INFO] 
[INFO] --- maven-enforcer-plugin:1.4.1:enforce (banned-jsr305) @ hbase-archetypes ---
[INFO] 
[INFO] --- maven-enforcer-plugin:1.4.1:enforce (banned-scala) @ hbase-archetypes ---
[INFO] 
[INFO] --- maven-enforcer-plugin:1.4.1:enforce (banned-hbase-spark) @ hbase-archetypes ---
[INFO] 
[INFO] --- buildnumber-maven-plugin:1.4:create-timestamp (default) @ hbase-archetypes ---
[INFO] 
[INFO] --- maven-remote-resources-plugin:1.5:process (process-resource-bundles) @ hbase-archetypes
---
[INFO] 
[INFO] --- maven-enforcer-plugin:1.4.1:enforce (check-aggregate-license) @ hbase-archetypes
---
[INFO] Skipping Rule Enforcement.
[INFO] 
[INFO] --- findbugs-maven-plugin:3.0.0:findbugs (default) @ hbase-archetypes ---
[INFO] 
[INFO] --- maven-install-plugin:2.5.2:install (default-install) @ hbase-archetypes ---
[INFO] Installing <https://builds.apache.org/job/HBase-Trunk_matrix/jdk=JDK%201.8%20(latest),label=Hadoop/3693/artifact/hbase-archetypes/pom.xml>
to /home/jenkins/.m2/repository/org/apache/hbase/hbase-archetypes/3.0.0-SNAPSHOT/hbase-archetypes-3.0.0-SNAPSHOT.pom
[INFO]                                                                         
[INFO] ------------------------------------------------------------------------
[INFO] Skipping Apache HBase - Exemplar for hbase-client archetype
[INFO] This project has been banned from the build due to previous failures.
[INFO] ------------------------------------------------------------------------
[INFO]                                                                         
[INFO] ------------------------------------------------------------------------
[INFO] Skipping Apache HBase - Exemplar for hbase-shaded-client archetype
[INFO] This project has been banned from the build due to previous failures.
[INFO] ------------------------------------------------------------------------
[INFO]                                                                         
[INFO] ------------------------------------------------------------------------
[INFO] Skipping Apache HBase - Archetype builder
[INFO] This project has been banned from the build due to previous failures.
[INFO] ------------------------------------------------------------------------
[INFO] ------------------------------------------------------------------------
[INFO] Reactor Summary:
[INFO] 
[INFO] Apache HBase ...................................... SUCCESS [2.289s]
[INFO] Apache HBase - Checkstyle ......................... SUCCESS [0.594s]
[INFO] Apache HBase - Build Support ...................... SUCCESS [0.068s]
[INFO] Apache HBase - Error Prone Rules .................. SUCCESS [0.248s]
[INFO] Apache HBase - Build Configuration ................ SUCCESS [0.049s]
[INFO] Apache HBase - Annotations ........................ SUCCESS [0.341s]
[INFO] Apache HBase - Shaded Protocol .................... SUCCESS [24.879s]
[INFO] Apache HBase - Common ............................. SUCCESS [2:08.729s]
[INFO] Apache HBase - Metrics API ........................ SUCCESS [1.636s]
[INFO] Apache HBase - Hadoop Compatibility ............... SUCCESS [13.024s]
[INFO] Apache HBase - Metrics Implementation ............. SUCCESS [7.076s]
[INFO] Apache HBase - Hadoop Two Compatibility ........... SUCCESS [16.053s]
[INFO] Apache HBase - Protocol ........................... SUCCESS [0.674s]
[INFO] Apache HBase - Client ............................. FAILURE [2:02.154s]
[INFO] Apache HBase - Replication ........................ SKIPPED
[INFO] Apache HBase - Prefix Tree ........................ FAILURE [0.751s]
[INFO] Apache HBase - Procedure .......................... FAILURE [0.457s]
[INFO] Apache HBase - Server ............................. SKIPPED
[INFO] Apache HBase - MapReduce .......................... SKIPPED
[INFO] Apache HBase - Resource Bundle .................... FAILURE [0.057s]
[INFO] Apache HBase - Testing Util ....................... SKIPPED
[INFO] Apache HBase - Thrift ............................. SKIPPED
[INFO] Apache HBase - RSGroup ............................ SKIPPED
[INFO] Apache HBase - Shell .............................. SKIPPED
[INFO] Apache HBase - Coprocessor Endpoint ............... SKIPPED
[INFO] Apache HBase - Backup ............................. SKIPPED
[INFO] Apache HBase - Integration Tests .................. SKIPPED
[INFO] Apache HBase - Examples ........................... SKIPPED
[INFO] Apache HBase - Rest ............................... SKIPPED
[INFO] Apache HBase - External Block Cache ............... SKIPPED
[INFO] Apache HBase - Spark .............................. SKIPPED
[INFO] Apache HBase - Spark Integration Tests ............ SKIPPED
[INFO] Apache HBase - Assembly ........................... SKIPPED
[INFO] Apache HBase - Shaded ............................. SKIPPED
[INFO] Apache HBase - Shaded - Client .................... SKIPPED
[INFO] Apache HBase - Shaded - MapReduce ................. SKIPPED
[INFO] Apache HBase Shaded Packaging Invariants .......... SKIPPED
[INFO] Apache HBase - Archetypes ......................... FAILURE [0.040s]
[INFO] Apache HBase - Exemplar for hbase-client archetype  SKIPPED
[INFO] Apache HBase - Exemplar for hbase-shaded-client archetype  SKIPPED
[INFO] Apache HBase - Archetype builder .................. SKIPPED
[INFO] ------------------------------------------------------------------------
[INFO] BUILD FAILURE
[INFO] ------------------------------------------------------------------------
[INFO] Total time: 5:20.567s
[INFO] Finished at: Sun Sep 10 21:31:38 UTC 2017
[INFO] Final Memory: 87M/3965M
[INFO] ------------------------------------------------------------------------
[ERROR] Failed to execute goal org.apache.maven.plugins:maven-surefire-plugin:2.19.1:test
(secondPartTestsExecution) on project hbase-client: There are test failures.
[ERROR] 
[ERROR] Please refer to <https://builds.apache.org/job/HBase-Trunk_matrix/jdk=JDK%201.8%20(latest),label=Hadoop/ws/hbase-client/target/surefire-reports>
for the individual test results.
[ERROR] -> [Help 1]
[ERROR] Failed to execute goal org.apache.maven.plugins:maven-source-plugin:3.0.0:jar-no-fork
(attach-sources) on project hbase-prefix-tree: Error creating source archive: <https://builds.apache.org/job/HBase-Trunk_matrix/jdk=JDK%201.8%20(latest),label=Hadoop/3693/artifact/hbase-prefix-tree/pom.xml>
isn't a file. -> [Help 2]
[ERROR] Failed to execute goal org.apache.maven.plugins:maven-source-plugin:3.0.0:jar-no-fork
(attach-sources) on project hbase-procedure: Error creating source archive: <https://builds.apache.org/job/HBase-Trunk_matrix/jdk=JDK%201.8%20(latest),label=Hadoop/3693/artifact/hbase-procedure/pom.xml>
isn't a file. -> [Help 2]
[ERROR] Failed to execute goal org.apache.maven.plugins:maven-jar-plugin:3.0.0:jar (default-jar)
on project hbase-resource-bundle: Error assembling JAR: <https://builds.apache.org/job/HBase-Trunk_matrix/jdk=JDK%201.8%20(latest),label=Hadoop/3693/artifact/hbase-resource-bundle/pom.xml>
isn't a file. -> [Help 2]
[ERROR] Failed to execute goal org.apache.maven.plugins:maven-install-plugin:2.5.2:install
(default-install) on project hbase-archetypes: Failed to install artifact org.apache.hbase:hbase-archetypes:pom:3.0.0-SNAPSHOT:
<https://builds.apache.org/job/HBase-Trunk_matrix/jdk=JDK%201.8%20(latest),label=Hadoop/3693/artifact/hbase-archetypes/pom.xml>
(No such file or directory) -> [Help 2]
[ERROR] 
[ERROR] To see the full stack trace of the errors, re-run Maven with the -e switch.
[ERROR] Re-run Maven using the -X switch to enable full debug logging.
[ERROR] 
[ERROR] For more information about the errors and possible solutions, please read the following
articles:
[ERROR] [Help 1] http://cwiki.apache.org/confluence/display/MAVEN/MojoFailureException
[ERROR] [Help 2] http://cwiki.apache.org/confluence/display/MAVEN/MojoExecutionException
[ERROR] 
[ERROR] After correcting the problems, you can resume the build with the command
[ERROR]   mvn <goals> -rf :hbase-client
Build step 'Invoke top-level Maven targets' marked build as failure
Performing Post build task...
Match found for :.* : True
Logical operation result is TRUE
Running script  : # Run zombie detector script
./dev-support/zombie-detector.sh --jenkins ${BUILD_ID}
[a3159d73] $ /bin/bash -xe /tmp/jenkins1701552542795530920.sh
+ ./dev-support/zombie-detector.sh --jenkins 3693
/tmp/jenkins1701552542795530920.sh: line 3: ./dev-support/zombie-detector.sh: No such file
or directory
POST BUILD TASK : FAILURE
END OF POST BUILD TASK : 0
Archiving artifacts
Recording test results
[FINDBUGS] Skipping publisher since build result is FAILURE
[CHECKSTYLE] Skipping publisher since build result is FAILURE

Mime
View raw message