hbase-builds mailing list archives

Site index · List index
Message view « Date » · « Thread »
Top « Date » · « Thread »
From Apache Jenkins Server <jenk...@builds.apache.org>
Subject Build failed in Jenkins: HBase-1.5 » JDK_1_7,Hadoop&&!H13 #52
Date Fri, 08 Sep 2017 19:40:31 GMT
See <https://builds.apache.org/job/HBase-1.5/jdk=JDK_1_7,label=Hadoop&&!H13/52/display/redirect?page=changes>

Changes:

[tedyu] HBASE-18641 Include block content verification logic used in lruCache in

------------------------------------------
[...truncated 2.29 MB...]
Tests run: 1, Failures: 0, Errors: 0, Skipped: 0, Time elapsed: 0.842 sec - in org.apache.hadoop.hbase.http.TestGlobalFilter
Running org.apache.hadoop.hbase.http.TestHttpServerLifecycle
Tests run: 6, Failures: 0, Errors: 0, Skipped: 6, Time elapsed: 0.002 sec - in org.apache.hadoop.hbase.http.TestHttpServerLifecycle
Running org.apache.hadoop.hbase.http.TestHttpRequestLog
Tests run: 2, Failures: 0, Errors: 0, Skipped: 0, Time elapsed: 0.38 sec - in org.apache.hadoop.hbase.http.TestHttpRequestLog
Running org.apache.hadoop.hbase.http.TestHttpServerWebapps
Tests run: 2, Failures: 0, Errors: 0, Skipped: 0, Time elapsed: 0.477 sec - in org.apache.hadoop.hbase.http.TestHttpServerWebapps
Running org.apache.hadoop.hbase.http.TestHttpServer
Tests run: 16, Failures: 0, Errors: 0, Skipped: 3, Time elapsed: 2.672 sec - in org.apache.hadoop.hbase.http.TestHttpServer
Running org.apache.hadoop.hbase.http.TestSSLHttpServer
Tests run: 1, Failures: 0, Errors: 0, Skipped: 0, Time elapsed: 0.504 sec - in org.apache.hadoop.hbase.http.TestSSLHttpServer
Running org.apache.hadoop.hbase.TestPerformanceEvaluation
Tests run: 4, Failures: 0, Errors: 0, Skipped: 0, Time elapsed: 0.964 sec - in org.apache.hadoop.hbase.TestPerformanceEvaluation
Running org.apache.hadoop.hbase.filter.TestParseFilter
Tests run: 35, Failures: 0, Errors: 0, Skipped: 0, Time elapsed: 1.593 sec - in org.apache.hadoop.hbase.filter.TestParseFilter
Running org.apache.hadoop.hbase.filter.TestComparatorSerialization
Tests run: 6, Failures: 0, Errors: 0, Skipped: 0, Time elapsed: 1.297 sec - in org.apache.hadoop.hbase.filter.TestComparatorSerialization
Running org.apache.hadoop.hbase.filter.TestSingleColumnValueExcludeFilter
Tests run: 1, Failures: 0, Errors: 0, Skipped: 0, Time elapsed: 0.291 sec - in org.apache.hadoop.hbase.filter.TestSingleColumnValueExcludeFilter
Running org.apache.hadoop.hbase.filter.TestFilterSerialization
Tests run: 26, Failures: 0, Errors: 0, Skipped: 0, Time elapsed: 1.982 sec - in org.apache.hadoop.hbase.filter.TestFilterSerialization
Running org.apache.hadoop.hbase.filter.TestFilterFromRegionSide
Tests run: 2, Failures: 0, Errors: 0, Skipped: 0, Time elapsed: 0.403 sec - in org.apache.hadoop.hbase.filter.TestFilterFromRegionSide
Running org.apache.hadoop.hbase.filter.TestFilterList
Tests run: 13, Failures: 0, Errors: 0, Skipped: 0, Time elapsed: 1.308 sec - in org.apache.hadoop.hbase.filter.TestFilterList
Running org.apache.hadoop.hbase.filter.TestNullComparator
Tests run: 3, Failures: 0, Errors: 0, Skipped: 0, Time elapsed: 0.446 sec - in org.apache.hadoop.hbase.filter.TestNullComparator
Running org.apache.hadoop.hbase.filter.TestRegexComparator
Tests run: 3, Failures: 0, Errors: 0, Skipped: 0, Time elapsed: 0.719 sec - in org.apache.hadoop.hbase.filter.TestRegexComparator
Running org.apache.hadoop.hbase.filter.TestDependentColumnFilter
Tests run: 4, Failures: 0, Errors: 0, Skipped: 0, Time elapsed: 2.15 sec - in org.apache.hadoop.hbase.filter.TestDependentColumnFilter
Running org.apache.hadoop.hbase.filter.TestPrefixFilter
Tests run: 3, Failures: 0, Errors: 0, Skipped: 0, Time elapsed: 0.349 sec - in org.apache.hadoop.hbase.filter.TestPrefixFilter
Running org.apache.hadoop.hbase.filter.TestFirstKeyValueMatchingQualifiersFilter
Tests run: 1, Failures: 0, Errors: 0, Skipped: 0, Time elapsed: 0.292 sec - in org.apache.hadoop.hbase.filter.TestFirstKeyValueMatchingQualifiersFilter
Running org.apache.hadoop.hbase.filter.TestFuzzyRowFilter
Tests run: 6, Failures: 0, Errors: 0, Skipped: 0, Time elapsed: 0.559 sec - in org.apache.hadoop.hbase.filter.TestFuzzyRowFilter
Running org.apache.hadoop.hbase.filter.TestMultipleColumnPrefixFilter
Tests run: 3, Failures: 0, Errors: 0, Skipped: 0, Time elapsed: 6.278 sec - in org.apache.hadoop.hbase.filter.TestMultipleColumnPrefixFilter
Running org.apache.hadoop.hbase.filter.TestSingleColumnValueFilter
Tests run: 3, Failures: 0, Errors: 0, Skipped: 0, Time elapsed: 1.189 sec - in org.apache.hadoop.hbase.filter.TestSingleColumnValueFilter
Running org.apache.hadoop.hbase.filter.TestColumnPrefixFilter
Tests run: 2, Failures: 0, Errors: 0, Skipped: 0, Time elapsed: 4.546 sec - in org.apache.hadoop.hbase.filter.TestColumnPrefixFilter
Running org.apache.hadoop.hbase.filter.TestBitComparator
Tests run: 6, Failures: 0, Errors: 0, Skipped: 0, Time elapsed: 0.655 sec - in org.apache.hadoop.hbase.filter.TestBitComparator
Running org.apache.hadoop.hbase.filter.TestInclusiveStopFilter
Tests run: 2, Failures: 0, Errors: 0, Skipped: 0, Time elapsed: 0.32 sec - in org.apache.hadoop.hbase.filter.TestInclusiveStopFilter
Running org.apache.hadoop.hbase.filter.TestPageFilter
Tests run: 2, Failures: 0, Errors: 0, Skipped: 0, Time elapsed: 0.395 sec - in org.apache.hadoop.hbase.filter.TestPageFilter
Running org.apache.hadoop.hbase.filter.TestRandomRowFilter
Tests run: 2, Failures: 0, Errors: 0, Skipped: 0, Time elapsed: 0.672 sec - in org.apache.hadoop.hbase.filter.TestRandomRowFilter
Running org.apache.hadoop.hbase.filter.TestFilter
Tests run: 27, Failures: 0, Errors: 0, Skipped: 0, Time elapsed: 6.738 sec - in org.apache.hadoop.hbase.filter.TestFilter
Running org.apache.hadoop.hbase.filter.TestInvocationRecordFilter
Tests run: 1, Failures: 0, Errors: 0, Skipped: 0, Time elapsed: 1.918 sec - in org.apache.hadoop.hbase.filter.TestInvocationRecordFilter
Running org.apache.hadoop.hbase.filter.TestColumnPaginationFilter
Tests run: 1, Failures: 0, Errors: 0, Skipped: 0, Time elapsed: 0.982 sec - in org.apache.hadoop.hbase.filter.TestColumnPaginationFilter
Running org.apache.hadoop.hbase.constraint.TestConstraints
Tests run: 6, Failures: 0, Errors: 0, Skipped: 0, Time elapsed: 1.402 sec - in org.apache.hadoop.hbase.constraint.TestConstraints
Running org.apache.hadoop.hbase.protobuf.TestProtobufUtil
Tests run: 7, Failures: 0, Errors: 0, Skipped: 0, Time elapsed: 1.429 sec - in org.apache.hadoop.hbase.protobuf.TestProtobufUtil
Running org.apache.hadoop.hbase.protobuf.TestReplicationProtobuf
Tests run: 1, Failures: 0, Errors: 0, Skipped: 0, Time elapsed: 0.408 sec - in org.apache.hadoop.hbase.protobuf.TestReplicationProtobuf
Running org.apache.hadoop.hbase.TestSerialization
Tests run: 9, Failures: 0, Errors: 0, Skipped: 0, Time elapsed: 1.6 sec - in org.apache.hadoop.hbase.TestSerialization
Running org.apache.hadoop.hbase.codec.TestCellMessageCodec
Tests run: 3, Failures: 0, Errors: 0, Skipped: 0, Time elapsed: 0.398 sec - in org.apache.hadoop.hbase.codec.TestCellMessageCodec
Running org.apache.hadoop.hbase.quotas.TestRateLimiter
Tests run: 15, Failures: 0, Errors: 0, Skipped: 0, Time elapsed: 0.776 sec - in org.apache.hadoop.hbase.quotas.TestRateLimiter
Running org.apache.hadoop.hbase.quotas.TestQuotaState
Tests run: 5, Failures: 0, Errors: 0, Skipped: 0, Time elapsed: 1.16 sec - in org.apache.hadoop.hbase.quotas.TestQuotaState
Running org.apache.hadoop.hbase.TestServerName
Tests run: 7, Failures: 0, Errors: 0, Skipped: 0, Time elapsed: 0.55 sec - in org.apache.hadoop.hbase.TestServerName
Running org.apache.hadoop.hbase.wal.TestWALMethods
Tests run: 5, Failures: 0, Errors: 0, Skipped: 0, Time elapsed: 1.086 sec - in org.apache.hadoop.hbase.wal.TestWALMethods
Running org.apache.hadoop.hbase.errorhandling.TestForeignExceptionDispatcher
Tests run: 3, Failures: 0, Errors: 0, Skipped: 0, Time elapsed: 0.544 sec - in org.apache.hadoop.hbase.errorhandling.TestForeignExceptionDispatcher
Running org.apache.hadoop.hbase.errorhandling.TestForeignExceptionSerialization
Tests run: 2, Failures: 0, Errors: 0, Skipped: 0, Time elapsed: 0.461 sec - in org.apache.hadoop.hbase.errorhandling.TestForeignExceptionSerialization
Running org.apache.hadoop.hbase.errorhandling.TestTimeoutExceptionInjector
Tests run: 4, Failures: 0, Errors: 0, Skipped: 0, Time elapsed: 0.638 sec - in org.apache.hadoop.hbase.errorhandling.TestTimeoutExceptionInjector
Running org.apache.hadoop.hbase.replication.master.TestTableCFsUpdater
Tests run: 1, Failures: 0, Errors: 0, Skipped: 0, Time elapsed: 0.143 sec - in org.apache.hadoop.hbase.replication.master.TestTableCFsUpdater
Running org.apache.hadoop.hbase.replication.regionserver.TestReplicationThrottler
Tests run: 1, Failures: 0, Errors: 0, Skipped: 0, Time elapsed: 0.293 sec - in org.apache.hadoop.hbase.replication.regionserver.TestReplicationThrottler
Running org.apache.hadoop.hbase.replication.regionserver.TestReplicationSinkManager
Tests run: 5, Failures: 0, Errors: 0, Skipped: 0, Time elapsed: 1.022 sec - in org.apache.hadoop.hbase.replication.regionserver.TestReplicationSinkManager
Running org.apache.hadoop.hbase.replication.TestReplicationWALEntryFilters
Tests run: 4, Failures: 0, Errors: 0, Skipped: 0, Time elapsed: 0.748 sec - in org.apache.hadoop.hbase.replication.TestReplicationWALEntryFilters
Running org.apache.hadoop.hbase.TestServerLoad
Tests run: 3, Failures: 0, Errors: 0, Skipped: 0, Time elapsed: 0.452 sec - in org.apache.hadoop.hbase.TestServerLoad
Running org.apache.hadoop.hbase.coprocessor.TestCoprocessorHost
Tests run: 1, Failures: 0, Errors: 0, Skipped: 0, Time elapsed: 0.526 sec - in org.apache.hadoop.hbase.coprocessor.TestCoprocessorHost
Running org.apache.hadoop.hbase.coprocessor.TestRegionObserverStacking
Tests run: 1, Failures: 0, Errors: 0, Skipped: 0, Time elapsed: 1.704 sec - in org.apache.hadoop.hbase.coprocessor.TestRegionObserverStacking
Running org.apache.hadoop.hbase.coprocessor.TestCoprocessorInterface
Tests run: 2, Failures: 0, Errors: 0, Skipped: 0, Time elapsed: 7.642 sec - in org.apache.hadoop.hbase.coprocessor.TestCoprocessorInterface
Running org.apache.hadoop.hbase.coprocessor.TestCoprocessorConfiguration
Tests run: 5, Failures: 0, Errors: 0, Skipped: 0, Time elapsed: 0.749 sec - in org.apache.hadoop.hbase.coprocessor.TestCoprocessorConfiguration

Results :

Failed tests: 
org.apache.hadoop.hbase.io.hfile.TestBlockCacheReporting.testLruBlockCache(org.apache.hadoop.hbase.io.hfile.TestBlockCacheReporting)
  Run 1: TestBlockCacheReporting.testLruBlockCache:103->addDataAndHits:70 expected:<6>
but was:<9>
  Run 2: TestBlockCacheReporting.testLruBlockCache:103->addDataAndHits:70 expected:<6>
but was:<18>
  Run 3: TestBlockCacheReporting.testLruBlockCache:103->addDataAndHits:70 expected:<6>
but was:<27>


Tests run: 1137, Failures: 1, Errors: 0, Skipped: 22

[INFO] ------------------------------------------------------------------------
[INFO] Reactor Summary:
[INFO] 
[INFO] Apache HBase ...................................... SUCCESS [1:45.435s]
[INFO] Apache HBase - Checkstyle ......................... SUCCESS [15.665s]
[INFO] Apache HBase - Resource Bundle .................... SUCCESS [0.327s]
[INFO] Apache HBase - Annotations ........................ SUCCESS [1.394s]
[INFO] Apache HBase - Protocol ........................... SUCCESS [18.607s]
[INFO] Apache HBase - Common ............................. SUCCESS [2:59.665s]
[INFO] Apache HBase - Procedure .......................... SUCCESS [3:37.872s]
[INFO] Apache HBase - Metrics API ........................ SUCCESS [1.890s]
[INFO] Apache HBase - Hadoop Compatibility ............... SUCCESS [11.956s]
[INFO] Apache HBase - Metrics Implementation ............. SUCCESS [5.741s]
[INFO] Apache HBase - Hadoop Two Compatibility ........... SUCCESS [21.734s]
[INFO] Apache HBase - Client ............................. SUCCESS [1:54.028s]
[INFO] Apache HBase - Prefix Tree ........................ SUCCESS [10.780s]
[INFO] Apache HBase - Server ............................. FAILURE [19:46.564s]
[INFO] Apache HBase - Testing Util ....................... SKIPPED
[INFO] Apache HBase - Thrift ............................. SKIPPED
[INFO] Apache HBase - Rest ............................... SKIPPED
[INFO] Apache HBase - Shell .............................. SKIPPED
[INFO] Apache HBase - Integration Tests .................. SKIPPED
[INFO] Apache HBase - Examples ........................... SKIPPED
[INFO] Apache HBase - External Block Cache ............... SKIPPED
[INFO] Apache HBase - Assembly ........................... SKIPPED
[INFO] Apache HBase - Shaded ............................. SKIPPED
[INFO] Apache HBase - Shaded - Client .................... SKIPPED
[INFO] Apache HBase - Shaded - Server .................... SKIPPED
[INFO] Apache HBase Shaded Packaging Invariants .......... SKIPPED
[INFO] Apache HBase - Archetypes ......................... SKIPPED
[INFO] Apache HBase - Exemplar for hbase-client archetype  SKIPPED
[INFO] Apache HBase - Exemplar for hbase-shaded-client archetype  SKIPPED
[INFO] Apache HBase - Archetype builder .................. SKIPPED
[INFO] ------------------------------------------------------------------------
[INFO] BUILD FAILURE
[INFO] ------------------------------------------------------------------------
[INFO] Total time: 32:05.003s
[INFO] Finished at: Fri Sep 08 19:39:49 UTC 2017
[INFO] Final Memory: 104M/1195M
[INFO] ------------------------------------------------------------------------
[ERROR] Failed to execute goal org.apache.maven.plugins:maven-surefire-plugin:2.18.1:test
(default-test) on project hbase-server: There are test failures.
[ERROR] 
[ERROR] Please refer to <https://builds.apache.org/job/HBase-1.5/jdk=JDK_1_7,label=Hadoop&&!H13/ws/hbase-server/target/surefire-reports>
for the individual test results.
[ERROR] -> [Help 1]
[ERROR] 
[ERROR] To see the full stack trace of the errors, re-run Maven with the -e switch.
[ERROR] Re-run Maven using the -X switch to enable full debug logging.
[ERROR] 
[ERROR] For more information about the errors and possible solutions, please read the following
articles:
[ERROR] [Help 1] http://cwiki.apache.org/confluence/display/MAVEN/MojoFailureException
[ERROR] 
[ERROR] After correcting the problems, you can resume the build with the command
[ERROR]   mvn <goals> -rf :hbase-server
Build step 'Invoke top-level Maven targets' marked build as failure
Performing Post build task...
Match found for :.* : True
Logical operation result is TRUE
Running script  : # Post-build task script. TODO: Check this in and have all builds reference
check-in.
pwd && ls
# NOTE!!!! The below code has been copied and pasted from ./dev-tools/run-test.sh
# Do not change here without syncing there and vice-versa.
ZOMBIE_TESTS_COUNT=`jps -v | grep surefirebooter | grep -e '-Dhbase.test' | wc -l`
if [[ $ZOMBIE_TESTS_COUNT != 0 ]] ; then
 echo "Suspicious java process found - waiting 30s to see if there are just slow to stop"
 sleep 30
 ZOMBIE_TESTS_COUNT=`jps -v | grep surefirebooter | grep -e '-Dhbase.test' | wc -l`
 if [[ $ZOMBIE_TESTS_COUNT != 0 ]] ; then
   echo " {color:red}There appear to be $ZOMBIE_TESTS_COUNT zombie tests{color}, they should
have been killed by surefire but survived"
   jps -v | grep surefirebooter | grep -e '-Dhbase.test'
   jps -v | grep surefirebooter | grep -e '-Dhbase.test' | cut -d ' ' -f 1 | xargs -n 1 jstack
   # Exit with error
   exit 1
 else
   echo "We're ok: there is no zombie test, but some tests took some time to stop"
 fi
else
  echo "We're ok: there is no zombie test"
fi
Setting JDK_1_7_LATEST__HOME=/home/jenkins/tools/java/latest1.7
Setting JDK_1_8_LATEST__HOME=/home/jenkins/tools/java/latest1.8
[19ccb43d] $ /bin/bash -xe /tmp/jenkins4220547173257279404.sh
+ pwd
<https://builds.apache.org/job/HBase-1.5/jdk=JDK_1_7,label=Hadoop&&!H13/ws/>
+ ls
bin
CHANGES.txt
conf
dev-support
extra_env_var
hbase-annotations
hbase-archetypes
hbase-assembly
hbase-checkstyle
hbase-client
hbase-common
hbase-examples
hbase-external-blockcache
hbase-hadoop2-compat
hbase-hadoop-compat
hbase-it
hbase-metrics
hbase-metrics-api
hbase-native-client
hbase-prefix-tree
hbase-procedure
hbase-protocol
hbase-resource-bundle
hbase-rest
hbase-server
hbase-shaded
hbase-shell
hbase-testing-util
hbase-thrift
LICENSE.txt
NOTICE.txt
pom.xml
README.txt
src
target
++ jps -v
++ grep surefirebooter
++ wc -l
++ grep -e -Dhbase.test
+ ZOMBIE_TESTS_COUNT=0
+ [[ 0 != 0 ]]
+ echo 'We'\''re ok: there is no zombie test'
We're ok: there is no zombie test
POST BUILD TASK : SUCCESS
END OF POST BUILD TASK : 0
Archiving artifacts
Setting JDK_1_7_LATEST__HOME=/home/jenkins/tools/java/latest1.7
Setting JDK_1_8_LATEST__HOME=/home/jenkins/tools/java/latest1.8
[Fast Archiver] No prior successful build to compare, so performing full copy of artifacts
Recording test results
Setting JDK_1_7_LATEST__HOME=/home/jenkins/tools/java/latest1.7
Setting JDK_1_8_LATEST__HOME=/home/jenkins/tools/java/latest1.8
Setting JDK_1_7_LATEST__HOME=/home/jenkins/tools/java/latest1.7
Setting JDK_1_8_LATEST__HOME=/home/jenkins/tools/java/latest1.8

Mime
View raw message