hbase-builds mailing list archives

Site index · List index
Message view « Date » · « Thread »
Top « Date » · « Thread »
From Apache Jenkins Server <jenk...@builds.apache.org>
Subject Build failed in Jenkins: HBase-1.4 » JDK_1_8,Hadoop&&!H13 #905
Date Wed, 06 Sep 2017 21:59:43 GMT
See <https://builds.apache.org/job/HBase-1.4/jdk=JDK_1_8,label=Hadoop&&!H13/905/display/redirect?page=changes>

Changes:

[tedyu] HBASE-18737 Display configured max size of cache on RS UI

------------------------------------------
[...truncated 2.45 MB...]
Running org.apache.hadoop.hbase.master.TestMasterFileSystemWithWALDir
Running org.apache.hadoop.hbase.master.TestMaster
Tests run: 7, Failures: 0, Errors: 0, Skipped: 0, Time elapsed: 130.911 sec - in org.apache.hadoop.hbase.master.TestMasterFailover
Tests run: 1, Failures: 0, Errors: 0, Skipped: 0, Time elapsed: 10.449 sec - in org.apache.hadoop.hbase.master.TestMasterFileSystemWithWALDir
Running org.apache.hadoop.hbase.master.TestActiveMasterManager
Tests run: 2, Failures: 0, Errors: 0, Skipped: 0, Time elapsed: 1.363 sec - in org.apache.hadoop.hbase.master.TestActiveMasterManager
Running org.apache.hadoop.hbase.master.TestMasterMetricsWrapper
Tests run: 4, Failures: 0, Errors: 0, Skipped: 0, Time elapsed: 16.682 sec - in org.apache.hadoop.hbase.master.TestMaster
Running org.apache.hadoop.hbase.master.TestMasterBalanceThrottling
Tests run: 1, Failures: 0, Errors: 0, Skipped: 0, Time elapsed: 2.056 sec - in org.apache.hadoop.hbase.master.TestMasterMetricsWrapper
Running org.apache.hadoop.hbase.master.TestMasterTransitions
Tests run: 3, Failures: 0, Errors: 0, Skipped: 3, Time elapsed: 0.001 sec - in org.apache.hadoop.hbase.master.TestMasterTransitions
Running org.apache.hadoop.hbase.master.normalizer.TestSimpleRegionNormalizerOnCluster
Running org.apache.hadoop.hbase.master.TestCatalogJanitorInMemoryStates
Tests run: 1, Failures: 0, Errors: 0, Skipped: 0, Time elapsed: 19.88 sec - in org.apache.hadoop.hbase.master.TestCatalogJanitorInMemoryStates
Running org.apache.hadoop.hbase.master.TestRestartCluster
Tests run: 2, Failures: 0, Errors: 0, Skipped: 0, Time elapsed: 35.009 sec - in org.apache.hadoop.hbase.master.normalizer.TestSimpleRegionNormalizerOnCluster
Running org.apache.hadoop.hbase.master.TestOpenedRegionHandler
Tests run: 2, Failures: 0, Errors: 0, Skipped: 0, Time elapsed: 22.948 sec - in org.apache.hadoop.hbase.master.TestOpenedRegionHandler
Tests run: 2, Failures: 0, Errors: 0, Skipped: 0, Time elapsed: 60.93 sec - in org.apache.hadoop.hbase.master.TestMasterBalanceThrottling
Running org.apache.hadoop.hbase.master.handler.TestCreateTableHandler
Running org.apache.hadoop.hbase.master.handler.TestEnableTableHandler
Tests run: 3, Failures: 0, Errors: 0, Skipped: 0, Time elapsed: 57.713 sec - in org.apache.hadoop.hbase.master.TestRestartCluster
Running org.apache.hadoop.hbase.master.TestMasterPriorityRpc
Tests run: 3, Failures: 0, Errors: 0, Skipped: 0, Time elapsed: 2.474 sec - in org.apache.hadoop.hbase.master.TestMasterPriorityRpc
Running org.apache.hadoop.hbase.master.TestSplitLogManager
Tests run: 3, Failures: 0, Errors: 0, Skipped: 0, Time elapsed: 35.221 sec - in org.apache.hadoop.hbase.master.handler.TestCreateTableHandler
Running org.apache.hadoop.hbase.master.TestAssignmentManagerOnCluster
Tests run: 3, Failures: 0, Errors: 0, Skipped: 0, Time elapsed: 71.063 sec - in org.apache.hadoop.hbase.master.handler.TestEnableTableHandler
Running org.apache.hadoop.hbase.master.TestRegionPlacement
Tests run: 2, Failures: 0, Errors: 0, Skipped: 2, Time elapsed: 0.005 sec - in org.apache.hadoop.hbase.master.TestRegionPlacement
Running org.apache.hadoop.hbase.master.TestClusterStatusPublisher
Tests run: 3, Failures: 0, Errors: 0, Skipped: 0, Time elapsed: 0.522 sec - in org.apache.hadoop.hbase.master.TestClusterStatusPublisher
Running org.apache.hadoop.hbase.master.TestTableLockManager
Tests run: 24, Failures: 0, Errors: 0, Skipped: 1, Time elapsed: 309.589 sec - in org.apache.hadoop.hbase.master.balancer.TestStochasticLoadBalancer
Running org.apache.hadoop.hbase.master.TestMasterMetrics
Tests run: 3, Failures: 0, Errors: 0, Skipped: 0, Time elapsed: 1.164 sec - in org.apache.hadoop.hbase.master.TestMasterMetrics
Running org.apache.hadoop.hbase.master.TestMasterFileSystem
Tests run: 2, Failures: 0, Errors: 0, Skipped: 0, Time elapsed: 0.802 sec - in org.apache.hadoop.hbase.master.TestMasterFileSystem
Tests run: 4, Failures: 0, Errors: 1, Skipped: 0, Time elapsed: 93.575 sec <<< FAILURE!
- in org.apache.hadoop.hbase.master.TestTableLockManager
testReapAllTableLocks(org.apache.hadoop.hbase.master.TestTableLockManager)  Time elapsed:
0.065 sec  <<< ERROR!
org.apache.hadoop.hbase.exceptions.LockTimeoutException: Timed out acquiring writelock for
table:table4for:zero timeout after 0 ms.
	at org.apache.hadoop.hbase.master.TableLockManager$ZKTableLockManager$TableLockImpl.acquire(TableLockManager.java:282)
	at org.apache.hadoop.hbase.master.TestTableLockManager.testReapAllTableLocks(TestTableLockManager.java:283)

Tests run: 1, Failures: 0, Errors: 0, Skipped: 0, Time elapsed: 93.746 sec - in org.apache.hadoop.hbase.master.TestTableLockManager
Tests run: 15, Failures: 0, Errors: 0, Skipped: 1, Time elapsed: 134.898 sec - in org.apache.hadoop.hbase.master.TestSplitLogManager
Tests run: 21, Failures: 0, Errors: 0, Skipped: 0, Time elapsed: 125.4 sec - in org.apache.hadoop.hbase.master.TestAssignmentManagerOnCluster
Tests run: 4, Failures: 0, Errors: 0, Skipped: 0, Time elapsed: 527.826 sec - in org.apache.hadoop.hbase.master.balancer.TestStochasticLoadBalancer2

Results :

Failed tests: 
  TestVisibilityLabelsWithACL.setupBeforeClass:103 Waiting timed out after [10,000] msec
Tests in error: 
org.apache.hadoop.hbase.regionserver.TestRSKilledWhenInitializing.testRSTerminationAfterRegisteringToMasterBeforeCreatingEphemeralNode(org.apache.hadoop.hbase.regionserver.TestRSKilledWhenInitializing)
  Run 1: TestRSKilledWhenInitializing.testRSTerminationAfterRegisteringToMasterBeforeCreatingEphemeralNode:142
null
  Run 2: TestRSKilledWhenInitializing.testRSTerminationAfterRegisteringToMasterBeforeCreatingEphemeralNode:115
» TestTimedOut
  Run 3: TestRSKilledWhenInitializing.testRSTerminationAfterRegisteringToMasterBeforeCreatingEphemeralNode
» 
  Run 4: TestRSKilledWhenInitializing.testRSTerminationAfterRegisteringToMasterBeforeCreatingEphemeralNode:115
» TestTimedOut
  Run 5: TestRSKilledWhenInitializing.testRSTerminationAfterRegisteringToMasterBeforeCreatingEphemeralNode
» 

Flaked tests: 
org.apache.hadoop.hbase.TestJMXConnectorServer.testRSConnectorServerWhenStopRegionServer(org.apache.hadoop.hbase.TestJMXConnectorServer)
  Run 1: TestJMXConnectorServer.testRSConnectorServerWhenStopRegionServer:120 » TestTimedOut
  Run 2: PASS

org.apache.hadoop.hbase.client.TestClientScannerRPCTimeout.testScannerNextRPCTimesout(org.apache.hadoop.hbase.client.TestClientScannerRPCTimeout)
  Run 1: TestClientScannerRPCTimeout.testScannerNextRPCTimesout:87 » TableExists testSc...
  Run 2: PASS

org.apache.hadoop.hbase.mapreduce.TestTableSnapshotInputFormat.testRestoreSnapshotDoesNotCreateBackRefLinks(org.apache.hadoop.hbase.mapreduce.TestTableSnapshotInputFormat)
  Run 1: TestTableSnapshotInputFormat>TableSnapshotInputFormatTestBase.testRestoreSnapshotDoesNotCreateBackRefLinks:153->Object.wait:-2
» TestTimedOut
  Run 2: TestTableSnapshotInputFormat.testRestoreSnapshotDoesNotCreateBackRefLinks »  A...
  Run 3: PASS

org.apache.hadoop.hbase.master.TestTableLockManager.testReapAllTableLocks(org.apache.hadoop.hbase.master.TestTableLockManager)
  Run 1: TestTableLockManager.testReapAllTableLocks:283 » LockTimeout Timed out acquiri...
  Run 2: PASS

org.apache.hadoop.hbase.replication.TestSerialReplication.testRegionSplit(org.apache.hadoop.hbase.replication.TestSerialReplication)
  Run 1: TestSerialReplication.testRegionSplit:256 expected:<9> but was:<4>
  Run 2: PASS


Tests run: 2818, Failures: 1, Errors: 1, Skipped: 55, Flakes: 5

[INFO] ------------------------------------------------------------------------
[INFO] Reactor Summary:
[INFO] 
[INFO] Apache HBase ...................................... SUCCESS [1:44.880s]
[INFO] Apache HBase - Checkstyle ......................... SUCCESS [15.386s]
[INFO] Apache HBase - Resource Bundle .................... SUCCESS [0.224s]
[INFO] Apache HBase - Annotations ........................ SUCCESS [1.484s]
[INFO] Apache HBase - Protocol ........................... SUCCESS [16.279s]
[INFO] Apache HBase - Common ............................. SUCCESS [2:40.126s]
[INFO] Apache HBase - Procedure .......................... SUCCESS [3:32.261s]
[INFO] Apache HBase - Metrics API ........................ SUCCESS [1.371s]
[INFO] Apache HBase - Hadoop Compatibility ............... SUCCESS [11.248s]
[INFO] Apache HBase - Metrics Implementation ............. SUCCESS [4.976s]
[INFO] Apache HBase - Hadoop Two Compatibility ........... SUCCESS [19.414s]
[INFO] Apache HBase - Client ............................. SUCCESS [1:41.486s]
[INFO] Apache HBase - Prefix Tree ........................ SUCCESS [7.766s]
[INFO] Apache HBase - Server ............................. FAILURE [1:37:35.846s]
[INFO] Apache HBase - Testing Util ....................... SKIPPED
[INFO] Apache HBase - Thrift ............................. SKIPPED
[INFO] Apache HBase - Rest ............................... SKIPPED
[INFO] Apache HBase - Shell .............................. SKIPPED
[INFO] Apache HBase - Integration Tests .................. SKIPPED
[INFO] Apache HBase - Examples ........................... SKIPPED
[INFO] Apache HBase - External Block Cache ............... SKIPPED
[INFO] Apache HBase - Assembly ........................... SKIPPED
[INFO] Apache HBase - Shaded ............................. SKIPPED
[INFO] Apache HBase - Shaded - Client .................... SKIPPED
[INFO] Apache HBase - Shaded - Server .................... SKIPPED
[INFO] Apache HBase Shaded Packaging Invariants .......... SKIPPED
[INFO] Apache HBase - Archetypes ......................... SKIPPED
[INFO] Apache HBase - Exemplar for hbase-client archetype  SKIPPED
[INFO] Apache HBase - Exemplar for hbase-shaded-client archetype  SKIPPED
[INFO] Apache HBase - Archetype builder .................. SKIPPED
[INFO] ------------------------------------------------------------------------
[INFO] BUILD FAILURE
[INFO] ------------------------------------------------------------------------
[INFO] Total time: 1:49:04.300s
[INFO] Finished at: Wed Sep 06 21:49:43 UTC 2017
[INFO] Final Memory: 104M/911M
[INFO] ------------------------------------------------------------------------
[ERROR] Failed to execute goal org.apache.maven.plugins:maven-surefire-plugin:2.18.1:test
(secondPartTestsExecution) on project hbase-server: ExecutionException: java.lang.RuntimeException:
There was an error in the forked process
[ERROR] java.lang.ArrayIndexOutOfBoundsException: 1
[ERROR] at org.apache.maven.surefire.common.junit4.JUnit4ProviderUtil.generateFailingTests(JUnit4ProviderUtil.java:64)
[ERROR] at org.apache.maven.surefire.junitcore.JUnitCoreProvider.invoke(JUnitCoreProvider.java:151)
[ERROR] at org.apache.maven.surefire.booter.ForkedBooter.invokeProviderInSameClassLoader(ForkedBooter.java:203)
[ERROR] at org.apache.maven.surefire.booter.ForkedBooter.runSuitesInProcess(ForkedBooter.java:155)
[ERROR] at org.apache.maven.surefire.booter.ForkedBooter.main(ForkedBooter.java:103)
[ERROR] -> [Help 1]
[ERROR] 
[ERROR] To see the full stack trace of the errors, re-run Maven with the -e switch.
[ERROR] Re-run Maven using the -X switch to enable full debug logging.
[ERROR] 
[ERROR] For more information about the errors and possible solutions, please read the following
articles:
[ERROR] [Help 1] http://cwiki.apache.org/confluence/display/MAVEN/MojoFailureException
[ERROR] 
[ERROR] After correcting the problems, you can resume the build with the command
[ERROR]   mvn <goals> -rf :hbase-server
Build step 'Invoke top-level Maven targets' marked build as failure
Performing Post build task...
Match found for :.* : True
Logical operation result is TRUE
Running script  : # Post-build task script. TODO: Check this in and have all builds reference
check-in.
pwd && ls
# NOTE!!!! The below code has been copied and pasted from ./dev-tools/run-test.sh
# Do not change here without syncing there and vice-versa.
ZOMBIE_TESTS_COUNT=`jps -v | grep surefirebooter | grep -e '-Dhbase.test' | wc -l`
if [[ $ZOMBIE_TESTS_COUNT != 0 ]] ; then
 echo "Suspicious java process found - waiting 30s to see if there are just slow to stop"
 sleep 30
 ZOMBIE_TESTS_COUNT=`jps -v | grep surefirebooter | grep -e '-Dhbase.test' | wc -l`
 if [[ $ZOMBIE_TESTS_COUNT != 0 ]] ; then
   echo " {color:red}There appear to be $ZOMBIE_TESTS_COUNT zombie tests{color}, they should
have been killed by surefire but survived"
   jps -v | grep surefirebooter | grep -e '-Dhbase.test'
   jps -v | grep surefirebooter | grep -e '-Dhbase.test' | cut -d ' ' -f 1 | xargs -n 1 jstack
   # Exit with error
   exit 1
 else
   echo "We're ok: there is no zombie test, but some tests took some time to stop"
 fi
else
  echo "We're ok: there is no zombie test"
fi
Setting JDK_1_7_LATEST__HOME=/home/jenkins/tools/java/latest1.7
Setting JDK_1_8_LATEST__HOME=/home/jenkins/tools/java/latest1.8
[30b16b4c] $ /bin/bash -xe /tmp/jenkins2647889220325525289.sh
+ pwd
<https://builds.apache.org/job/HBase-1.4/jdk=JDK_1_8,label=Hadoop&&!H13/ws/>
+ ls
bin
CHANGES.txt
conf
dev-support
extra_env_var
hbase-annotations
hbase-archetypes
hbase-assembly
hbase-checkstyle
hbase-client
hbase-common
hbase-examples
hbase-external-blockcache
hbase-hadoop2-compat
hbase-hadoop-compat
hbase-it
hbase-metrics
hbase-metrics-api
hbase-native-client
hbase-prefix-tree
hbase-procedure
hbase-protocol
hbase-resource-bundle
hbase-rest
hbase-server
hbase-shaded
hbase-shell
hbase-testing-util
hbase-thrift
LICENSE.txt
NOTICE.txt
pom.xml
README.txt
src
target
++ jps -v
++ grep surefirebooter
++ grep -e -Dhbase.test
++ wc -l
+ ZOMBIE_TESTS_COUNT=0
+ [[ 0 != 0 ]]
+ echo 'We'\''re ok: there is no zombie test'
We're ok: there is no zombie test
POST BUILD TASK : SUCCESS
END OF POST BUILD TASK : 0
Archiving artifacts
Setting JDK_1_7_LATEST__HOME=/home/jenkins/tools/java/latest1.7
Setting JDK_1_8_LATEST__HOME=/home/jenkins/tools/java/latest1.8
Recording test results
Setting JDK_1_7_LATEST__HOME=/home/jenkins/tools/java/latest1.7
Setting JDK_1_8_LATEST__HOME=/home/jenkins/tools/java/latest1.8
ERROR: Step ?Publish JUnit test result report? aborted due to exception: 
java.lang.OutOfMemoryError: Java heap space
Caused: java.io.IOException: Remote call on H2 failed
	at hudson.remoting.Channel.call(Channel.java:838)
	at hudson.FilePath.act(FilePath.java:986)
Caused: java.io.IOException: remote file operation failed: <https://builds.apache.org/job/HBase-1.4/jdk=JDK_1_8,label=Hadoop&&!H13/ws/>
at hudson.remoting.Channel@5017dde5:H2
	at hudson.FilePath.act(FilePath.java:993)
	at hudson.FilePath.act(FilePath.java:975)
	at hudson.tasks.junit.JUnitParser.parseResult(JUnitParser.java:103)
	at hudson.tasks.junit.JUnitResultArchiver.parse(JUnitResultArchiver.java:128)
	at hudson.tasks.junit.JUnitResultArchiver.perform(JUnitResultArchiver.java:149)
	at hudson.tasks.BuildStepCompatibilityLayer.perform(BuildStepCompatibilityLayer.java:81)
	at hudson.tasks.BuildStepMonitor$1.perform(BuildStepMonitor.java:20)
	at hudson.model.AbstractBuild$AbstractBuildExecution.perform(AbstractBuild.java:735)
	at hudson.model.AbstractBuild$AbstractBuildExecution.performAllBuildSteps(AbstractBuild.java:676)
	at hudson.model.Build$BuildExecution.post2(Build.java:186)
	at hudson.model.AbstractBuild$AbstractBuildExecution.post(AbstractBuild.java:621)
	at hudson.model.Run.execute(Run.java:1760)
	at hudson.matrix.MatrixRun.run(MatrixRun.java:146)
	at hudson.model.ResourceController.execute(ResourceController.java:97)
	at hudson.model.Executor.run(Executor.java:405)
Setting JDK_1_7_LATEST__HOME=/home/jenkins/tools/java/latest1.7
Setting JDK_1_8_LATEST__HOME=/home/jenkins/tools/java/latest1.8

Mime
View raw message