hbase-builds mailing list archives

Site index · List index
Message view « Date » · « Thread »
Top « Date » · « Thread »
From Apache Jenkins Server <jenk...@builds.apache.org>
Subject Build failed in Jenkins: HBase-1.5 » JDK_1_8,Hadoop&&!H13 #51
Date Wed, 06 Sep 2017 21:09:43 GMT
See <https://builds.apache.org/job/HBase-1.5/jdk=JDK_1_8,label=Hadoop&&!H13/51/display/redirect?page=changes>

Changes:

[tedyu] HBASE-18737 Display configured max size of cache on RS UI

[tedyu] HBASE-18652 Expose individual cache stats in a CombinedCache through JMX

------------------------------------------
[...truncated 2.32 MB...]
Tests run: 2, Failures: 0, Errors: 0, Skipped: 0, Time elapsed: 0.445 sec - in org.apache.hadoop.hbase.http.TestHttpRequestLog
Running org.apache.hadoop.hbase.http.TestHttpServerWebapps
Tests run: 2, Failures: 0, Errors: 0, Skipped: 0, Time elapsed: 0.658 sec - in org.apache.hadoop.hbase.http.TestHttpServerWebapps
Running org.apache.hadoop.hbase.http.TestServletFilter
Tests run: 3, Failures: 0, Errors: 0, Skipped: 1, Time elapsed: 1.057 sec - in org.apache.hadoop.hbase.http.TestServletFilter
Running org.apache.hadoop.hbase.http.TestSpnegoHttpServer
Tests run: 3, Failures: 0, Errors: 0, Skipped: 0, Time elapsed: 1.339 sec - in org.apache.hadoop.hbase.http.TestSpnegoHttpServer
Running org.apache.hadoop.hbase.http.jmx.TestJMXJsonServlet
Tests run: 3, Failures: 0, Errors: 0, Skipped: 0, Time elapsed: 0.528 sec - in org.apache.hadoop.hbase.http.jmx.TestJMXJsonServlet
Running org.apache.hadoop.hbase.http.conf.TestConfServlet
Tests run: 3, Failures: 0, Errors: 0, Skipped: 0, Time elapsed: 0.801 sec - in org.apache.hadoop.hbase.http.conf.TestConfServlet
Running org.apache.hadoop.hbase.http.TestGlobalFilter
Tests run: 1, Failures: 0, Errors: 0, Skipped: 0, Time elapsed: 1.164 sec - in org.apache.hadoop.hbase.http.TestGlobalFilter
Running org.apache.hadoop.hbase.http.TestHttpServerLifecycle
Tests run: 6, Failures: 0, Errors: 0, Skipped: 6, Time elapsed: 0.002 sec - in org.apache.hadoop.hbase.http.TestHttpServerLifecycle
Running org.apache.hadoop.hbase.http.TestHtmlQuoting
Tests run: 4, Failures: 0, Errors: 0, Skipped: 0, Time elapsed: 1.063 sec - in org.apache.hadoop.hbase.http.TestHtmlQuoting
Running org.apache.hadoop.hbase.http.TestHttpRequestLogAppender
Tests run: 1, Failures: 0, Errors: 0, Skipped: 0, Time elapsed: 0.539 sec - in org.apache.hadoop.hbase.http.TestHttpRequestLogAppender
Running org.apache.hadoop.hbase.http.TestHttpServer
Tests run: 16, Failures: 0, Errors: 0, Skipped: 3, Time elapsed: 4.16 sec - in org.apache.hadoop.hbase.http.TestHttpServer
Running org.apache.hadoop.hbase.ipc.TestRpcMetrics
Tests run: 4, Failures: 0, Errors: 0, Skipped: 0, Time elapsed: 1.065 sec - in org.apache.hadoop.hbase.ipc.TestRpcMetrics
Running org.apache.hadoop.hbase.ipc.TestCoprocessorRpcUtils
Tests run: 1, Failures: 0, Errors: 0, Skipped: 0, Time elapsed: 0.563 sec - in org.apache.hadoop.hbase.ipc.TestCoprocessorRpcUtils
Running org.apache.hadoop.hbase.ipc.TestNettyIPC
Tests run: 36, Failures: 0, Errors: 0, Skipped: 0, Time elapsed: 9.795 sec - in org.apache.hadoop.hbase.ipc.TestNettyIPC
Running org.apache.hadoop.hbase.ipc.TestBufferChain
Tests run: 5, Failures: 0, Errors: 0, Skipped: 0, Time elapsed: 1.06 sec - in org.apache.hadoop.hbase.ipc.TestBufferChain
Running org.apache.hadoop.hbase.ipc.TestSimpleRpcScheduler
Tests run: 7, Failures: 0, Errors: 0, Skipped: 0, Time elapsed: 8.492 sec - in org.apache.hadoop.hbase.ipc.TestSimpleRpcScheduler
Running org.apache.hadoop.hbase.ipc.TestBlockingIPC
Tests run: 12, Failures: 0, Errors: 0, Skipped: 0, Time elapsed: 4.573 sec - in org.apache.hadoop.hbase.ipc.TestBlockingIPC
Running org.apache.hadoop.hbase.ipc.TestCallRunner
Tests run: 1, Failures: 0, Errors: 0, Skipped: 0, Time elapsed: 1.009 sec - in org.apache.hadoop.hbase.ipc.TestCallRunner
Running org.apache.hadoop.hbase.ipc.TestRpcHandlerException
Tests run: 1, Failures: 0, Errors: 0, Skipped: 1, Time elapsed: 0.001 sec - in org.apache.hadoop.hbase.ipc.TestRpcHandlerException
Running org.apache.hadoop.hbase.TestServerLoad
Tests run: 3, Failures: 0, Errors: 0, Skipped: 0, Time elapsed: 0.597 sec - in org.apache.hadoop.hbase.TestServerLoad
Running org.apache.hadoop.hbase.codec.TestCellMessageCodec
Tests run: 3, Failures: 0, Errors: 0, Skipped: 0, Time elapsed: 0.511 sec - in org.apache.hadoop.hbase.codec.TestCellMessageCodec
Running org.apache.hadoop.hbase.errorhandling.TestTimeoutExceptionInjector
Tests run: 4, Failures: 0, Errors: 0, Skipped: 0, Time elapsed: 0.761 sec - in org.apache.hadoop.hbase.errorhandling.TestTimeoutExceptionInjector
Running org.apache.hadoop.hbase.errorhandling.TestForeignExceptionDispatcher
Tests run: 3, Failures: 0, Errors: 0, Skipped: 0, Time elapsed: 0.736 sec - in org.apache.hadoop.hbase.errorhandling.TestForeignExceptionDispatcher
Running org.apache.hadoop.hbase.errorhandling.TestForeignExceptionSerialization
Tests run: 2, Failures: 0, Errors: 0, Skipped: 0, Time elapsed: 0.536 sec - in org.apache.hadoop.hbase.errorhandling.TestForeignExceptionSerialization
Running org.apache.hadoop.hbase.conf.TestConfigurationManager
Tests run: 2, Failures: 0, Errors: 0, Skipped: 0, Time elapsed: 0.568 sec - in org.apache.hadoop.hbase.conf.TestConfigurationManager
Running org.apache.hadoop.hbase.TestIPv6NIOServerSocketChannel
Tests run: 2, Failures: 0, Errors: 0, Skipped: 0, Time elapsed: 0.731 sec - in org.apache.hadoop.hbase.TestIPv6NIOServerSocketChannel
Running org.apache.hadoop.hbase.TestTagRewriteCell
Tests run: 1, Failures: 0, Errors: 0, Skipped: 0, Time elapsed: 0.513 sec - in org.apache.hadoop.hbase.TestTagRewriteCell
Running org.apache.hadoop.hbase.TestPerformanceEvaluation
Tests run: 4, Failures: 0, Errors: 0, Skipped: 0, Time elapsed: 1.129 sec - in org.apache.hadoop.hbase.TestPerformanceEvaluation
Running org.apache.hadoop.hbase.util.TestBoundedPriorityBlockingQueue
Tests run: 7, Failures: 0, Errors: 0, Skipped: 0, Time elapsed: 1.753 sec - in org.apache.hadoop.hbase.util.TestBoundedPriorityBlockingQueue
Running org.apache.hadoop.hbase.util.TestPoolMap$TestRoundRobinPoolType
Tests run: 3, Failures: 0, Errors: 0, Skipped: 0, Time elapsed: 0.701 sec - in org.apache.hadoop.hbase.util.TestPoolMap$TestRoundRobinPoolType
Running org.apache.hadoop.hbase.util.TestPoolMap$TestThreadLocalPoolType
Tests run: 3, Failures: 0, Errors: 0, Skipped: 0, Time elapsed: 0.17 sec - in org.apache.hadoop.hbase.util.TestPoolMap$TestThreadLocalPoolType
Running org.apache.hadoop.hbase.util.TestPoolMap$TestReusablePoolType
Tests run: 3, Failures: 0, Errors: 0, Skipped: 0, Time elapsed: 0.164 sec - in org.apache.hadoop.hbase.util.TestPoolMap$TestReusablePoolType
Running org.apache.hadoop.hbase.util.TestIncrementingEnvironmentEdge
Tests run: 1, Failures: 0, Errors: 0, Skipped: 0, Time elapsed: 0.531 sec - in org.apache.hadoop.hbase.util.TestIncrementingEnvironmentEdge
Running org.apache.hadoop.hbase.util.TestPoolMap$TestThreadLocalPoolType
Tests run: 3, Failures: 0, Errors: 0, Skipped: 0, Time elapsed: 0.598 sec - in org.apache.hadoop.hbase.util.TestPoolMap$TestThreadLocalPoolType
Running org.apache.hadoop.hbase.util.TestPoolMap$TestRoundRobinPoolType
Tests run: 3, Failures: 0, Errors: 0, Skipped: 0, Time elapsed: 0.545 sec - in org.apache.hadoop.hbase.util.TestPoolMap$TestRoundRobinPoolType
Running org.apache.hadoop.hbase.util.TestByteBufferUtils
Tests run: 12, Failures: 0, Errors: 0, Skipped: 0, Time elapsed: 1.018 sec - in org.apache.hadoop.hbase.util.TestByteBufferUtils
Running org.apache.hadoop.hbase.util.TestRegionSizeCalculator
Tests run: 3, Failures: 0, Errors: 0, Skipped: 0, Time elapsed: 0.964 sec - in org.apache.hadoop.hbase.util.TestRegionSizeCalculator
Running org.apache.hadoop.hbase.util.TestSortedList
Tests run: 4, Failures: 0, Errors: 0, Skipped: 0, Time elapsed: 0.694 sec - in org.apache.hadoop.hbase.util.TestSortedList
Running org.apache.hadoop.hbase.util.TestPoolMap$TestReusablePoolType
Tests run: 3, Failures: 0, Errors: 0, Skipped: 0, Time elapsed: 0.693 sec - in org.apache.hadoop.hbase.util.TestPoolMap$TestReusablePoolType
Running org.apache.hadoop.hbase.util.TestHFileArchiveUtil
Tests run: 4, Failures: 0, Errors: 0, Skipped: 0, Time elapsed: 1.056 sec - in org.apache.hadoop.hbase.util.TestHFileArchiveUtil
Running org.apache.hadoop.hbase.util.TestRegionSplitCalculator
Tests run: 15, Failures: 0, Errors: 0, Skipped: 0, Time elapsed: 1.011 sec - in org.apache.hadoop.hbase.util.TestRegionSplitCalculator
Running org.apache.hadoop.hbase.util.TestSortedCopyOnWriteSet
Tests run: 2, Failures: 0, Errors: 0, Skipped: 0, Time elapsed: 0.488 sec - in org.apache.hadoop.hbase.util.TestSortedCopyOnWriteSet
Running org.apache.hadoop.hbase.util.TestHBaseFsckComparator
Tests run: 6, Failures: 0, Errors: 0, Skipped: 0, Time elapsed: 0.59 sec - in org.apache.hadoop.hbase.util.TestHBaseFsckComparator
Running org.apache.hadoop.hbase.util.TestCompressionTest
Tests run: 2, Failures: 0, Errors: 0, Skipped: 0, Time elapsed: 0.701 sec - in org.apache.hadoop.hbase.util.TestCompressionTest
Running org.apache.hadoop.hbase.util.TestEncryptionTest
Tests run: 3, Failures: 0, Errors: 0, Skipped: 0, Time elapsed: 1.465 sec - in org.apache.hadoop.hbase.util.TestEncryptionTest
Running org.apache.hadoop.hbase.util.TestByteBloomFilter
Tests run: 5, Failures: 0, Errors: 0, Skipped: 0, Time elapsed: 1.536 sec - in org.apache.hadoop.hbase.util.TestByteBloomFilter
Running org.apache.hadoop.hbase.util.TestStealJobQueue
Tests run: 7, Failures: 0, Errors: 0, Skipped: 0, Time elapsed: 0.896 sec - in org.apache.hadoop.hbase.util.TestStealJobQueue
Running org.apache.hadoop.hbase.util.TestRootPath
Tests run: 1, Failures: 0, Errors: 0, Skipped: 0, Time elapsed: 0.41 sec - in org.apache.hadoop.hbase.util.TestRootPath
Running org.apache.hadoop.hbase.util.TestConfigurationUtil
Tests run: 2, Failures: 0, Errors: 0, Skipped: 0, Time elapsed: 0.601 sec - in org.apache.hadoop.hbase.util.TestConfigurationUtil
Running org.apache.hadoop.hbase.zookeeper.TestZooKeeperMainServer
Tests run: 2, Failures: 0, Errors: 0, Skipped: 0, Time elapsed: 1.526 sec - in org.apache.hadoop.hbase.zookeeper.TestZooKeeperMainServer

Results :

Failed tests: 
org.apache.hadoop.hbase.io.hfile.TestBlockCacheReporting.testLruBlockCache(org.apache.hadoop.hbase.io.hfile.TestBlockCacheReporting)
  Run 1: TestBlockCacheReporting.testLruBlockCache:103->addDataAndHits:70 expected:<6>
but was:<9>
  Run 2: TestBlockCacheReporting.testLruBlockCache:103->addDataAndHits:70 expected:<6>
but was:<18>
  Run 3: TestBlockCacheReporting.testLruBlockCache:103->addDataAndHits:70 expected:<6>
but was:<27>


Tests run: 1137, Failures: 1, Errors: 0, Skipped: 22

[INFO] ------------------------------------------------------------------------
[INFO] Reactor Summary:
[INFO] 
[INFO] Apache HBase ...................................... SUCCESS [1:48.680s]
[INFO] Apache HBase - Checkstyle ......................... SUCCESS [16.222s]
[INFO] Apache HBase - Resource Bundle .................... SUCCESS [0.375s]
[INFO] Apache HBase - Annotations ........................ SUCCESS [1.932s]
[INFO] Apache HBase - Protocol ........................... SUCCESS [24.198s]
[INFO] Apache HBase - Common ............................. SUCCESS [3:18.721s]
[INFO] Apache HBase - Procedure .......................... SUCCESS [4:07.427s]
[INFO] Apache HBase - Metrics API ........................ SUCCESS [2.082s]
[INFO] Apache HBase - Hadoop Compatibility ............... SUCCESS [13.425s]
[INFO] Apache HBase - Metrics Implementation ............. SUCCESS [7.805s]
[INFO] Apache HBase - Hadoop Two Compatibility ........... SUCCESS [23.949s]
[INFO] Apache HBase - Client ............................. SUCCESS [1:58.285s]
[INFO] Apache HBase - Prefix Tree ........................ SUCCESS [12.967s]
[INFO] Apache HBase - Server ............................. FAILURE [23:59.373s]
[INFO] Apache HBase - Testing Util ....................... SKIPPED
[INFO] Apache HBase - Thrift ............................. SKIPPED
[INFO] Apache HBase - Rest ............................... SKIPPED
[INFO] Apache HBase - Shell .............................. SKIPPED
[INFO] Apache HBase - Integration Tests .................. SKIPPED
[INFO] Apache HBase - Examples ........................... SKIPPED
[INFO] Apache HBase - External Block Cache ............... SKIPPED
[INFO] Apache HBase - Assembly ........................... SKIPPED
[INFO] Apache HBase - Shaded ............................. SKIPPED
[INFO] Apache HBase - Shaded - Client .................... SKIPPED
[INFO] Apache HBase - Shaded - Server .................... SKIPPED
[INFO] Apache HBase Shaded Packaging Invariants .......... SKIPPED
[INFO] Apache HBase - Archetypes ......................... SKIPPED
[INFO] Apache HBase - Exemplar for hbase-client archetype  SKIPPED
[INFO] Apache HBase - Exemplar for hbase-shaded-client archetype  SKIPPED
[INFO] Apache HBase - Archetype builder .................. SKIPPED
[INFO] ------------------------------------------------------------------------
[INFO] BUILD FAILURE
[INFO] ------------------------------------------------------------------------
[INFO] Total time: 37:29.915s
[INFO] Finished at: Wed Sep 06 21:09:33 UTC 2017
[INFO] Final Memory: 103M/2502M
[INFO] ------------------------------------------------------------------------
[ERROR] Failed to execute goal org.apache.maven.plugins:maven-surefire-plugin:2.18.1:test
(default-test) on project hbase-server: There are test failures.
[ERROR] 
[ERROR] Please refer to <https://builds.apache.org/job/HBase-1.5/jdk=JDK_1_8,label=Hadoop&&!H13/ws/hbase-server/target/surefire-reports>
for the individual test results.
[ERROR] -> [Help 1]
[ERROR] 
[ERROR] To see the full stack trace of the errors, re-run Maven with the -e switch.
[ERROR] Re-run Maven using the -X switch to enable full debug logging.
[ERROR] 
[ERROR] For more information about the errors and possible solutions, please read the following
articles:
[ERROR] [Help 1] http://cwiki.apache.org/confluence/display/MAVEN/MojoFailureException
[ERROR] 
[ERROR] After correcting the problems, you can resume the build with the command
[ERROR]   mvn <goals> -rf :hbase-server
Build step 'Invoke top-level Maven targets' marked build as failure
Performing Post build task...
Match found for :.* : True
Logical operation result is TRUE
Running script  : # Post-build task script. TODO: Check this in and have all builds reference
check-in.
pwd && ls
# NOTE!!!! The below code has been copied and pasted from ./dev-tools/run-test.sh
# Do not change here without syncing there and vice-versa.
ZOMBIE_TESTS_COUNT=`jps -v | grep surefirebooter | grep -e '-Dhbase.test' | wc -l`
if [[ $ZOMBIE_TESTS_COUNT != 0 ]] ; then
 echo "Suspicious java process found - waiting 30s to see if there are just slow to stop"
 sleep 30
 ZOMBIE_TESTS_COUNT=`jps -v | grep surefirebooter | grep -e '-Dhbase.test' | wc -l`
 if [[ $ZOMBIE_TESTS_COUNT != 0 ]] ; then
   echo " {color:red}There appear to be $ZOMBIE_TESTS_COUNT zombie tests{color}, they should
have been killed by surefire but survived"
   jps -v | grep surefirebooter | grep -e '-Dhbase.test'
   jps -v | grep surefirebooter | grep -e '-Dhbase.test' | cut -d ' ' -f 1 | xargs -n 1 jstack
   # Exit with error
   exit 1
 else
   echo "We're ok: there is no zombie test, but some tests took some time to stop"
 fi
else
  echo "We're ok: there is no zombie test"
fi
Setting JDK_1_7_LATEST__HOME=/home/jenkins/tools/java/latest1.7
Setting JDK_1_8_LATEST__HOME=/home/jenkins/tools/java/latest1.8
[30b16b4c] $ /bin/bash -xe /tmp/jenkins7668208915926109642.sh
+ pwd
<https://builds.apache.org/job/HBase-1.5/jdk=JDK_1_8,label=Hadoop&&!H13/ws/>
+ ls
bin
CHANGES.txt
conf
dev-support
extra_env_var
hbase-annotations
hbase-archetypes
hbase-assembly
hbase-checkstyle
hbase-client
hbase-common
hbase-examples
hbase-external-blockcache
hbase-hadoop2-compat
hbase-hadoop-compat
hbase-it
hbase-metrics
hbase-metrics-api
hbase-native-client
hbase-prefix-tree
hbase-procedure
hbase-protocol
hbase-resource-bundle
hbase-rest
hbase-server
hbase-shaded
hbase-shell
hbase-testing-util
hbase-thrift
LICENSE.txt
NOTICE.txt
pom.xml
README.txt
src
target
++ jps -v
++ grep surefirebooter
++ grep -e -Dhbase.test
++ wc -l
+ ZOMBIE_TESTS_COUNT=0
+ [[ 0 != 0 ]]
+ echo 'We'\''re ok: there is no zombie test'
We're ok: there is no zombie test
POST BUILD TASK : SUCCESS
END OF POST BUILD TASK : 0
Archiving artifacts
Setting JDK_1_7_LATEST__HOME=/home/jenkins/tools/java/latest1.7
Setting JDK_1_8_LATEST__HOME=/home/jenkins/tools/java/latest1.8
[Fast Archiver] No prior successful build to compare, so performing full copy of artifacts
Recording test results
Setting JDK_1_7_LATEST__HOME=/home/jenkins/tools/java/latest1.7
Setting JDK_1_8_LATEST__HOME=/home/jenkins/tools/java/latest1.8
Setting JDK_1_7_LATEST__HOME=/home/jenkins/tools/java/latest1.7
Setting JDK_1_8_LATEST__HOME=/home/jenkins/tools/java/latest1.8

Mime
View raw message