hbase-builds mailing list archives

Site index · List index
Message view « Date » · « Thread »
Top « Date » · « Thread »
From Apache Jenkins Server <jenk...@builds.apache.org>
Subject Build failed in Jenkins: HBase-1.4 » JDK_1_8,Hadoop&&!H13 #932
Date Tue, 26 Sep 2017 05:56:03 GMT
See <https://builds.apache.org/job/HBase-1.4/jdk=JDK_1_8,label=Hadoop&&!H13/932/display/redirect?page=changes>

Changes:

[tedyu] HBASE-18875 Thrift server supports read-only mode

[tedyu] HBASE-18875 Thrift server supports read-only mode - addendum fixes

[apurtell] HBASE-18762 Canary sink type cast error

[apurtell] HBASE-18830 TestCanaryTool does not check Canary monitor's error code

------------------------------------------
[...truncated 2.48 MB...]
	at org.apache.hadoop.hbase.rest.TestTableResource.testTableInfoPB(TestTableResource.java:271)

testTableInfoXML(org.apache.hadoop.hbase.rest.TestTableResource)  Time elapsed: 0.112 sec
 <<< ERROR!
java.lang.NullPointerException: null
	at org.apache.hadoop.hbase.rest.TestTableResource.checkTableInfo(TestTableResource.java:184)
	at org.apache.hadoop.hbase.rest.TestTableResource.testTableInfoXML(TestTableResource.java:254)

Tests run: 2, Failures: 0, Errors: 2, Skipped: 0, Time elapsed: 23.318 sec <<< FAILURE!
- in org.apache.hadoop.hbase.rest.TestTableResource
testTableInfoPB(org.apache.hadoop.hbase.rest.TestTableResource)  Time elapsed: 0.511 sec 
<<< ERROR!
java.lang.NullPointerException: null
	at org.apache.hadoop.hbase.rest.TestTableResource.checkTableInfo(TestTableResource.java:184)
	at org.apache.hadoop.hbase.rest.TestTableResource.testTableInfoPB(TestTableResource.java:271)

testTableInfoXML(org.apache.hadoop.hbase.rest.TestTableResource)  Time elapsed: 0.076 sec
 <<< ERROR!
java.lang.NullPointerException: null
	at org.apache.hadoop.hbase.rest.TestTableResource.checkTableInfo(TestTableResource.java:184)
	at org.apache.hadoop.hbase.rest.TestTableResource.testTableInfoXML(TestTableResource.java:254)

Tests run: 2, Failures: 0, Errors: 2, Skipped: 0, Time elapsed: 37.782 sec <<< FAILURE!
- in org.apache.hadoop.hbase.rest.TestTableResource
testTableInfoPB(org.apache.hadoop.hbase.rest.TestTableResource)  Time elapsed: 0.378 sec 
<<< ERROR!
java.lang.NullPointerException: null
	at org.apache.hadoop.hbase.rest.TestTableResource.checkTableInfo(TestTableResource.java:184)
	at org.apache.hadoop.hbase.rest.TestTableResource.testTableInfoPB(TestTableResource.java:271)

testTableInfoXML(org.apache.hadoop.hbase.rest.TestTableResource)  Time elapsed: 0.081 sec
 <<< ERROR!
java.lang.NullPointerException: null
	at org.apache.hadoop.hbase.rest.TestTableResource.checkTableInfo(TestTableResource.java:184)
	at org.apache.hadoop.hbase.rest.TestTableResource.testTableInfoXML(TestTableResource.java:254)

Running org.apache.hadoop.hbase.rest.TestTableScan
Tests run: 12, Failures: 0, Errors: 0, Skipped: 0, Time elapsed: 12.351 sec - in org.apache.hadoop.hbase.rest.TestTableScan
Running org.apache.hadoop.hbase.rest.TestGetAndPutResource
Tests run: 27, Failures: 0, Errors: 0, Skipped: 0, Time elapsed: 195.416 sec - in org.apache.hadoop.hbase.rest.TestGetAndPutResource
Running org.apache.hadoop.hbase.rest.TestStatusResource
Tests run: 2, Failures: 0, Errors: 0, Skipped: 0, Time elapsed: 2.819 sec - in org.apache.hadoop.hbase.rest.TestStatusResource
Running org.apache.hadoop.hbase.rest.TestScannersWithLabels
Tests run: 2, Failures: 0, Errors: 0, Skipped: 0, Time elapsed: 3.369 sec - in org.apache.hadoop.hbase.rest.TestScannersWithLabels
Running org.apache.hadoop.hbase.rest.model.TestTableListModel
Tests run: 6, Failures: 0, Errors: 0, Skipped: 0, Time elapsed: 1.055 sec - in org.apache.hadoop.hbase.rest.model.TestTableListModel
Running org.apache.hadoop.hbase.rest.model.TestCellModel
Tests run: 6, Failures: 0, Errors: 0, Skipped: 0, Time elapsed: 1.02 sec - in org.apache.hadoop.hbase.rest.model.TestCellModel
Running org.apache.hadoop.hbase.rest.model.TestCellSetModel
Tests run: 6, Failures: 0, Errors: 0, Skipped: 0, Time elapsed: 1.089 sec - in org.apache.hadoop.hbase.rest.model.TestCellSetModel
Running org.apache.hadoop.hbase.rest.model.TestStorageClusterVersionModel
Tests run: 6, Failures: 0, Errors: 0, Skipped: 0, Time elapsed: 0.612 sec - in org.apache.hadoop.hbase.rest.model.TestStorageClusterVersionModel
Running org.apache.hadoop.hbase.rest.model.TestColumnSchemaModel
Tests run: 6, Failures: 0, Errors: 0, Skipped: 0, Time elapsed: 0.61 sec - in org.apache.hadoop.hbase.rest.model.TestColumnSchemaModel
Running org.apache.hadoop.hbase.rest.model.TestVersionModel
Tests run: 6, Failures: 0, Errors: 0, Skipped: 0, Time elapsed: 0.97 sec - in org.apache.hadoop.hbase.rest.model.TestVersionModel
Running org.apache.hadoop.hbase.rest.model.TestRowModel
Tests run: 6, Failures: 0, Errors: 0, Skipped: 0, Time elapsed: 0.586 sec - in org.apache.hadoop.hbase.rest.model.TestRowModel
Running org.apache.hadoop.hbase.rest.model.TestStorageClusterStatusModel
Tests run: 6, Failures: 0, Errors: 0, Skipped: 0, Time elapsed: 1.189 sec - in org.apache.hadoop.hbase.rest.model.TestStorageClusterStatusModel
Running org.apache.hadoop.hbase.rest.model.TestTableInfoModel
Tests run: 6, Failures: 0, Errors: 0, Skipped: 0, Time elapsed: 1.085 sec - in org.apache.hadoop.hbase.rest.model.TestTableInfoModel
Running org.apache.hadoop.hbase.rest.model.TestTableSchemaModel
Tests run: 6, Failures: 0, Errors: 0, Skipped: 0, Time elapsed: 1.086 sec - in org.apache.hadoop.hbase.rest.model.TestTableSchemaModel
Running org.apache.hadoop.hbase.rest.model.TestTableRegionModel
Tests run: 8, Failures: 0, Errors: 0, Skipped: 0, Time elapsed: 0.656 sec - in org.apache.hadoop.hbase.rest.model.TestTableRegionModel
Running org.apache.hadoop.hbase.rest.model.TestNamespacesModel
Tests run: 6, Failures: 0, Errors: 0, Skipped: 0, Time elapsed: 0.731 sec - in org.apache.hadoop.hbase.rest.model.TestNamespacesModel
Running org.apache.hadoop.hbase.rest.model.TestNamespacesInstanceModel
Tests run: 6, Failures: 0, Errors: 0, Skipped: 0, Time elapsed: 0.693 sec - in org.apache.hadoop.hbase.rest.model.TestNamespacesInstanceModel
Running org.apache.hadoop.hbase.rest.model.TestScannerModel
Tests run: 6, Failures: 0, Errors: 0, Skipped: 0, Time elapsed: 1.137 sec - in org.apache.hadoop.hbase.rest.model.TestScannerModel
Running org.apache.hadoop.hbase.rest.TestSchemaResource
Tests run: 4, Failures: 0, Errors: 0, Skipped: 0, Time elapsed: 28.901 sec - in org.apache.hadoop.hbase.rest.TestSchemaResource
Running org.apache.hadoop.hbase.rest.TestNamespacesInstanceResource
Tests run: 5, Failures: 0, Errors: 0, Skipped: 0, Time elapsed: 21.195 sec - in org.apache.hadoop.hbase.rest.TestNamespacesInstanceResource
Running org.apache.hadoop.hbase.rest.TestNamespacesResource
Tests run: 2, Failures: 0, Errors: 0, Skipped: 0, Time elapsed: 11.792 sec - in org.apache.hadoop.hbase.rest.TestNamespacesResource
Running org.apache.hadoop.hbase.rest.TestDeleteRow
Tests run: 2, Failures: 0, Errors: 0, Skipped: 0, Time elapsed: 17.918 sec - in org.apache.hadoop.hbase.rest.TestDeleteRow
Running org.apache.hadoop.hbase.rest.TestVersionResource
Tests run: 7, Failures: 0, Errors: 0, Skipped: 0, Time elapsed: 3.275 sec - in org.apache.hadoop.hbase.rest.TestVersionResource
Running org.apache.hadoop.hbase.rest.TestScannersWithFilters
Tests run: 10, Failures: 0, Errors: 0, Skipped: 0, Time elapsed: 5.518 sec - in org.apache.hadoop.hbase.rest.TestScannersWithFilters
Running org.apache.hadoop.hbase.rest.TestResourceFilter
Tests run: 1, Failures: 0, Errors: 0, Skipped: 0, Time elapsed: 1.783 sec - in org.apache.hadoop.hbase.rest.TestResourceFilter
Running org.apache.hadoop.hbase.rest.TestGZIPResponseWrapper
Tests run: 4, Failures: 0, Errors: 0, Skipped: 0, Time elapsed: 0.531 sec - in org.apache.hadoop.hbase.rest.TestGZIPResponseWrapper
Running org.apache.hadoop.hbase.rest.client.TestRemoteAdminRetries
Tests run: 7, Failures: 0, Errors: 0, Skipped: 0, Time elapsed: 1.685 sec - in org.apache.hadoop.hbase.rest.client.TestRemoteAdminRetries
Running org.apache.hadoop.hbase.rest.client.TestXmlParsing
Tests run: 2, Failures: 0, Errors: 0, Skipped: 0, Time elapsed: 1.011 sec - in org.apache.hadoop.hbase.rest.client.TestXmlParsing
Running org.apache.hadoop.hbase.rest.client.TestRemoteHTableRetries
Tests run: 7, Failures: 0, Errors: 0, Skipped: 0, Time elapsed: 1.674 sec - in org.apache.hadoop.hbase.rest.client.TestRemoteHTableRetries
Running org.apache.hadoop.hbase.rest.client.TestRemoteTable
Tests run: 9, Failures: 0, Errors: 0, Skipped: 0, Time elapsed: 59.599 sec - in org.apache.hadoop.hbase.rest.client.TestRemoteTable
Running org.apache.hadoop.hbase.rest.TestMultiRowResource
Tests run: 8, Failures: 0, Errors: 0, Skipped: 0, Time elapsed: 4.076 sec - in org.apache.hadoop.hbase.rest.TestMultiRowResource
Running org.apache.hadoop.hbase.rest.TestGzipFilter
Tests run: 2, Failures: 0, Errors: 0, Skipped: 0, Time elapsed: 3.18 sec - in org.apache.hadoop.hbase.rest.TestGzipFilter
Running org.apache.hadoop.hbase.rest.TestScannerResource
Tests run: 6, Failures: 0, Errors: 0, Skipped: 0, Time elapsed: 7.248 sec - in org.apache.hadoop.hbase.rest.TestScannerResource

Results :

Tests in error: 
org.apache.hadoop.hbase.rest.TestTableResource.testTableInfoPB(org.apache.hadoop.hbase.rest.TestTableResource)
  Run 1: TestTableResource.testTableInfoPB:271->checkTableInfo:184 NullPointer
  Run 2: TestTableResource.testTableInfoPB:271->checkTableInfo:184 NullPointer
  Run 3: TestTableResource.testTableInfoPB:271->checkTableInfo:184 NullPointer

org.apache.hadoop.hbase.rest.TestTableResource.testTableInfoXML(org.apache.hadoop.hbase.rest.TestTableResource)
  Run 1: TestTableResource.testTableInfoXML:254->checkTableInfo:184 NullPointer
  Run 2: TestTableResource.testTableInfoXML:254->checkTableInfo:184 NullPointer
  Run 3: TestTableResource.testTableInfoXML:254->checkTableInfo:184 NullPointer


Tests run: 213, Failures: 0, Errors: 2, Skipped: 0

[INFO] ------------------------------------------------------------------------
[INFO] Reactor Summary:
[INFO] 
[INFO] Apache HBase ...................................... SUCCESS [1:46.602s]
[INFO] Apache HBase - Checkstyle ......................... SUCCESS [15.391s]
[INFO] Apache HBase - Resource Bundle .................... SUCCESS [0.369s]
[INFO] Apache HBase - Annotations ........................ SUCCESS [1.484s]
[INFO] Apache HBase - Protocol ........................... SUCCESS [17.173s]
[INFO] Apache HBase - Common ............................. SUCCESS [2:43.368s]
[INFO] Apache HBase - Procedure .......................... SUCCESS [3:36.526s]
[INFO] Apache HBase - Metrics API ........................ SUCCESS [1.260s]
[INFO] Apache HBase - Hadoop Compatibility ............... SUCCESS [12.751s]
[INFO] Apache HBase - Metrics Implementation ............. SUCCESS [5.696s]
[INFO] Apache HBase - Hadoop Two Compatibility ........... SUCCESS [21.217s]
[INFO] Apache HBase - Client ............................. SUCCESS [1:46.783s]
[INFO] Apache HBase - Prefix Tree ........................ SUCCESS [9.001s]
[INFO] Apache HBase - Server ............................. SUCCESS [1:58:32.404s]
[INFO] Apache HBase - Testing Util ....................... SUCCESS [2.573s]
[INFO] Apache HBase - Thrift ............................. SUCCESS [5:38.785s]
[INFO] Apache HBase - Rest ............................... FAILURE [12:29.825s]
[INFO] Apache HBase - Shell .............................. SKIPPED
[INFO] Apache HBase - Integration Tests .................. SKIPPED
[INFO] Apache HBase - Examples ........................... SKIPPED
[INFO] Apache HBase - External Block Cache ............... SKIPPED
[INFO] Apache HBase - Assembly ........................... SKIPPED
[INFO] Apache HBase - Shaded ............................. SKIPPED
[INFO] Apache HBase - Shaded - Client .................... SKIPPED
[INFO] Apache HBase - Shaded - Server .................... SKIPPED
[INFO] Apache HBase Shaded Packaging Invariants .......... SKIPPED
[INFO] Apache HBase - Archetypes ......................... SKIPPED
[INFO] Apache HBase - Exemplar for hbase-client archetype  SKIPPED
[INFO] Apache HBase - Exemplar for hbase-shaded-client archetype  SKIPPED
[INFO] Apache HBase - Archetype builder .................. SKIPPED
[INFO] ------------------------------------------------------------------------
[INFO] BUILD FAILURE
[INFO] ------------------------------------------------------------------------
[INFO] Total time: 2:28:33.821s
[INFO] Finished at: Tue Sep 26 05:47:58 UTC 2017
[INFO] Final Memory: 124M/1608M
[INFO] ------------------------------------------------------------------------
[ERROR] Failed to execute goal org.apache.maven.plugins:maven-surefire-plugin:2.18.1:test
(default-test) on project hbase-rest: There are test failures.
[ERROR] 
[ERROR] Please refer to <https://builds.apache.org/job/HBase-1.4/jdk=JDK_1_8,label=Hadoop&&!H13/ws/hbase-rest/target/surefire-reports>
for the individual test results.
[ERROR] -> [Help 1]
[ERROR] 
[ERROR] To see the full stack trace of the errors, re-run Maven with the -e switch.
[ERROR] Re-run Maven using the -X switch to enable full debug logging.
[ERROR] 
[ERROR] For more information about the errors and possible solutions, please read the following
articles:
[ERROR] [Help 1] http://cwiki.apache.org/confluence/display/MAVEN/MojoFailureException
[ERROR] 
[ERROR] After correcting the problems, you can resume the build with the command
[ERROR]   mvn <goals> -rf :hbase-rest
Build step 'Invoke top-level Maven targets' marked build as failure
Performing Post build task...
Match found for :.* : True
Logical operation result is TRUE
Running script  : # Post-build task script. TODO: Check this in and have all builds reference
check-in.
pwd && ls
# NOTE!!!! The below code has been copied and pasted from ./dev-tools/run-test.sh
# Do not change here without syncing there and vice-versa.
ZOMBIE_TESTS_COUNT=`jps -v | grep surefirebooter | grep -e '-Dhbase.test' | wc -l`
if [[ $ZOMBIE_TESTS_COUNT != 0 ]] ; then
 echo "Suspicious java process found - waiting 30s to see if there are just slow to stop"
 sleep 30
 ZOMBIE_TESTS_COUNT=`jps -v | grep surefirebooter | grep -e '-Dhbase.test' | wc -l`
 if [[ $ZOMBIE_TESTS_COUNT != 0 ]] ; then
   echo " {color:red}There appear to be $ZOMBIE_TESTS_COUNT zombie tests{color}, they should
have been killed by surefire but survived"
   jps -v | grep surefirebooter | grep -e '-Dhbase.test'
   jps -v | grep surefirebooter | grep -e '-Dhbase.test' | cut -d ' ' -f 1 | xargs -n 1 jstack
   # Exit with error
   exit 1
 else
   echo "We're ok: there is no zombie test, but some tests took some time to stop"
 fi
else
  echo "We're ok: there is no zombie test"
fi
Setting JDK_1_7_LATEST__HOME=/home/jenkins/tools/java/latest1.7
Setting JDK_1_8_LATEST__HOME=/home/jenkins/tools/java/latest1.8
[30b16b4c] $ /bin/bash -xe /tmp/jenkins1998303910163869348.sh
+ pwd
<https://builds.apache.org/job/HBase-1.4/jdk=JDK_1_8,label=Hadoop&&!H13/ws/>
+ ls
bin
CHANGES.txt
conf
dev-support
extra_env_var
hbase-annotations
hbase-archetypes
hbase-assembly
hbase-checkstyle
hbase-client
hbase-common
hbase-examples
hbase-external-blockcache
hbase-hadoop2-compat
hbase-hadoop-compat
hbase-it
hbase-metrics
hbase-metrics-api
hbase-native-client
hbase-prefix-tree
hbase-procedure
hbase-protocol
hbase-resource-bundle
hbase-rest
hbase-server
hbase-shaded
hbase-shell
hbase-testing-util
hbase-thrift
LICENSE.txt
NOTICE.txt
pom.xml
README.txt
src
target
++ jps -v
++ grep surefirebooter
++ grep -e -Dhbase.test
++ wc -l
+ ZOMBIE_TESTS_COUNT=0
+ [[ 0 != 0 ]]
+ echo 'We'\''re ok: there is no zombie test'
We're ok: there is no zombie test
POST BUILD TASK : SUCCESS
END OF POST BUILD TASK : 0
Archiving artifacts
Setting JDK_1_7_LATEST__HOME=/home/jenkins/tools/java/latest1.7
Setting JDK_1_8_LATEST__HOME=/home/jenkins/tools/java/latest1.8
Recording test results
Setting JDK_1_7_LATEST__HOME=/home/jenkins/tools/java/latest1.7
Setting JDK_1_8_LATEST__HOME=/home/jenkins/tools/java/latest1.8
Setting JDK_1_7_LATEST__HOME=/home/jenkins/tools/java/latest1.7
Setting JDK_1_8_LATEST__HOME=/home/jenkins/tools/java/latest1.8

Mime
View raw message