hbase-builds mailing list archives

Site index · List index
Message view « Date » · « Thread »
Top « Date » · « Thread »
From Apache Jenkins Server <jenk...@builds.apache.org>
Subject Build failed in Jenkins: HBase-1.5 » JDK_1_8,Hadoop&&!H13 #56
Date Wed, 13 Sep 2017 19:07:09 GMT
See <https://builds.apache.org/job/HBase-1.5/jdk=JDK_1_8,label=Hadoop&&!H13/56/display/redirect?page=changes>

Changes:

[tedyu] HBASE-18789 Displays the reporting interval of each RS on the Master

------------------------------------------
[...truncated 2.53 MB...]
Running org.apache.hadoop.hbase.util.TestFSTableDescriptors
Tests run: 15, Failures: 0, Errors: 0, Skipped: 0, Time elapsed: 2.224 sec - in org.apache.hadoop.hbase.util.TestFSTableDescriptors
Running org.apache.hadoop.hbase.util.TestMiniClusterLoadParallel
Tests run: 3, Failures: 0, Errors: 0, Skipped: 0, Time elapsed: 7.636 sec - in org.apache.hadoop.hbase.util.TestFSHDFSUtils
Running org.apache.hadoop.hbase.util.TestMergeTable
Tests run: 1, Failures: 0, Errors: 0, Skipped: 0, Time elapsed: 23.907 sec - in org.apache.hadoop.hbase.util.TestMergeTable
Running org.apache.hadoop.hbase.zookeeper.lock.TestZKInterProcessReadWriteLock
Tests run: 2, Failures: 0, Errors: 0, Skipped: 0, Time elapsed: 63.289 sec - in org.apache.hadoop.hbase.util.hbck.TestOfflineMetaRebuildBase
Running org.apache.hadoop.hbase.zookeeper.TestZKTableStateManager
Tests run: 1, Failures: 0, Errors: 0, Skipped: 0, Time elapsed: 0.764 sec - in org.apache.hadoop.hbase.zookeeper.TestZKTableStateManager
Running org.apache.hadoop.hbase.zookeeper.TestRecoverableZooKeeper
Tests run: 1, Failures: 0, Errors: 0, Skipped: 0, Time elapsed: 1.711 sec - in org.apache.hadoop.hbase.zookeeper.TestRecoverableZooKeeper
Running org.apache.hadoop.hbase.zookeeper.TestZooKeeperACL
Tests run: 7, Failures: 0, Errors: 0, Skipped: 0, Time elapsed: 0.454 sec - in org.apache.hadoop.hbase.zookeeper.TestZooKeeperACL
Running org.apache.hadoop.hbase.zookeeper.TestHQuorumPeer
Tests run: 4, Failures: 0, Errors: 0, Skipped: 0, Time elapsed: 0.959 sec - in org.apache.hadoop.hbase.zookeeper.TestHQuorumPeer
Running org.apache.hadoop.hbase.zookeeper.TestZKLeaderManager
Tests run: 1, Failures: 0, Errors: 0, Skipped: 0, Time elapsed: 0.121 sec - in org.apache.hadoop.hbase.zookeeper.TestZKLeaderManager
Tests run: 6, Failures: 0, Errors: 0, Skipped: 0, Time elapsed: 71.95 sec - in org.apache.hadoop.hbase.util.TestMiniClusterLoadEncoded
Tests run: 4, Failures: 0, Errors: 0, Skipped: 0, Time elapsed: 53.319 sec - in org.apache.hadoop.hbase.util.TestMiniClusterLoadParallel
Tests run: 6, Failures: 0, Errors: 0, Skipped: 0, Time elapsed: 24.851 sec - in org.apache.hadoop.hbase.zookeeper.lock.TestZKInterProcessReadWriteLock
Running org.apache.hadoop.hbase.zookeeper.TestZKMulti
Running org.apache.hadoop.hbase.TestStochasticBalancerJmxMetrics
Tests run: 1, Failures: 0, Errors: 0, Skipped: 1, Time elapsed: 0.001 sec - in org.apache.hadoop.hbase.TestStochasticBalancerJmxMetrics
Running org.apache.hadoop.hbase.zookeeper.TestZooKeeperNodeTracker
Tests run: 12, Failures: 0, Errors: 0, Skipped: 0, Time elapsed: 1.278 sec - in org.apache.hadoop.hbase.zookeeper.TestZKMulti
Tests run: 3, Failures: 0, Errors: 0, Skipped: 0, Time elapsed: 1.104 sec - in org.apache.hadoop.hbase.zookeeper.TestZooKeeperNodeTracker
Running org.apache.hadoop.hbase.TestZooKeeper
Running org.apache.hadoop.hbase.TestFullLogReconstruction
Running org.apache.hadoop.hbase.TestJMXListener
Tests run: 3, Failures: 0, Errors: 0, Skipped: 0, Time elapsed: 1.601 sec - in org.apache.hadoop.hbase.TestJMXListener
Running org.apache.hadoop.hbase.TestPartialResultsFromClientSide
Running org.apache.hadoop.hbase.trace.TestHTraceHooks
Tests run: 1, Failures: 0, Errors: 0, Skipped: 0, Time elapsed: 14.272 sec - in org.apache.hadoop.hbase.TestFullLogReconstruction
Tests run: 1, Failures: 0, Errors: 0, Skipped: 0, Time elapsed: 18.367 sec - in org.apache.hadoop.hbase.trace.TestHTraceHooks
Tests run: 19, Failures: 0, Errors: 0, Skipped: 0, Time elapsed: 68.581 sec - in org.apache.hadoop.hbase.TestPartialResultsFromClientSide
Tests run: 59, Failures: 0, Errors: 0, Skipped: 1, Time elapsed: 382.54 sec - in org.apache.hadoop.hbase.util.TestHBaseFsck
Tests run: 10, Failures: 0, Errors: 1, Skipped: 0, Time elapsed: 456.225 sec <<<
FAILURE! - in org.apache.hadoop.hbase.TestZooKeeper
testMasterSessionExpired(org.apache.hadoop.hbase.TestZooKeeper)  Time elapsed: 303.403 sec
 <<< ERROR!
org.junit.runners.model.TestTimedOutException: test timed out after 300000 milliseconds
	at java.lang.Object.wait(Native Method)
	at org.apache.hadoop.hbase.client.RpcRetryingCaller.callWithRetries(RpcRetryingCaller.java:186)
	at org.apache.hadoop.hbase.client.HBaseAdmin.executeCallable(HBaseAdmin.java:4444)
	at org.apache.hadoop.hbase.client.HBaseAdmin.executeCallable(HBaseAdmin.java:4436)
	at org.apache.hadoop.hbase.client.HBaseAdmin.createTableAsyncV2(HBaseAdmin.java:755)
	at org.apache.hadoop.hbase.client.HBaseAdmin.createTable(HBaseAdmin.java:676)
	at org.apache.hadoop.hbase.client.HBaseAdmin.createTable(HBaseAdmin.java:609)
	at org.apache.hadoop.hbase.TestZooKeeper.testSanity(TestZooKeeper.java:258)
	at org.apache.hadoop.hbase.TestZooKeeper.testMasterSessionExpired(TestZooKeeper.java:227)

Tests run: 1, Failures: 0, Errors: 0, Skipped: 0, Time elapsed: 469.813 sec - in org.apache.hadoop.hbase.TestZooKeeper

Results :

Tests in error: 
org.apache.hadoop.hbase.client.TestClientScannerRPCTimeout.testScannerNextRPCTimesout(org.apache.hadoop.hbase.client.TestClientScannerRPCTimeout)
  Run 1: TestClientScannerRPCTimeout.testScannerNextRPCTimesout:87 » TableExists testSc...
  Run 2: TestClientScannerRPCTimeout.testScannerNextRPCTimesout:87 » TableExists testSc...
  Run 3: TestClientScannerRPCTimeout.testScannerNextRPCTimesout:87 » TableExists testSc...

org.apache.hadoop.hbase.regionserver.TestRSKilledWhenInitializing.testRSTerminationAfterRegisteringToMasterBeforeCreatingEphemeralNode(org.apache.hadoop.hbase.regionserver.TestRSKilledWhenInitializing)
  Run 1: TestRSKilledWhenInitializing.testRSTerminationAfterRegisteringToMasterBeforeCreatingEphemeralNode:142
null
  Run 2: TestRSKilledWhenInitializing.testRSTerminationAfterRegisteringToMasterBeforeCreatingEphemeralNode:115
» TestTimedOut
  Run 3: TestRSKilledWhenInitializing.testRSTerminationAfterRegisteringToMasterBeforeCreatingEphemeralNode
» 
  Run 4: TestRSKilledWhenInitializing.testRSTerminationAfterRegisteringToMasterBeforeCreatingEphemeralNode:115
» TestTimedOut
  Run 5: TestRSKilledWhenInitializing.testRSTerminationAfterRegisteringToMasterBeforeCreatingEphemeralNode
» 

  TestTablePermissions.beforeClass:111 » RetriesExhausted Failed after attempts=...
Flaked tests: 
org.apache.hadoop.hbase.TestZooKeeper.testMasterSessionExpired(org.apache.hadoop.hbase.TestZooKeeper)
  Run 1: TestZooKeeper.testMasterSessionExpired:227->testSanity:258->Object.wait:-2
» TestTimedOut
  Run 2: PASS

org.apache.hadoop.hbase.regionserver.TestEncryptionKeyRotation.testCFKeyRotation(org.apache.hadoop.hbase.regionserver.TestEncryptionKeyRotation)
  Run 1: TestEncryptionKeyRotation.testCFKeyRotation:128 Waiting timed out after [30,000]
msec
  Run 2: PASS

org.apache.hadoop.hbase.regionserver.TestHRegion.testWritesWhileRollWriter(org.apache.hadoop.hbase.regionserver.TestHRegion)
  Run 1: TestHRegion.testWritesWhileRollWriter » DamagedWAL Failed offering sync
  Run 2: PASS

org.apache.hadoop.hbase.replication.multiwal.TestReplicationEndpointWithMultipleWAL.testInterClusterReplication(org.apache.hadoop.hbase.replication.multiwal.TestReplicationEndpointWithMultipleWAL)
  Run 1: TestReplicationEndpointWithMultipleWAL>TestReplicationEndpoint.setup:93 » RegionServerAborted
  Run 2: PASS

org.apache.hadoop.hbase.replication.multiwal.TestReplicationEndpointWithMultipleWAL.testMetricsSourceBaseSourcePassthrough(org.apache.hadoop.hbase.replication.multiwal.TestReplicationEndpointWithMultipleWAL)
  Run 1: TestReplicationEndpointWithMultipleWAL>TestReplicationEndpoint.setup:93 » RegionServerAborted
  Run 2: PASS

org.apache.hadoop.hbase.replication.multiwal.TestReplicationEndpointWithMultipleWAL.testReplicationEndpointReturnsFalseOnReplicate(org.apache.hadoop.hbase.replication.multiwal.TestReplicationEndpointWithMultipleWAL)
  Run 1: TestReplicationEndpointWithMultipleWAL>TestReplicationEndpoint.setup:93 » RegionServerAborted
  Run 2: PASS

org.apache.hadoop.hbase.replication.multiwal.TestReplicationEndpointWithMultipleWAL.testWALEntryFilterAddValidation(org.apache.hadoop.hbase.replication.multiwal.TestReplicationEndpointWithMultipleWAL)
  Run 1: TestReplicationEndpointWithMultipleWAL>TestReplicationEndpoint.setup:93 » RegionServerAborted
  Run 2: PASS

org.apache.hadoop.hbase.replication.multiwal.TestReplicationEndpointWithMultipleWAL.testWALEntryFilterFromReplicationEndpoint(org.apache.hadoop.hbase.replication.multiwal.TestReplicationEndpointWithMultipleWAL)
  Run 1: TestReplicationEndpointWithMultipleWAL.testWALEntryFilterFromReplicationEndpoint
» IO
  Run 2: PASS

org.apache.hadoop.hbase.replication.multiwal.TestReplicationEndpointWithMultipleWAL.testWALEntryFilterUpdateValidation(org.apache.hadoop.hbase.replication.multiwal.TestReplicationEndpointWithMultipleWAL)
  Run 1: TestReplicationEndpointWithMultipleWAL>TestReplicationEndpoint.setup:93 » Connect
  Run 2: PASS


Tests run: 2812, Failures: 0, Errors: 3, Skipped: 55, Flakes: 9

[INFO] ------------------------------------------------------------------------
[INFO] Reactor Summary:
[INFO] 
[INFO] Apache HBase ...................................... SUCCESS [1:48.798s]
[INFO] Apache HBase - Checkstyle ......................... SUCCESS [16.060s]
[INFO] Apache HBase - Resource Bundle .................... SUCCESS [0.225s]
[INFO] Apache HBase - Annotations ........................ SUCCESS [1.590s]
[INFO] Apache HBase - Protocol ........................... SUCCESS [21.106s]
[INFO] Apache HBase - Common ............................. SUCCESS [3:16.975s]
[INFO] Apache HBase - Procedure .......................... SUCCESS [4:12.633s]
[INFO] Apache HBase - Metrics API ........................ SUCCESS [1.971s]
[INFO] Apache HBase - Hadoop Compatibility ............... SUCCESS [12.744s]
[INFO] Apache HBase - Metrics Implementation ............. SUCCESS [7.299s]
[INFO] Apache HBase - Hadoop Two Compatibility ........... SUCCESS [25.485s]
[INFO] Apache HBase - Client ............................. SUCCESS [1:58.536s]
[INFO] Apache HBase - Prefix Tree ........................ SUCCESS [12.878s]
[INFO] Apache HBase - Server ............................. FAILURE [2:04:00.991s]
[INFO] Apache HBase - Testing Util ....................... SKIPPED
[INFO] Apache HBase - Thrift ............................. SKIPPED
[INFO] Apache HBase - Rest ............................... SKIPPED
[INFO] Apache HBase - Shell .............................. SKIPPED
[INFO] Apache HBase - Integration Tests .................. SKIPPED
[INFO] Apache HBase - Examples ........................... SKIPPED
[INFO] Apache HBase - External Block Cache ............... SKIPPED
[INFO] Apache HBase - Assembly ........................... SKIPPED
[INFO] Apache HBase - Shaded ............................. SKIPPED
[INFO] Apache HBase - Shaded - Client .................... SKIPPED
[INFO] Apache HBase - Shaded - Server .................... SKIPPED
[INFO] Apache HBase Shaded Packaging Invariants .......... SKIPPED
[INFO] Apache HBase - Archetypes ......................... SKIPPED
[INFO] Apache HBase - Exemplar for hbase-client archetype  SKIPPED
[INFO] Apache HBase - Exemplar for hbase-shaded-client archetype  SKIPPED
[INFO] Apache HBase - Archetype builder .................. SKIPPED
[INFO] ------------------------------------------------------------------------
[INFO] BUILD FAILURE
[INFO] ------------------------------------------------------------------------
[INFO] Total time: 2:17:31.350s
[INFO] Finished at: Wed Sep 13 18:57:36 UTC 2017
[INFO] Final Memory: 104M/3033M
[INFO] ------------------------------------------------------------------------
[ERROR] Failed to execute goal org.apache.maven.plugins:maven-surefire-plugin:2.18.1:test
(secondPartTestsExecution) on project hbase-server: ExecutionException: java.lang.RuntimeException:
There was an error in the forked process
[ERROR] java.lang.ArrayIndexOutOfBoundsException: 1
[ERROR] at org.apache.maven.surefire.common.junit4.JUnit4ProviderUtil.generateFailingTests(JUnit4ProviderUtil.java:64)
[ERROR] at org.apache.maven.surefire.junitcore.JUnitCoreProvider.invoke(JUnitCoreProvider.java:151)
[ERROR] at org.apache.maven.surefire.booter.ForkedBooter.invokeProviderInSameClassLoader(ForkedBooter.java:203)
[ERROR] at org.apache.maven.surefire.booter.ForkedBooter.runSuitesInProcess(ForkedBooter.java:155)
[ERROR] at org.apache.maven.surefire.booter.ForkedBooter.main(ForkedBooter.java:103)
[ERROR] -> [Help 1]
[ERROR] 
[ERROR] To see the full stack trace of the errors, re-run Maven with the -e switch.
[ERROR] Re-run Maven using the -X switch to enable full debug logging.
[ERROR] 
[ERROR] For more information about the errors and possible solutions, please read the following
articles:
[ERROR] [Help 1] http://cwiki.apache.org/confluence/display/MAVEN/MojoFailureException
[ERROR] 
[ERROR] After correcting the problems, you can resume the build with the command
[ERROR]   mvn <goals> -rf :hbase-server
Build step 'Invoke top-level Maven targets' marked build as failure
Performing Post build task...
Match found for :.* : True
Logical operation result is TRUE
Running script  : # Post-build task script. TODO: Check this in and have all builds reference
check-in.
pwd && ls
# NOTE!!!! The below code has been copied and pasted from ./dev-tools/run-test.sh
# Do not change here without syncing there and vice-versa.
ZOMBIE_TESTS_COUNT=`jps -v | grep surefirebooter | grep -e '-Dhbase.test' | wc -l`
if [[ $ZOMBIE_TESTS_COUNT != 0 ]] ; then
 echo "Suspicious java process found - waiting 30s to see if there are just slow to stop"
 sleep 30
 ZOMBIE_TESTS_COUNT=`jps -v | grep surefirebooter | grep -e '-Dhbase.test' | wc -l`
 if [[ $ZOMBIE_TESTS_COUNT != 0 ]] ; then
   echo " {color:red}There appear to be $ZOMBIE_TESTS_COUNT zombie tests{color}, they should
have been killed by surefire but survived"
   jps -v | grep surefirebooter | grep -e '-Dhbase.test'
   jps -v | grep surefirebooter | grep -e '-Dhbase.test' | cut -d ' ' -f 1 | xargs -n 1 jstack
   # Exit with error
   exit 1
 else
   echo "We're ok: there is no zombie test, but some tests took some time to stop"
 fi
else
  echo "We're ok: there is no zombie test"
fi
Setting JDK_1_7_LATEST__HOME=/home/jenkins/tools/java/latest1.7
Setting JDK_1_8_LATEST__HOME=/home/jenkins/tools/java/latest1.8
[30b16b4c] $ /bin/bash -xe /tmp/jenkins4561818219589044916.sh
+ pwd
<https://builds.apache.org/job/HBase-1.5/jdk=JDK_1_8,label=Hadoop&&!H13/ws/>
+ ls
bin
CHANGES.txt
conf
dev-support
extra_env_var
hbase-annotations
hbase-archetypes
hbase-assembly
hbase-checkstyle
hbase-client
hbase-common
hbase-examples
hbase-external-blockcache
hbase-hadoop2-compat
hbase-hadoop-compat
hbase-it
hbase-metrics
hbase-metrics-api
hbase-native-client
hbase-prefix-tree
hbase-procedure
hbase-protocol
hbase-resource-bundle
hbase-rest
hbase-server
hbase-shaded
hbase-shell
hbase-testing-util
hbase-thrift
LICENSE.txt
NOTICE.txt
pom.xml
README.txt
src
target
++ jps -v
++ grep surefirebooter
++ grep -e -Dhbase.test
++ wc -l
+ ZOMBIE_TESTS_COUNT=0
+ [[ 0 != 0 ]]
+ echo 'We'\''re ok: there is no zombie test'
We're ok: there is no zombie test
POST BUILD TASK : SUCCESS
END OF POST BUILD TASK : 0
Archiving artifacts
Setting JDK_1_7_LATEST__HOME=/home/jenkins/tools/java/latest1.7
Setting JDK_1_8_LATEST__HOME=/home/jenkins/tools/java/latest1.8
Recording test results
Setting JDK_1_7_LATEST__HOME=/home/jenkins/tools/java/latest1.7
Setting JDK_1_8_LATEST__HOME=/home/jenkins/tools/java/latest1.8
Setting JDK_1_7_LATEST__HOME=/home/jenkins/tools/java/latest1.7
Setting JDK_1_8_LATEST__HOME=/home/jenkins/tools/java/latest1.8

Mime
View raw message