hbase-builds mailing list archives

Site index · List index
Message view « Date » · « Thread »
Top « Date » · « Thread »
From Apache Jenkins Server <jenk...@builds.apache.org>
Subject Build failed in Jenkins: HBase-2.0 » JDK 1.8 (latest),Hadoop #473
Date Thu, 07 Sep 2017 19:31:17 GMT
See <https://builds.apache.org/job/HBase-2.0/jdk=JDK%201.8%20(latest),label=Hadoop/473/display/redirect?page=changes>

Changes:

[tedyu] HBASE-15410 Utilize the max seek value when all Filters in MUST_PASS_ALL

[busbey] HBASE-18704 Upgrade hbase to commons-collections 4

[tedyu] HBASE-17972 Remove mergePool from CompactSplitThread

------------------------------------------
[...truncated 867.03 KB...]
[INFO] ------------------------------------------------------------------------
[INFO] BUILD SUCCESS
[INFO] ------------------------------------------------------------------------
[INFO] Total time: 1.146s
[INFO] Finished at: Thu Sep 07 19:21:52 UTC 2017
[INFO] Final Memory: 23M/1447M
[INFO] ------------------------------------------------------------------------
[INFO] Archetype project created in <https://builds.apache.org/job/HBase-2.0/jdk=JDK%201.8%20(latest),label=Hadoop/ws/hbase-archetypes/hbase-client-project/target/build-archetype/target/generated-sources/archetype>
[INFO] ------------------------------------------------------------------------
[INFO] BUILD SUCCESS
[INFO] ------------------------------------------------------------------------
[INFO] Total time: 3.399s
[INFO] Finished at: Thu Sep 07 19:21:52 UTC 2017
[INFO] Final Memory: 24M/1447M
[INFO] ------------------------------------------------------------------------
[INFO] Scanning for projects...
[INFO]                                                                         
[INFO] ------------------------------------------------------------------------
[INFO] Building Apache HBase - Exemplar for hbase-shaded-client archetype 2.0.0-alpha3-SNAPSHOT
[INFO] ------------------------------------------------------------------------
[INFO] 
[INFO] >>> maven-archetype-plugin:2.4:create-from-project (default-cli) @ hbase-shaded-client-project
>>>
[INFO] 
[INFO] <<< maven-archetype-plugin:2.4:create-from-project (default-cli) @ hbase-shaded-client-project
<<<
[INFO] 
[INFO] --- maven-archetype-plugin:2.4:create-from-project (default-cli) @ hbase-shaded-client-project
---
[INFO] Setting default groupId: org.apache.hbase
[INFO] Setting default artifactId: hbase-shaded-client-project
[INFO] Setting default version: 2.0.0-alpha3-SNAPSHOT
[INFO] Setting default package: org.apache.hbase
[INFO] Scanning for projects...
[INFO]                                                                         
[INFO] ------------------------------------------------------------------------
[INFO] Building hbase-shaded-client-project-archetype 2.0.0-alpha3-SNAPSHOT
[INFO] ------------------------------------------------------------------------
[INFO] 
[INFO] --- maven-resources-plugin:3.0.1:resources (default-resources) @ hbase-shaded-client-project-archetype
---
[WARNING] Using platform encoding (ISO-8859-1 actually) to copy filtered resources, i.e. build
is platform dependent!
[INFO] Copying 9 resources
[INFO] 
[INFO] --- maven-resources-plugin:3.0.1:testResources (default-testResources) @ hbase-shaded-client-project-archetype
---
[WARNING] Using platform encoding (ISO-8859-1 actually) to copy filtered resources, i.e. build
is platform dependent!
[INFO] Copying 2 resources
[INFO] 
[INFO] --- maven-archetype-plugin:2.4:jar (default-jar) @ hbase-shaded-client-project-archetype
---
[INFO] Building archetype jar: <https://builds.apache.org/job/HBase-2.0/jdk=JDK%201.8%20(latest),label=Hadoop/ws/hbase-archetypes/hbase-shaded-client-project/target/build-archetype/target/generated-sources/archetype/target/hbase-shaded-client-project-archetype-2.0.0-alpha3-SNAPSHOT>
[INFO] ------------------------------------------------------------------------
[INFO] BUILD SUCCESS
[INFO] ------------------------------------------------------------------------
[INFO] Total time: 1.236s
[INFO] Finished at: Thu Sep 07 19:21:56 UTC 2017
[INFO] Final Memory: 23M/1447M
[INFO] ------------------------------------------------------------------------
[INFO] Archetype project created in <https://builds.apache.org/job/HBase-2.0/jdk=JDK%201.8%20(latest),label=Hadoop/ws/hbase-archetypes/hbase-shaded-client-project/target/build-archetype/target/generated-sources/archetype>
[INFO] ------------------------------------------------------------------------
[INFO] BUILD SUCCESS
[INFO] ------------------------------------------------------------------------
[INFO] Total time: 3.539s
[INFO] Finished at: Thu Sep 07 19:21:56 UTC 2017
[INFO] Final Memory: 24M/1447M
[INFO] ------------------------------------------------------------------------
[INFO] 
[INFO] --- maven-resources-plugin:2.7:copy-resources (hbase-client-ARCHETYPE__copy-pom-to-temp-for-xslt-processing)
@ hbase-archetype-builder ---
[INFO] Using 'UTF-8' encoding to copy filtered resources.
[INFO] Copying 1 resource
[INFO] 
[INFO] --- maven-resources-plugin:2.7:copy-resources (hbase-shaded-client-ARCHETYPE__copy-pom-to-temp-for-xslt-processing)
@ hbase-archetype-builder ---
[INFO] Using 'UTF-8' encoding to copy filtered resources.
[INFO] Copying 1 resource
[INFO] 
[INFO] --- xml-maven-plugin:1.0.1:transform (modify-archetype-pom-files-via-xslt) @ hbase-archetype-builder
---
[INFO] Transforming file: <https://builds.apache.org/job/HBase-2.0/jdk=JDK%201.8%20(latest),label=Hadoop/473/artifact/hbase-archetypes/hbase-archetype-builder/../hbase-client-project/target/temp-arch/pom.xml>
[INFO] Transformed 1 file(s).
[INFO] Transforming file: <https://builds.apache.org/job/HBase-2.0/jdk=JDK%201.8%20(latest),label=Hadoop/473/artifact/hbase-archetypes/hbase-archetype-builder/../hbase-shaded-client-project/target/temp-arch/pom.xml>
[INFO] Transformed 1 file(s).
[INFO] 
[INFO] --- maven-install-plugin:2.5.2:install (default-install) @ hbase-archetype-builder
---
[INFO] Installing <https://builds.apache.org/job/HBase-2.0/jdk=JDK%201.8%20(latest),label=Hadoop/473/artifact/hbase-archetypes/hbase-archetype-builder/pom.xml>
to /home/jenkins/.m2/repository/org/apache/hbase/hbase-archetype-builder/2.0.0-alpha3-SNAPSHOT/hbase-archetype-builder-2.0.0-alpha3-SNAPSHOT.pom
[INFO] 
[INFO] --- exec-maven-plugin:1.6.0:exec (run-installArchetypes-script) @ hbase-archetype-builder
---
[INFO] Scanning for projects...
[INFO]                                                                         
[INFO] ------------------------------------------------------------------------
[INFO] Building hbase-client-project-archetype 2.0.0-alpha3-SNAPSHOT
[INFO] ------------------------------------------------------------------------
[INFO] 
[INFO] --- maven-resources-plugin:3.0.1:resources (default-resources) @ hbase-client-project-archetype
---
[INFO] Using 'UTF-8' encoding to copy filtered resources.
[INFO] Copying 9 resources
[INFO] 
[INFO] --- maven-resources-plugin:3.0.1:testResources (default-testResources) @ hbase-client-project-archetype
---
[INFO] Using 'UTF-8' encoding to copy filtered resources.
[INFO] Copying 2 resources
[INFO] 
[INFO] --- maven-archetype-plugin:2.4:jar (default-jar) @ hbase-client-project-archetype ---
[INFO] Building archetype jar: <https://builds.apache.org/job/HBase-2.0/jdk=JDK%201.8%20(latest),label=Hadoop/ws/hbase-archetypes/hbase-client-project/target/build-archetype/target/generated-sources/archetype/target/hbase-client-project-archetype-2.0.0-alpha3-SNAPSHOT>
[INFO] 
[INFO] --- maven-archetype-plugin:2.4:integration-test (default-integration-test) @ hbase-client-project-archetype
---
[INFO] Processing Archetype IT project: basic
[INFO] ----------------------------------------------------------------------------
[INFO] Using following parameters for creating project from Archetype: hbase-client-project-archetype:2.0.0-alpha3-SNAPSHOT
[INFO] ----------------------------------------------------------------------------
[INFO] Parameter: groupId, Value: archetype.it
[INFO] Parameter: artifactId, Value: basic
[INFO] Parameter: version, Value: 0.1-SNAPSHOT
[INFO] Parameter: package, Value: it.pkg
[INFO] Parameter: packageInPathFormat, Value: it/pkg
[INFO] Parameter: version, Value: 0.1-SNAPSHOT
[INFO] Parameter: package, Value: it.pkg
[INFO] Parameter: groupId, Value: archetype.it
[INFO] Parameter: artifactId, Value: basic
[INFO] project created from Archetype in dir: <https://builds.apache.org/job/HBase-2.0/jdk=JDK%201.8%20(latest),label=Hadoop/ws/hbase-archetypes/hbase-client-project/target/build-archetype/target/generated-sources/archetype/target/test-classes/projects/basic/project/basic>
[INFO] 
[INFO] --- maven-install-plugin:2.5.2:install (default-install) @ hbase-client-project-archetype
---
[INFO] Installing <https://builds.apache.org/job/HBase-2.0/jdk=JDK%201.8%20(latest),label=Hadoop/ws/hbase-archetypes/hbase-client-project/target/build-archetype/target/generated-sources/archetype/target/hbase-client-project-archetype-2.0.0-alpha3-SNAPSHOT.jar>
to /home/jenkins/.m2/repository/org/apache/hbase/hbase-client-project-archetype/2.0.0-alpha3-SNAPSHOT/hbase-client-project-archetype-2.0.0-alpha3-SNAPSHOT.jar
[INFO] Installing <https://builds.apache.org/job/HBase-2.0/jdk=JDK%201.8%20(latest),label=Hadoop/473/artifact/hbase-archetypes/hbase-client-project/target/build-archetype/target/generated-sources/archetype/pom.xml>
to /home/jenkins/.m2/repository/org/apache/hbase/hbase-client-project-archetype/2.0.0-alpha3-SNAPSHOT/hbase-client-project-archetype-2.0.0-alpha3-SNAPSHOT.pom
[INFO] 
[INFO] --- maven-archetype-plugin:2.4:update-local-catalog (default-update-local-catalog)
@ hbase-client-project-archetype ---
[INFO] ------------------------------------------------------------------------
[INFO] BUILD SUCCESS
[INFO] ------------------------------------------------------------------------
[INFO] Total time: 1.301s
[INFO] Finished at: Thu Sep 07 19:21:59 UTC 2017
[INFO] Final Memory: 24M/1447M
[INFO] ------------------------------------------------------------------------
[INFO] Scanning for projects...
[INFO]                                                                         
[INFO] ------------------------------------------------------------------------
[INFO] Building hbase-shaded-client-project-archetype 2.0.0-alpha3-SNAPSHOT
[INFO] ------------------------------------------------------------------------
[INFO] 
[INFO] --- maven-resources-plugin:3.0.1:resources (default-resources) @ hbase-shaded-client-project-archetype
---
[INFO] Using 'UTF-8' encoding to copy filtered resources.
[INFO] Copying 9 resources
[INFO] 
[INFO] --- maven-resources-plugin:3.0.1:testResources (default-testResources) @ hbase-shaded-client-project-archetype
---
[INFO] Using 'UTF-8' encoding to copy filtered resources.
[INFO] Copying 2 resources
[INFO] 
[INFO] --- maven-archetype-plugin:2.4:jar (default-jar) @ hbase-shaded-client-project-archetype
---
[INFO] Building archetype jar: <https://builds.apache.org/job/HBase-2.0/jdk=JDK%201.8%20(latest),label=Hadoop/ws/hbase-archetypes/hbase-shaded-client-project/target/build-archetype/target/generated-sources/archetype/target/hbase-shaded-client-project-archetype-2.0.0-alpha3-SNAPSHOT>
[INFO] 
[INFO] --- maven-archetype-plugin:2.4:integration-test (default-integration-test) @ hbase-shaded-client-project-archetype
---
[INFO] Processing Archetype IT project: basic
[INFO] ----------------------------------------------------------------------------
[INFO] Using following parameters for creating project from Archetype: hbase-shaded-client-project-archetype:2.0.0-alpha3-SNAPSHOT
[INFO] ----------------------------------------------------------------------------
[INFO] Parameter: groupId, Value: archetype.it
[INFO] Parameter: artifactId, Value: basic
[INFO] Parameter: version, Value: 0.1-SNAPSHOT
[INFO] Parameter: package, Value: it.pkg
[INFO] Parameter: packageInPathFormat, Value: it/pkg
[INFO] Parameter: version, Value: 0.1-SNAPSHOT
[INFO] Parameter: package, Value: it.pkg
[INFO] Parameter: groupId, Value: archetype.it
[INFO] Parameter: artifactId, Value: basic
[INFO] project created from Archetype in dir: <https://builds.apache.org/job/HBase-2.0/jdk=JDK%201.8%20(latest),label=Hadoop/ws/hbase-archetypes/hbase-shaded-client-project/target/build-archetype/target/generated-sources/archetype/target/test-classes/projects/basic/project/basic>
[INFO] 
[INFO] --- maven-install-plugin:2.5.2:install (default-install) @ hbase-shaded-client-project-archetype
---
[INFO] Installing <https://builds.apache.org/job/HBase-2.0/jdk=JDK%201.8%20(latest),label=Hadoop/ws/hbase-archetypes/hbase-shaded-client-project/target/build-archetype/target/generated-sources/archetype/target/hbase-shaded-client-project-archetype-2.0.0-alpha3-SNAPSHOT.jar>
to /home/jenkins/.m2/repository/org/apache/hbase/hbase-shaded-client-project-archetype/2.0.0-alpha3-SNAPSHOT/hbase-shaded-client-project-archetype-2.0.0-alpha3-SNAPSHOT.jar
[INFO] Installing <https://builds.apache.org/job/HBase-2.0/jdk=JDK%201.8%20(latest),label=Hadoop/473/artifact/hbase-archetypes/hbase-shaded-client-project/target/build-archetype/target/generated-sources/archetype/pom.xml>
to /home/jenkins/.m2/repository/org/apache/hbase/hbase-shaded-client-project-archetype/2.0.0-alpha3-SNAPSHOT/hbase-shaded-client-project-archetype-2.0.0-alpha3-SNAPSHOT.pom
[INFO] 
[INFO] --- maven-archetype-plugin:2.4:update-local-catalog (default-update-local-catalog)
@ hbase-shaded-client-project-archetype ---
[INFO] ------------------------------------------------------------------------
[INFO] BUILD SUCCESS
[INFO] ------------------------------------------------------------------------
[INFO] Total time: 1.303s
[INFO] Finished at: Thu Sep 07 19:22:02 UTC 2017
[INFO] Final Memory: 24M/1447M
[INFO] ------------------------------------------------------------------------
[INFO] ------------------------------------------------------------------------
[INFO] Reactor Summary:
[INFO] 
[INFO] Apache HBase ...................................... SUCCESS [2.355s]
[INFO] Apache HBase - Checkstyle ......................... SUCCESS [0.532s]
[INFO] Apache HBase - Annotations ........................ SUCCESS [0.320s]
[INFO] Apache HBase - Shaded Protocol .................... SUCCESS [23.139s]
[INFO] Apache HBase - Common ............................. SUCCESS [2:19.496s]
[INFO] Apache HBase - Metrics API ........................ SUCCESS [1.844s]
[INFO] Apache HBase - Hadoop Compatibility ............... SUCCESS [14.482s]
[INFO] Apache HBase - Metrics Implementation ............. SUCCESS [7.674s]
[INFO] Apache HBase - Hadoop Two Compatibility ........... SUCCESS [18.112s]
[INFO] Apache HBase - Protocol ........................... SUCCESS [0.797s]
[INFO] Apache HBase - Client ............................. SUCCESS [2:21.925s]
[INFO] Apache HBase - Replication ........................ SUCCESS [1.209s]
[INFO] Apache HBase - Prefix Tree ........................ SUCCESS [16.054s]
[INFO] Apache HBase - Procedure .......................... SUCCESS [2:45.826s]
[INFO] Apache HBase - Server ............................. FAILURE [1:33:12.744s]
[INFO] Apache HBase - MapReduce .......................... SKIPPED
[INFO] Apache HBase - Resource Bundle .................... SUCCESS [0.184s]
[INFO] Apache HBase - Testing Util ....................... SKIPPED
[INFO] Apache HBase - Thrift ............................. SKIPPED
[INFO] Apache HBase - RSGroup ............................ SKIPPED
[INFO] Apache HBase - Shell .............................. SKIPPED
[INFO] Apache HBase - Coprocessor Endpoint ............... SKIPPED
[INFO] Apache HBase - Backup ............................. SKIPPED
[INFO] Apache HBase - Integration Tests .................. SKIPPED
[INFO] Apache HBase - Examples ........................... SKIPPED
[INFO] Apache HBase - Rest ............................... SKIPPED
[INFO] Apache HBase - External Block Cache ............... SKIPPED
[INFO] Apache HBase - Spark .............................. SKIPPED
[INFO] Apache HBase - Spark Integration Tests ............ SKIPPED
[INFO] Apache HBase - Assembly ........................... SKIPPED
[INFO] Apache HBase - Shaded ............................. SUCCESS [0.260s]
[INFO] Apache HBase - Shaded - Client .................... SUCCESS [1.152s]
[INFO] Apache HBase - Shaded - MapReduce ................. SKIPPED
[INFO] Apache HBase Shaded Packaging Invariants .......... SKIPPED
[INFO] Apache HBase - Archetypes ......................... SUCCESS [0.043s]
[INFO] Apache HBase - Exemplar for hbase-client archetype  SKIPPED
[INFO] Apache HBase - Exemplar for hbase-shaded-client archetype  SKIPPED
[INFO] Apache HBase - Archetype builder .................. SUCCESS [15.653s]
[INFO] ------------------------------------------------------------------------
[INFO] BUILD FAILURE
[INFO] ------------------------------------------------------------------------
[INFO] Total time: 1:42:25.181s
[INFO] Finished at: Thu Sep 07 19:22:02 UTC 2017
[INFO] Final Memory: 87M/6924M
[INFO] ------------------------------------------------------------------------
[ERROR] Failed to execute goal org.apache.maven.plugins:maven-surefire-plugin:2.19.1:test
(secondPartTestsExecution) on project hbase-server: There are test failures.
[ERROR] 
[ERROR] Please refer to <https://builds.apache.org/job/HBase-2.0/jdk=JDK%201.8%20(latest),label=Hadoop/ws/hbase-server/target/surefire-reports>
for the individual test results.
[ERROR] -> [Help 1]
[ERROR] 
[ERROR] To see the full stack trace of the errors, re-run Maven with the -e switch.
[ERROR] Re-run Maven using the -X switch to enable full debug logging.
[ERROR] 
[ERROR] For more information about the errors and possible solutions, please read the following
articles:
[ERROR] [Help 1] http://cwiki.apache.org/confluence/display/MAVEN/MojoFailureException
[ERROR] 
[ERROR] After correcting the problems, you can resume the build with the command
[ERROR]   mvn <goals> -rf :hbase-server
Build step 'Invoke top-level Maven targets' marked build as failure
Performing Post build task...
Match found for :.* : True
Logical operation result is TRUE
Running script  : # Run zombie detector script
./dev-support/zombie-detector.sh --jenkins ${BUILD_ID}
[a3159d73] $ /bin/bash -xe /tmp/jenkins6640808919365476661.sh
+ ./dev-support/zombie-detector.sh --jenkins 473
Thu Sep  7 19:22:07 UTC 2017 We're ok: there is no zombie test


    {color:green}+1 zombies{color}. No zombie tests found running at the end of the build.
POST BUILD TASK : SUCCESS
END OF POST BUILD TASK : 0
Archiving artifacts
Recording test results
[FINDBUGS] Skipping publisher since build result is FAILURE
[CHECKSTYLE] Skipping publisher since build result is FAILURE

Mime
View raw message