hbase-builds mailing list archives

Site index · List index
Message view « Date » · « Thread »
Top « Date » · « Thread »
From Apache Jenkins Server <jenk...@builds.apache.org>
Subject Build failed in Jenkins: HBase-2.0 » JDK 1.8 (latest),Hadoop #515
Date Fri, 15 Sep 2017 04:14:44 GMT
See <https://builds.apache.org/job/HBase-2.0/jdk=JDK%201.8%20(latest),label=Hadoop/515/display/redirect?page=changes>

Changes:

[stack] HBASE-18766 Make TableSnapshotScanner Audience Private

[stack] HBASE-17351 Enforcer plugin fails with NullPointerException

------------------------------------------
[...truncated 1.01 MB...]
[INFO] --- maven-archetype-plugin:2.4:jar (default-jar) @ hbase-client-project-archetype ---
[INFO] Building archetype jar: <https://builds.apache.org/job/HBase-2.0/jdk=JDK%201.8%20(latest),label=Hadoop/ws/hbase-archetypes/hbase-client-project/target/build-archetype/target/generated-sources/archetype/target/hbase-client-project-archetype-2.0.0-alpha3>
[INFO] ------------------------------------------------------------------------
[INFO] BUILD SUCCESS
[INFO] ------------------------------------------------------------------------
[INFO] Total time: 1.544s
[INFO] Finished at: Fri Sep 15 04:06:36 UTC 2017
[INFO] Final Memory: 20M/724M
[INFO] ------------------------------------------------------------------------
[INFO] Archetype project created in <https://builds.apache.org/job/HBase-2.0/jdk=JDK%201.8%20(latest),label=Hadoop/ws/hbase-archetypes/hbase-client-project/target/build-archetype/target/generated-sources/archetype>
[INFO] ------------------------------------------------------------------------
[INFO] BUILD SUCCESS
[INFO] ------------------------------------------------------------------------
[INFO] Total time: 4.910s
[INFO] Finished at: Fri Sep 15 04:06:36 UTC 2017
[INFO] Final Memory: 21M/724M
[INFO] ------------------------------------------------------------------------
[INFO] Scanning for projects...
[INFO]                                                                         
[INFO] ------------------------------------------------------------------------
[INFO] Building Apache HBase - Exemplar for hbase-shaded-client archetype 2.0.0-alpha3
[INFO] ------------------------------------------------------------------------
[INFO] 
[INFO] >>> maven-archetype-plugin:2.4:create-from-project (default-cli) @ hbase-shaded-client-project
>>>
[INFO] 
[INFO] <<< maven-archetype-plugin:2.4:create-from-project (default-cli) @ hbase-shaded-client-project
<<<
[INFO] 
[INFO] --- maven-archetype-plugin:2.4:create-from-project (default-cli) @ hbase-shaded-client-project
---
[INFO] Setting default groupId: org.apache.hbase
[INFO] Setting default artifactId: hbase-shaded-client-project
[INFO] Setting default version: 2.0.0-alpha3
[INFO] Setting default package: org.apache.hbase.archetypes.exemplars.shaded_client
[INFO] Scanning for projects...
[INFO]                                                                         
[INFO] ------------------------------------------------------------------------
[INFO] Building hbase-shaded-client-project-archetype 2.0.0-alpha3
[INFO] ------------------------------------------------------------------------
[INFO] 
[INFO] --- maven-resources-plugin:3.0.1:resources (default-resources) @ hbase-shaded-client-project-archetype
---
[WARNING] Using platform encoding (ISO-8859-1 actually) to copy filtered resources, i.e. build
is platform dependent!
[INFO] Copying 6 resources
[INFO] 
[INFO] --- maven-resources-plugin:3.0.1:testResources (default-testResources) @ hbase-shaded-client-project-archetype
---
[WARNING] Using platform encoding (ISO-8859-1 actually) to copy filtered resources, i.e. build
is platform dependent!
[INFO] Copying 2 resources
[INFO] 
[INFO] --- maven-archetype-plugin:2.4:jar (default-jar) @ hbase-shaded-client-project-archetype
---
[INFO] Building archetype jar: <https://builds.apache.org/job/HBase-2.0/jdk=JDK%201.8%20(latest),label=Hadoop/ws/hbase-archetypes/hbase-shaded-client-project/target/build-archetype/target/generated-sources/archetype/target/hbase-shaded-client-project-archetype-2.0.0-alpha3>
[INFO] ------------------------------------------------------------------------
[INFO] BUILD SUCCESS
[INFO] ------------------------------------------------------------------------
[INFO] Total time: 1.700s
[INFO] Finished at: Fri Sep 15 04:06:42 UTC 2017
[INFO] Final Memory: 20M/724M
[INFO] ------------------------------------------------------------------------
[INFO] Archetype project created in <https://builds.apache.org/job/HBase-2.0/jdk=JDK%201.8%20(latest),label=Hadoop/ws/hbase-archetypes/hbase-shaded-client-project/target/build-archetype/target/generated-sources/archetype>
[INFO] ------------------------------------------------------------------------
[INFO] BUILD SUCCESS
[INFO] ------------------------------------------------------------------------
[INFO] Total time: 4.888s
[INFO] Finished at: Fri Sep 15 04:06:43 UTC 2017
[INFO] Final Memory: 21M/724M
[INFO] ------------------------------------------------------------------------
[INFO] 
[INFO] --- maven-resources-plugin:2.7:copy-resources (hbase-client-ARCHETYPE__copy-pom-to-temp-for-xslt-processing)
@ hbase-archetype-builder ---
[INFO] Using 'UTF-8' encoding to copy filtered resources.
[INFO] Copying 1 resource
[INFO] 
[INFO] --- maven-resources-plugin:2.7:copy-resources (hbase-shaded-client-ARCHETYPE__copy-pom-to-temp-for-xslt-processing)
@ hbase-archetype-builder ---
[INFO] Using 'UTF-8' encoding to copy filtered resources.
[INFO] Copying 1 resource
[INFO] 
[INFO] --- xml-maven-plugin:1.0.1:transform (modify-archetype-pom-files-via-xslt) @ hbase-archetype-builder
---
[INFO] Transforming file: <https://builds.apache.org/job/HBase-2.0/jdk=JDK%201.8%20(latest),label=Hadoop/515/artifact/hbase-archetypes/hbase-archetype-builder/../hbase-client-project/target/temp-arch/pom.xml>
[INFO] Transformed 1 file(s).
[INFO] Transforming file: <https://builds.apache.org/job/HBase-2.0/jdk=JDK%201.8%20(latest),label=Hadoop/515/artifact/hbase-archetypes/hbase-archetype-builder/../hbase-shaded-client-project/target/temp-arch/pom.xml>
[INFO] Transformed 1 file(s).
[INFO] 
[INFO] --- maven-install-plugin:2.5.2:install (default-install) @ hbase-archetype-builder
---
[INFO] Installing <https://builds.apache.org/job/HBase-2.0/jdk=JDK%201.8%20(latest),label=Hadoop/515/artifact/hbase-archetypes/hbase-archetype-builder/pom.xml>
to /home/jenkins/.m2/repository/org/apache/hbase/hbase-archetype-builder/2.0.0-alpha3/hbase-archetype-builder-2.0.0-alpha3.pom
[INFO] 
[INFO] --- exec-maven-plugin:1.6.0:exec (run-installArchetypes-script) @ hbase-archetype-builder
---
[INFO] Scanning for projects...
[INFO]                                                                         
[INFO] ------------------------------------------------------------------------
[INFO] Building hbase-client-project-archetype 2.0.0-alpha3
[INFO] ------------------------------------------------------------------------
[INFO] 
[INFO] --- maven-resources-plugin:3.0.1:resources (default-resources) @ hbase-client-project-archetype
---
[INFO] Using 'UTF-8' encoding to copy filtered resources.
[INFO] Copying 6 resources
[INFO] 
[INFO] --- maven-resources-plugin:3.0.1:testResources (default-testResources) @ hbase-client-project-archetype
---
[INFO] Using 'UTF-8' encoding to copy filtered resources.
[INFO] Copying 2 resources
[INFO] 
[INFO] --- maven-archetype-plugin:2.4:jar (default-jar) @ hbase-client-project-archetype ---
[INFO] Building archetype jar: <https://builds.apache.org/job/HBase-2.0/jdk=JDK%201.8%20(latest),label=Hadoop/ws/hbase-archetypes/hbase-client-project/target/build-archetype/target/generated-sources/archetype/target/hbase-client-project-archetype-2.0.0-alpha3>
[INFO] 
[INFO] --- maven-archetype-plugin:2.4:integration-test (default-integration-test) @ hbase-client-project-archetype
---
[INFO] Processing Archetype IT project: basic
[INFO] ----------------------------------------------------------------------------
[INFO] Using following parameters for creating project from Archetype: hbase-client-project-archetype:2.0.0-alpha3
[INFO] ----------------------------------------------------------------------------
[INFO] Parameter: groupId, Value: archetype.it
[INFO] Parameter: artifactId, Value: basic
[INFO] Parameter: version, Value: 0.1-SNAPSHOT
[INFO] Parameter: package, Value: it.pkg
[INFO] Parameter: packageInPathFormat, Value: it/pkg
[INFO] Parameter: version, Value: 0.1-SNAPSHOT
[INFO] Parameter: package, Value: it.pkg
[INFO] Parameter: groupId, Value: archetype.it
[INFO] Parameter: artifactId, Value: basic
[INFO] project created from Archetype in dir: <https://builds.apache.org/job/HBase-2.0/jdk=JDK%201.8%20(latest),label=Hadoop/ws/hbase-archetypes/hbase-client-project/target/build-archetype/target/generated-sources/archetype/target/test-classes/projects/basic/project/basic>
[INFO] 
[INFO] --- maven-install-plugin:2.5.2:install (default-install) @ hbase-client-project-archetype
---
[INFO] Installing <https://builds.apache.org/job/HBase-2.0/jdk=JDK%201.8%20(latest),label=Hadoop/ws/hbase-archetypes/hbase-client-project/target/build-archetype/target/generated-sources/archetype/target/hbase-client-project-archetype-2.0.0-alpha3.jar>
to /home/jenkins/.m2/repository/org/apache/hbase/hbase-client-project-archetype/2.0.0-alpha3/hbase-client-project-archetype-2.0.0-alpha3.jar
[INFO] Installing <https://builds.apache.org/job/HBase-2.0/jdk=JDK%201.8%20(latest),label=Hadoop/515/artifact/hbase-archetypes/hbase-client-project/target/build-archetype/target/generated-sources/archetype/pom.xml>
to /home/jenkins/.m2/repository/org/apache/hbase/hbase-client-project-archetype/2.0.0-alpha3/hbase-client-project-archetype-2.0.0-alpha3.pom
[INFO] 
[INFO] --- maven-archetype-plugin:2.4:update-local-catalog (default-update-local-catalog)
@ hbase-client-project-archetype ---
[INFO] ------------------------------------------------------------------------
[INFO] BUILD SUCCESS
[INFO] ------------------------------------------------------------------------
[INFO] Total time: 1.687s
[INFO] Finished at: Fri Sep 15 04:06:46 UTC 2017
[INFO] Final Memory: 21M/724M
[INFO] ------------------------------------------------------------------------
[INFO] Scanning for projects...
[INFO]                                                                         
[INFO] ------------------------------------------------------------------------
[INFO] Building hbase-shaded-client-project-archetype 2.0.0-alpha3
[INFO] ------------------------------------------------------------------------
[INFO] 
[INFO] --- maven-resources-plugin:3.0.1:resources (default-resources) @ hbase-shaded-client-project-archetype
---
[INFO] Using 'UTF-8' encoding to copy filtered resources.
[INFO] Copying 6 resources
[INFO] 
[INFO] --- maven-resources-plugin:3.0.1:testResources (default-testResources) @ hbase-shaded-client-project-archetype
---
[INFO] Using 'UTF-8' encoding to copy filtered resources.
[INFO] Copying 2 resources
[INFO] 
[INFO] --- maven-archetype-plugin:2.4:jar (default-jar) @ hbase-shaded-client-project-archetype
---
[INFO] Building archetype jar: <https://builds.apache.org/job/HBase-2.0/jdk=JDK%201.8%20(latest),label=Hadoop/ws/hbase-archetypes/hbase-shaded-client-project/target/build-archetype/target/generated-sources/archetype/target/hbase-shaded-client-project-archetype-2.0.0-alpha3>
[INFO] 
[INFO] --- maven-archetype-plugin:2.4:integration-test (default-integration-test) @ hbase-shaded-client-project-archetype
---
[INFO] Processing Archetype IT project: basic
[INFO] ----------------------------------------------------------------------------
[INFO] Using following parameters for creating project from Archetype: hbase-shaded-client-project-archetype:2.0.0-alpha3
[INFO] ----------------------------------------------------------------------------
[INFO] Parameter: groupId, Value: archetype.it
[INFO] Parameter: artifactId, Value: basic
[INFO] Parameter: version, Value: 0.1-SNAPSHOT
[INFO] Parameter: package, Value: it.pkg
[INFO] Parameter: packageInPathFormat, Value: it/pkg
[INFO] Parameter: version, Value: 0.1-SNAPSHOT
[INFO] Parameter: package, Value: it.pkg
[INFO] Parameter: groupId, Value: archetype.it
[INFO] Parameter: artifactId, Value: basic
[INFO] project created from Archetype in dir: <https://builds.apache.org/job/HBase-2.0/jdk=JDK%201.8%20(latest),label=Hadoop/ws/hbase-archetypes/hbase-shaded-client-project/target/build-archetype/target/generated-sources/archetype/target/test-classes/projects/basic/project/basic>
[INFO] 
[INFO] --- maven-install-plugin:2.5.2:install (default-install) @ hbase-shaded-client-project-archetype
---
[INFO] Installing <https://builds.apache.org/job/HBase-2.0/jdk=JDK%201.8%20(latest),label=Hadoop/ws/hbase-archetypes/hbase-shaded-client-project/target/build-archetype/target/generated-sources/archetype/target/hbase-shaded-client-project-archetype-2.0.0-alpha3.jar>
to /home/jenkins/.m2/repository/org/apache/hbase/hbase-shaded-client-project-archetype/2.0.0-alpha3/hbase-shaded-client-project-archetype-2.0.0-alpha3.jar
[INFO] Installing <https://builds.apache.org/job/HBase-2.0/jdk=JDK%201.8%20(latest),label=Hadoop/515/artifact/hbase-archetypes/hbase-shaded-client-project/target/build-archetype/target/generated-sources/archetype/pom.xml>
to /home/jenkins/.m2/repository/org/apache/hbase/hbase-shaded-client-project-archetype/2.0.0-alpha3/hbase-shaded-client-project-archetype-2.0.0-alpha3.pom
[INFO] 
[INFO] --- maven-archetype-plugin:2.4:update-local-catalog (default-update-local-catalog)
@ hbase-shaded-client-project-archetype ---
[INFO] ------------------------------------------------------------------------
[INFO] BUILD SUCCESS
[INFO] ------------------------------------------------------------------------
[INFO] Total time: 1.677s
[INFO] Finished at: Fri Sep 15 04:06:49 UTC 2017
[INFO] Final Memory: 21M/724M
[INFO] ------------------------------------------------------------------------
[INFO] ------------------------------------------------------------------------
[INFO] Reactor Summary:
[INFO] 
[INFO] Apache HBase ...................................... SUCCESS [3.175s]
[INFO] Apache HBase - Checkstyle ......................... SUCCESS [0.774s]
[INFO] Apache HBase - Annotations ........................ SUCCESS [0.396s]
[INFO] Apache HBase - Build Configuration ................ SUCCESS [0.142s]
[INFO] Apache HBase - Shaded Protocol .................... SUCCESS [28.319s]
[INFO] Apache HBase - Common ............................. SUCCESS [2:18.875s]
[INFO] Apache HBase - Metrics API ........................ SUCCESS [1.980s]
[INFO] Apache HBase - Hadoop Compatibility ............... SUCCESS [13.465s]
[INFO] Apache HBase - Metrics Implementation ............. SUCCESS [7.452s]
[INFO] Apache HBase - Hadoop Two Compatibility ........... SUCCESS [18.323s]
[INFO] Apache HBase - Protocol ........................... SUCCESS [0.658s]
[INFO] Apache HBase - Client ............................. SUCCESS [2:16.597s]
[INFO] Apache HBase - Replication ........................ SUCCESS [1.312s]
[INFO] Apache HBase - Prefix Tree ........................ SUCCESS [16.108s]
[INFO] Apache HBase - Procedure .......................... SUCCESS [3:01.682s]
[INFO] Apache HBase - Resource Bundle .................... SUCCESS [0.230s]
[INFO] Apache HBase - Server ............................. SUCCESS [1:39:01.586s]
[INFO] Apache HBase - MapReduce .......................... SUCCESS [8:27.233s]
[INFO] Apache HBase - Testing Util ....................... SUCCESS [2.997s]
[INFO] Apache HBase - Thrift ............................. SUCCESS [1:28.528s]
[INFO] Apache HBase - RSGroup ............................ SUCCESS [8.888s]
[INFO] Apache HBase - Shell .............................. SUCCESS [6:47.439s]
[INFO] Apache HBase - Coprocessor Endpoint ............... SUCCESS [2:23.231s]
[INFO] Apache HBase - Backup ............................. SUCCESS [9:15.265s]
[INFO] Apache HBase - Integration Tests .................. SUCCESS [6.953s]
[INFO] Apache HBase - Examples ........................... SUCCESS [52.870s]
[INFO] Apache HBase - Rest ............................... SUCCESS [3:42.013s]
[INFO] Apache HBase - External Block Cache ............... SUCCESS [2.751s]
[INFO] Apache HBase - Spark .............................. FAILURE [16.053s]
[INFO] Apache HBase - Spark Integration Tests ............ SKIPPED
[INFO] Apache HBase - Assembly ........................... SKIPPED
[INFO] Apache HBase - Shaded ............................. SUCCESS [0.291s]
[INFO] Apache HBase - Shaded - Client .................... SUCCESS [1.528s]
[INFO] Apache HBase - Shaded - MapReduce ................. SUCCESS [2.090s]
[INFO] Apache HBase Shaded Packaging Invariants .......... SUCCESS [2.479s]
[INFO] Apache HBase - Archetypes ......................... SUCCESS [0.055s]
[INFO] Apache HBase - Exemplar for hbase-client archetype  SUCCESS [27.629s]
[INFO] Apache HBase - Exemplar for hbase-shaded-client archetype  SUCCESS [28.460s]
[INFO] Apache HBase - Archetype builder .................. SUCCESS [20.502s]
[INFO] ------------------------------------------------------------------------
[INFO] BUILD FAILURE
[INFO] ------------------------------------------------------------------------
[INFO] Total time: 2:23:10.145s
[INFO] Finished at: Fri Sep 15 04:06:49 UTC 2017
[INFO] Final Memory: 213M/4314M
[INFO] ------------------------------------------------------------------------
[ERROR] Failed to execute goal org.scalatest:scalatest-maven-plugin:1.0:test (test) on project
hbase-spark: There are test failures -> [Help 1]
[ERROR] 
[ERROR] To see the full stack trace of the errors, re-run Maven with the -e switch.
[ERROR] Re-run Maven using the -X switch to enable full debug logging.
[ERROR] 
[ERROR] For more information about the errors and possible solutions, please read the following
articles:
[ERROR] [Help 1] http://cwiki.apache.org/confluence/display/MAVEN/MojoFailureException
[ERROR] 
[ERROR] After correcting the problems, you can resume the build with the command
[ERROR]   mvn <goals> -rf :hbase-spark
Build step 'Invoke top-level Maven targets' marked build as failure
Performing Post build task...
Match found for :.* : True
Logical operation result is TRUE
Running script  : # Run zombie detector script
./dev-support/zombie-detector.sh --jenkins ${BUILD_ID}
[a3159d73] $ /bin/bash -xe /tmp/jenkins4092418384644571275.sh
+ ./dev-support/zombie-detector.sh --jenkins 515
Fri Sep 15 04:06:52 UTC 2017 We're ok: there is no zombie test


    {color:green}+1 zombies{color}. No zombie tests found running at the end of the build.
POST BUILD TASK : SUCCESS
END OF POST BUILD TASK : 0
Archiving artifacts
Recording test results
[FINDBUGS] Skipping publisher since build result is FAILURE
[CHECKSTYLE] Skipping publisher since build result is FAILURE

Mime
View raw message